"kenteken","voertuigsoort","merk","handelsbenaming","vervaldatum_apk","datum_tenaamstelling","bruto_bpm","inrichting","aantal_zitplaatsen","eerste_kleur","tweede_kleur","aantal_cilinders","cilinderinhoud","massa_ledig_voertuig","toegestane_maximum_massa_voertuig","massa_rijklaar","maximum_massa_trekken_ongeremd","maximum_trekken_massa_geremd","datum_eerste_toelating","datum_eerste_tenaamstelling_in_nederland","wacht_op_keuren","catalogusprijs","wam_verzekerd","maximale_constructiesnelheid","laadvermogen","oplegger_geremd","aanhangwagen_autonoom_geremd","aanhangwagen_middenas_geremd","aantal_staanplaatsen","aantal_deuren","aantal_wielen","afstand_hart_koppeling_tot_achterzijde_voertuig","afstand_voorzijde_voertuig_tot_hart_koppeling","afwijkende_maximum_snelheid","lengte","breedte","europese_voertuigcategorie","europese_voertuigcategorie_toevoeging","europese_uitvoeringcategorie_toevoeging","plaats_chassisnummer","technische_max_massa_voertuig","type","type_gasinstallatie","typegoedkeuringsnummer","variant","uitvoering","volgnummer_wijziging_eu_typegoedkeuring","vermogen_massarijklaar","wielbasis","export_indicator","openstaande_terugroepactie_indicator","vervaldatum_tachograaf","taxi_indicator","maximum_massa_samenstelling","aantal_rolstoelplaatsen","maximum_ondersteunende_snelheid","jaar_laatste_registratie_tellerstand","tellerstandoordeel","code_toelichting_tellerstandoordeel","tenaamstellen_mogelijk","vervaldatum_apk_dt","datum_tenaamstelling_dt","datum_eerste_toelating_dt","datum_eerste_tenaamstelling_in_nederland_dt","vervaldatum_tachograaf_dt","maximum_last_onder_de_vooras_sen_tezamen_koppeling","type_remsysteem_voertuig_code","rupsonderstelconfiguratiecode","wielbasis_voertuig_minimum","wielbasis_voertuig_maximum","lengte_voertuig_minimum","lengte_voertuig_maximum","breedte_voertuig_minimum","breedte_voertuig_maximum","hoogte_voertuig","hoogte_voertuig_minimum","hoogte_voertuig_maximum","massa_bedrijfsklaar_minimaal","massa_bedrijfsklaar_maximaal","technisch_toelaatbaar_massa_koppelpunt","maximum_massa_technisch_maximaal","maximum_massa_technisch_minimaal","subcategorie_nederland","verticale_belasting_koppelpunt_getrokken_voertuig","zuinigheidsclassificatie","registratie_datum_goedkeuring_afschrijvingsmoment_bpm","registratie_datum_goedkeuring_afschrijvingsmoment_bpm_dt","gem_lading_wrde","aerodyn_voorz","massa_alt_aandr","verl_cab_ind","api_gekentekende_voertuigen_assen","api_gekentekende_voertuigen_brandstof","api_gekentekende_voertuigen_carrosserie","api_gekentekende_voertuigen_carrosserie_specifiek","api_gekentekende_voertuigen_voertuigklasse"
"TP559L","Personenauto","TESLA","MODEL S","20241217","20240606",,"hatchback","5","BLAUW","Niet geregistreerd",,,"2083","2600","2183",,,"20181217","20181217","Geen verstrekking in Open Data","92450","Ja",,,,,,,"5","4","0","0",,"498","196","M1",,,,"2600","002",,"e4*2007/46*0667*20","75D","B19B5N","1","0.04","296","Nee","Nee",,"Nee","0","0","0.00","2024","Logisch","00","Ja","2024-12-17T00:00:00.000","2024-06-06T00:00:00.000","2018-12-17T00:00:00.000","2018-12-17T00:00:00.000",,,,,,,,,,,"145",,,,,,,,,,,,,,,,,"https://opendata.rdw.nl/resource/3huj-srit.json","https://opendata.rdw.nl/resource/8ys7-d773.json","https://opendata.rdw.nl/resource/vezc-m2t6.json","https://opendata.rdw.nl/resource/jhie-znh9.json","https://opendata.rdw.nl/resource/kmfi-hrps.json"
"TZ397D","Personenauto","TESLA","MODEL S","20241201","20240621",,"hatchback","5","ZWART","Niet geregistreerd",,,"2216","2720","2316",,,"20181126","20181126","Geen verstrekking in Open Data","159300","Ja",,,,,,,"5","4","0","0",,"498","196","M1",,,,"2720","002",,"e4*2007/46*0667*20","100D","P21P5N","1","0.03","296","Nee","Nee",,"Nee","0","0","0.00","2024","Logisch","00","Ja","2024-12-01T00:00:00.000","2024-06-21T00:00:00.000","2018-11-26T00:00:00.000","2018-11-26T00:00:00.000",,,,,,,,,,,"145",,,,,,,,,,,,,,,,,"https://opendata.rdw.nl/resource/3huj-srit.json","https://opendata.rdw.nl/resource/8ys7-d773.json","https://opendata.rdw.nl/resource/vezc-m2t6.json","https://opendata.rdw.nl/resource/jhie-znh9.json","https://opendata.rdw.nl/resource/kmfi-hrps.json"
"XF347D","Personenauto","TESLA","MODEL S","20260621","20240116",,"hatchback","5","ZWART","Niet geregistreerd",,,"2083","2600","2183",,,"20181217","20181217","Geen verstrekking in Open Data","105050","Ja",,,,,,,"5","4","0","0",,"498","196","M1",,,,"2600","002",,"e4*2007/46*0667*20","75D","B21B5N","1","0.04","296","Nee","Nee",,"Nee","0","0","0.00","2024","Logisch","00","Ja","2026-06-21T00:00:00.000","2024-01-16T00:00:00.000","2018-12-17T00:00:00.000","2018-12-17T00:00:00.000",,,,,,,,,,,"145",,,,,,,,,,,,,,,,,"https://opendata.rdw.nl/resource/3huj-srit.json","https://opendata.rdw.nl/resource/8ys7-d773.json","https://opendata.rdw.nl/resource/vezc-m2t6.json","https://opendata.rdw.nl/resource/jhie-znh9.json","https://opendata.rdw.nl/resource/kmfi-hrps.json"
"XG349G","Personenauto","TESLA","MODEL S","20241227","20240621",,"hatchback","5","BLAUW","Niet geregistreerd",,,"2083","2600","2183",,,"20181227","20181227","Geen verstrekking in Open Data","96000","Ja",,,,,,,"5","4","0","0",,"498","196","M1",,,,"2600","002",,"e4*2007/46*0667*20","75D","B19B5N","1","0.04","296","Nee","Nee",,"Nee","0","0","0.00","2024","Logisch","00","Ja","2024-12-27T00:00:00.000","2024-06-21T00:00:00.000","2018-12-27T00:00:00.000","2018-12-27T00:00:00.000",,,,,,,,,,,"145",,,,,,,,,,,,,,,,,"https://opendata.rdw.nl/resource/3huj-srit.json","https://opendata.rdw.nl/resource/8ys7-d773.json","https://opendata.rdw.nl/resource/vezc-m2t6.json","https://opendata.rdw.nl/resource/jhie-znh9.json","https://opendata.rdw.nl/resource/kmfi-hrps.json"
"XL036J","Personenauto","TESLA","MODEL S","20250128","20190621",,"hatchback","5","ROOD","Niet geregistreerd",,,"2190","2694","2290",,,"20190128","20190128","Geen verstrekking in Open Data","130350","Ja",,,,,,,"5","4","0","0",,"498","196","M1",,,,"2694","002",,"e4*2007/46*0667*20","100D","B21B5N","1","0.03","296","Nee","Nee",,"Nee","0","0","0.00","2024","Logisch","00","Ja","2025-01-28T00:00:00.000","2019-06-21T00:00:00.000","2019-01-28T00:00:00.000","2019-01-28T00:00:00.000",,,,,,,,,,,"145",,,,,,,,,,,,,,,,,"https://opendata.rdw.nl/resource/3huj-srit.json","https://opendata.rdw.nl/resource/8ys7-d773.json","https://opendata.rdw.nl/resource/vezc-m2t6.json","https://opendata.rdw.nl/resource/jhie-znh9.json","https://opendata.rdw.nl/resource/kmfi-hrps.json"
"XG749L","Personenauto","TESLA","MODEL S","20241227","20240622",,"hatchback","5","ZWART","Niet geregistreerd",,,"2083","2600","2183",,,"20181227","20181227","Geen verstrekking in Open Data","94400","Ja",,,,,,,"5","4","0","0",,"498","196","M1",,,,"2600","002",,"e4*2007/46*0667*20","75D","B19B5N","1","0.04","296","Nee","Nee",,"Nee","0","0","0.00","2024","Logisch","00","Ja","2024-12-27T00:00:00.000","2024-06-22T00:00:00.000","2018-12-27T00:00:00.000","2018-12-27T00:00:00.000",,,,,,,,,,,"145",,,,,,,,,,,,,,,,,"https://opendata.rdw.nl/resource/3huj-srit.json","https://opendata.rdw.nl/resource/8ys7-d773.json","https://opendata.rdw.nl/resource/vezc-m2t6.json","https://opendata.rdw.nl/resource/jhie-znh9.json","https://opendata.rdw.nl/resource/kmfi-hrps.json"
"TP971V","Personenauto","TESLA","MODEL S","20240928","20240222",,"hatchback","5","WIT","Niet geregistreerd",,,"2190","2694","2290",,,"20180928","20180928","Geen verstrekking in Open Data","125100","Ja",,,,,,,"5","4","0","0",,"498","196","M1",,,,"2694","002",,"e4*2007/46*0667*20","100D","B19B5N","1","0.03","296","Nee","Nee",,"Nee","0","0","0.00","2024","Logisch","00","Ja","2024-09-28T00:00:00.000","2024-02-22T00:00:00.000","2018-09-28T00:00:00.000","2018-09-28T00:00:00.000",,,,,,,,,,,"145",,,,,,,,,,,,,,,,,"https://opendata.rdw.nl/resource/3huj-srit.json","https://opendata.rdw.nl/resource/8ys7-d773.json","https://opendata.rdw.nl/resource/vezc-m2t6.json","https://opendata.rdw.nl/resource/jhie-znh9.json","https://opendata.rdw.nl/resource/kmfi-hrps.json"
"SP812B","Personenauto","TESLA","MODEL S","20260528","20230721",,"hatchback","5","GRIJS","Niet geregistreerd",,,"2190","2694","2290",,,"20180524","20180524","Geen verstrekking in Open Data","124050","Ja",,,,,,,"5","4","0","0",,"498","196","M1",,,,"2694","002",,"e4*2007/46*0667*20","100D","B21B5N","0","0.03","296","Nee","Nee",,"Nee","0","0","0.00","2024","Logisch","00","Ja","2026-05-28T00:00:00.000","2023-07-21T00:00:00.000","2018-05-24T00:00:00.000","2018-05-24T00:00:00.000",,,,,,,,,,,"145",,,,,,,,,,,,,,,,,"https://opendata.rdw.nl/resource/3huj-srit.json","https://opendata.rdw.nl/resource/8ys7-d773.json","https://opendata.rdw.nl/resource/vezc-m2t6.json","https://opendata.rdw.nl/resource/jhie-znh9.json","https://opendata.rdw.nl/resource/kmfi-hrps.json"
"RK404D","Personenauto","TESLA","MODEL S","20231215","20220727",,"hatchback","5","ZWART","Niet geregistreerd",,,"2002","2590","2102",,,"20171215","20171215","Geen verstrekking in Open Data","92750","Ja",,,,,,,"5","4","0","0",,"498","196","M1",,,"op r. balk","2590","002",,"e4*2007/46*0667*18","75R","P19B5N","0","0.04","296","Nee","Nee",,"Nee","0","0","0.00","2024","Logisch","00","Ja","2023-12-15T00:00:00.000","2022-07-27T00:00:00.000","2017-12-15T00:00:00.000","2017-12-15T00:00:00.000",,,,,,,,,,,"145",,,,,,,,,,,,,,,,,"https://opendata.rdw.nl/resource/3huj-srit.json","https://opendata.rdw.nl/resource/8ys7-d773.json","https://opendata.rdw.nl/resource/vezc-m2t6.json","https://opendata.rdw.nl/resource/jhie-znh9.json","https://opendata.rdw.nl/resource/kmfi-hrps.json"
"SV596N","Personenauto","TESLA","MODEL S","20260612","20180612",,"hatchback","5","GRIJS","Niet geregistreerd",,,"2083","2600","2183",,,"20180612","20180612","Geen verstrekking in Open Data","92450","Ja",,,,,,,"5","4","0","0",,"498","196","M1",,,,"2600","002",,"e4*2007/46*0667*20","75D","B19B5N","1","0.04","296","Nee","Nee",,"Nee","0","0","0.00","2024","Logisch","00","Ja","2026-06-12T00:00:00.000","2018-06-12T00:00:00.000","2018-06-12T00:00:00.000","2018-06-12T00:00:00.000",,,,,,,,,,,"145",,,,,,,,,,,,,,,,,"https://opendata.rdw.nl/resource/3huj-srit.json","https://opendata.rdw.nl/resource/8ys7-d773.json","https://opendata.rdw.nl/resource/vezc-m2t6.json","https://opendata.rdw.nl/resource/jhie-znh9.json","https://opendata.rdw.nl/resource/kmfi-hrps.json"
"XB605G","Personenauto","TESLA","MODEL S","20241227","20240528",,"hatchback","5","WIT","Niet geregistreerd",,,"2190","2694","2290",,,"20181227","20181227","Geen verstrekking in Open Data","120800","Ja",,,,,,,"5","4","0","0",,"498","196","M1",,,,"2694","002",,"e4*2007/46*0667*20","100D","B19B5N","1","0.03","296","Nee","Nee",,"Nee","0","0","0.00","2024","Logisch","00","Ja","2024-12-27T00:00:00.000","2024-05-28T00:00:00.000","2018-12-27T00:00:00.000","2018-12-27T00:00:00.000",,,,,,,,,,,"145",,,,,,,,,,,,,,,,,"https://opendata.rdw.nl/resource/3huj-srit.json","https://opendata.rdw.nl/resource/8ys7-d773.json","https://opendata.rdw.nl/resource/vezc-m2t6.json","https://opendata.rdw.nl/resource/jhie-znh9.json","https://opendata.rdw.nl/resource/kmfi-hrps.json"
"XF867Z","Personenauto","TESLA","MODEL S","20250117","20240528",,"hatchback","5","ZWART","Niet geregistreerd",,,"2083","2600","2183",,,"20181227","20181227","Geen verstrekking in Open Data","94400","Ja",,,,,,,"5","4","0","0",,"498","196","M1",,,,"2600","002",,"e4*2007/46*0667*20","75D","B19B5N","1","0.04","296","Nee","Nee",,"Nee","0","0","0.00","2024","Logisch","00","Ja","2025-01-17T00:00:00.000","2024-05-28T00:00:00.000","2018-12-27T00:00:00.000","2018-12-27T00:00:00.000",,,,,,,,,,,"145",,,,,,,,,,,,,,,,,"https://opendata.rdw.nl/resource/3huj-srit.json","https://opendata.rdw.nl/resource/8ys7-d773.json","https://opendata.rdw.nl/resource/vezc-m2t6.json","https://opendata.rdw.nl/resource/jhie-znh9.json","https://opendata.rdw.nl/resource/kmfi-hrps.json"
"XG290K","Personenauto","TESLA","MODEL S","20250206","20240606",,"hatchback","5","GRIJS","Niet geregistreerd",,,"2190","2694","2290",,,"20181224","20181224","Geen verstrekking in Open Data","122700","Ja",,,,,,,"5","4","0","0",,"498","196","M1",,,,"2694","002",,"e4*2007/46*0667*20","100D","B19B5N","1","0.03","296","Nee","Nee",,"Nee","0","0","0.00","2024","Logisch","00","Ja","2025-02-06T00:00:00.000","2024-06-06T00:00:00.000","2018-12-24T00:00:00.000","2018-12-24T00:00:00.000",,,,,,,,,,,"145",,,,,,,,,,,,,,,,,"https://opendata.rdw.nl/resource/3huj-srit.json","https://opendata.rdw.nl/resource/8ys7-d773.json","https://opendata.rdw.nl/resource/vezc-m2t6.json","https://opendata.rdw.nl/resource/jhie-znh9.json","https://opendata.rdw.nl/resource/kmfi-hrps.json"
"XG292K","Personenauto","TESLA","MODEL S","20241222","20240513",,"hatchback","5","GRIJS","Niet geregistreerd",,,"2083","2600","2183",,,"20181222","20181222","Geen verstrekking in Open Data","101600","Ja",,,,,,,"5","4","0","0",,"498","196","M1",,,,"2600","002",,"e4*2007/46*0667*20","75D","B19B5N","1","0.04","296","Nee","Nee",,"Nee","0","0","0.00","2024","Logisch","00","Ja","2024-12-22T00:00:00.000","2024-05-13T00:00:00.000","2018-12-22T00:00:00.000","2018-12-22T00:00:00.000",,,,,,,,,,,"145",,,,,,,,,,,,,,,,,"https://opendata.rdw.nl/resource/3huj-srit.json","https://opendata.rdw.nl/resource/8ys7-d773.json","https://opendata.rdw.nl/resource/vezc-m2t6.json","https://opendata.rdw.nl/resource/jhie-znh9.json","https://opendata.rdw.nl/resource/kmfi-hrps.json"
"SZ177B","Personenauto","TESLA","MODEL S","20240803","20180623",,"hatchback","5","ZWART","Niet geregistreerd",,,"2190","2694","2290",,,"20180623","20180623","Geen verstrekking in Open Data","125600","Ja",,,,,,,"5","4","0","0",,"498","196","M1",,,,"2694","002",,"e4*2007/46*0667*20","100D","B19B5N","1","0.03","296","Nee","Nee",,"Nee","0","0","0.00","2024","Logisch","00","Ja","2024-08-03T00:00:00.000","2018-06-23T00:00:00.000","2018-06-23T00:00:00.000","2018-06-23T00:00:00.000",,,,,,,,,,,"145",,,,,,,,,,,,,,,,,"https://opendata.rdw.nl/resource/3huj-srit.json","https://opendata.rdw.nl/resource/8ys7-d773.json","https://opendata.rdw.nl/resource/vezc-m2t6.json","https://opendata.rdw.nl/resource/jhie-znh9.json","https://opendata.rdw.nl/resource/kmfi-hrps.json"
"TK737G","Personenauto","TESLA","MODEL S","20260824","20180824",,"hatchback","5","GRIJS","Niet geregistreerd",,,"2083","2600","2183",,,"20180824","20180824","Geen verstrekking in Open Data","99850","Ja",,,,,,,"5","4","0","0",,"498","196","M1",,,,"2600","002",,"e4*2007/46*0667*20","75D","B19B5N","1","0.04","296","Nee","Nee",,"Nee","0","0","0.00","2024","Logisch","00","Ja","2026-08-24T00:00:00.000","2018-08-24T00:00:00.000","2018-08-24T00:00:00.000","2018-08-24T00:00:00.000",,,,,,,,,,,"145",,,,,,,,,,,,,,,,,"https://opendata.rdw.nl/resource/3huj-srit.json","https://opendata.rdw.nl/resource/8ys7-d773.json","https://opendata.rdw.nl/resource/vezc-m2t6.json","https://opendata.rdw.nl/resource/jhie-znh9.json","https://opendata.rdw.nl/resource/kmfi-hrps.json"
"SX200R","Personenauto","TESLA","MODEL S","20260625","20180622",,"hatchback","5","GRIJS","Niet geregistreerd",,,"2190","2694","2290",,,"20180622","20180622","Geen verstrekking in Open Data","131450","Ja",,,,,,,"5","4","0","0",,"498","196","M1",,,,"2694","002",,"e4*2007/46*0667*20","100D","B21B5N","1","0.03","296","Nee","Nee",,"Nee","0","0","0.00","2024","Logisch","00","Ja","2026-06-25T00:00:00.000","2018-06-22T00:00:00.000","2018-06-22T00:00:00.000","2018-06-22T00:00:00.000",,,,,,,,,,,"145",,,,,,,,,,,,,,,,,"https://opendata.rdw.nl/resource/3huj-srit.json","https://opendata.rdw.nl/resource/8ys7-d773.json","https://opendata.rdw.nl/resource/vezc-m2t6.json","https://opendata.rdw.nl/resource/jhie-znh9.json","https://opendata.rdw.nl/resource/kmfi-hrps.json"
"GDP59B","Personenauto","TESLA","MODEL S",,"20240629",,"hatchback","5","GRIJS","Niet geregistreerd",,,"2070","2534","2170","750","1600","20240629","20240629","Geen verstrekking in Open Data","98090","Nee","250",,,,,,"5","4",,,,"502","199","M1",,,,"2534","004",,"e4*2018/858*00086*10","SB1D","B1T1S5M1C2","0","0.10","296","Nee","Nee",,"Nee","4134",,,"2024","Logisch","00","Ja",,"2024-06-29T00:00:00.000","2024-06-29T00:00:00.000","2024-06-29T00:00:00.000",,,,,,,,,,,"143",,,,,,,,,,,"20240625","2024-06-25T00:00:00.000",,,,,"https://opendata.rdw.nl/resource/3huj-srit.json","https://opendata.rdw.nl/resource/8ys7-d773.json","https://opendata.rdw.nl/resource/vezc-m2t6.json","https://opendata.rdw.nl/resource/jhie-znh9.json","https://opendata.rdw.nl/resource/kmfi-hrps.json"
"XG553B","Personenauto","TESLA","MODEL S","20241227","20240108",,"hatchback","5","ZWART","Niet geregistreerd",,,"2083","2600","2183",,,"20181227","20181227","Geen verstrekking in Open Data","100250","Ja",,,,,,,"5","4","0","0",,"498","196","M1",,,,"2600","002",,"e4*2007/46*0667*20","75D","B19B5N","1","0.04","296","Nee","Nee",,"Nee","0","0","0.00","2024","Logisch","00","Ja","2024-12-27T00:00:00.000","2024-01-08T00:00:00.000","2018-12-27T00:00:00.000","2018-12-27T00:00:00.000",,,,,,,,,,,"145",,,,,,,,,,,,,,,,,"https://opendata.rdw.nl/resource/3huj-srit.json","https://opendata.rdw.nl/resource/8ys7-d773.json","https://opendata.rdw.nl/resource/vezc-m2t6.json","https://opendata.rdw.nl/resource/jhie-znh9.json","https://opendata.rdw.nl/resource/kmfi-hrps.json"
"GDR30Z","Personenauto","TESLA","MODEL S",,"20240629",,"hatchback","5","ZWART","Niet geregistreerd",,,"2165","2629","2265","750","1600","20240629","20240629","Geen verstrekking in Open Data","114490","Nee","280",,,,,,"5","4",,,,"502","199","M1",,,,"2629","004",,"e4*2018/858*00086*10","SB1T","B1T1S5M2C2","0","0.16","296","Nee","Nee",,"Nee","4229",,,"2024","Logisch","00","Ja",,"2024-06-29T00:00:00.000","2024-06-29T00:00:00.000","2024-06-29T00:00:00.000",,,,,,,,,,,"143",,,,,,,,,,,"20240626","2024-06-26T00:00:00.000",,,,,"https://opendata.rdw.nl/resource/3huj-srit.json","https://opendata.rdw.nl/resource/8ys7-d773.json","https://opendata.rdw.nl/resource/vezc-m2t6.json","https://opendata.rdw.nl/resource/jhie-znh9.json","https://opendata.rdw.nl/resource/kmfi-hrps.json"
"GDR31Z","Personenauto","TESLA","MODEL S",,,,"hatchback","5","BLAUW","Niet geregistreerd",,,"2165","2629","2265","750","1600",,,"Geen verstrekking in Open Data","109590","Nee","280",,,,,,"5","4",,,,"502","199","M1",,,,"2629","004",,"e4*2018/858*00086*10","SB1T","B1T1S5M2C2","0","0.16","296","Nee","Nee",,"Nee","4229",,,,"Niet geregistreerd","NG","Ja",,,,,,,,,,,,,,,"143",,,,,,,,,,,"20240626","2024-06-26T00:00:00.000",,,,,"https://opendata.rdw.nl/resource/3huj-srit.json","https://opendata.rdw.nl/resource/8ys7-d773.json","https://opendata.rdw.nl/resource/vezc-m2t6.json","https://opendata.rdw.nl/resource/jhie-znh9.json","https://opendata.rdw.nl/resource/kmfi-hrps.json"
"GDR32Z","Personenauto","TESLA","MODEL S",,,,"hatchback","5","ZWART","Niet geregistreerd",,,"2165","2629","2265","750","1600",,,"Geen verstrekking in Open Data","122990","Nee","280",,,,,,"5","4",,,,"502","199","M1",,,,"2629","004",,"e4*2018/858*00086*10","SB1T","B1T1S5M2C2","0","0.16","296","Nee","Nee",,"Nee","4229",,,,"Niet geregistreerd","NG","Ja",,,,,,,,,,,,,,,"143",,,,,,,,,,,"20240626","2024-06-26T00:00:00.000",,,,,"https://opendata.rdw.nl/resource/3huj-srit.json","https://opendata.rdw.nl/resource/8ys7-d773.json","https://opendata.rdw.nl/resource/vezc-m2t6.json","https://opendata.rdw.nl/resource/jhie-znh9.json","https://opendata.rdw.nl/resource/kmfi-hrps.json"
"GDR34Z","Personenauto","TESLA","MODEL S",,,,"hatchback","5","ZWART","Niet geregistreerd",,,"2070","2534","2170","750","1600",,,"Geen verstrekking in Open Data","98490","Nee","250",,,,,,"5","4",,,,"502","199","M1",,,,"2534","004",,"e4*2018/858*00086*10","SB1D","B1T1S5M1C2","0","0.10","296","Nee","Nee",,"Nee","4134",,,,"Niet geregistreerd","NG","Ja",,,,,,,,,,,,,,,"143",,,,,,,,,,,"20240626","2024-06-26T00:00:00.000",,,,,"https://opendata.rdw.nl/resource/3huj-srit.json","https://opendata.rdw.nl/resource/8ys7-d773.json","https://opendata.rdw.nl/resource/vezc-m2t6.json","https://opendata.rdw.nl/resource/jhie-znh9.json","https://opendata.rdw.nl/resource/kmfi-hrps.json"
"GDR35Z","Personenauto","TESLA","MODEL S",,,,"hatchback","5","ROOD","Niet geregistreerd",,,"2070","2534","2170","750","1600",,,"Geen verstrekking in Open Data","105590","Ja","250",,,,,,"5","4",,,,"502","199","M1",,,,"2534","004",,"e4*2018/858*00086*10","SB1D","B1T1S5M1C2","0","0.10","296","Nee","Nee",,"Nee","4134",,,,"Niet geregistreerd","NG","Ja",,,,,,,,,,,,,,,"143",,,,,,,,,,,"20240626","2024-06-26T00:00:00.000",,,,,"https://opendata.rdw.nl/resource/3huj-srit.json","https://opendata.rdw.nl/resource/8ys7-d773.json","https://opendata.rdw.nl/resource/vezc-m2t6.json","https://opendata.rdw.nl/resource/jhie-znh9.json","https://opendata.rdw.nl/resource/kmfi-hrps.json"
"GDR37Z","Personenauto","TESLA","MODEL S",,"20240629",,"hatchback","5","GRIJS","Niet geregistreerd",,,"2070","2534","2170","750","1600","20240629","20240629","Geen verstrekking in Open Data","95590","Nee","250",,,,,,"5","4",,,,"502","199","M1",,,,"2534","004",,"e4*2018/858*00086*10","SB1D","B1T1S5M1C2","0","0.10","296","Nee","Nee",,"Nee","4134",,,"2024","Logisch","00","Ja",,"2024-06-29T00:00:00.000","2024-06-29T00:00:00.000","2024-06-29T00:00:00.000",,,,,,,,,,,"143",,,,,,,,,,,"20240626","2024-06-26T00:00:00.000",,,,,"https://opendata.rdw.nl/resource/3huj-srit.json","https://opendata.rdw.nl/resource/8ys7-d773.json","https://opendata.rdw.nl/resource/vezc-m2t6.json","https://opendata.rdw.nl/resource/jhie-znh9.json","https://opendata.rdw.nl/resource/kmfi-hrps.json"
"GDR39Z","Personenauto","TESLA","MODEL S",,"20240629",,"hatchback","5","GRIJS","Niet geregistreerd",,,"2070","2534","2170","750","1600","20240629","20240629","Geen verstrekking in Open Data","110490","Nee","250",,,,,,"5","4",,,,"502","199","M1",,,,"2534","004",,"e4*2018/858*00086*10","SB1D","B1T1S5M1C2","0","0.10","296","Nee","Nee",,"Nee","4134",,,"2024","Logisch","00","Ja",,"2024-06-29T00:00:00.000","2024-06-29T00:00:00.000","2024-06-29T00:00:00.000",,,,,,,,,,,"143",,,,,,,,,,,"20240626","2024-06-26T00:00:00.000",,,,,"https://opendata.rdw.nl/resource/3huj-srit.json","https://opendata.rdw.nl/resource/8ys7-d773.json","https://opendata.rdw.nl/resource/vezc-m2t6.json","https://opendata.rdw.nl/resource/jhie-znh9.json","https://opendata.rdw.nl/resource/kmfi-hrps.json"
"GDR40Z","Personenauto","TESLA","MODEL S",,,,"hatchback","5","ZWART","Niet geregistreerd",,,"2070","2534","2170","750","1600",,,"Geen verstrekking in Open Data","94590","Nee","250",,,,,,"5","4",,,,"502","199","M1",,,,"2534","004",,"e4*2018/858*00086*10","SB1D","B1T1S5M1C2","0","0.10","296","Nee","Nee",,"Nee","4134",,,,"Niet geregistreerd","NG","Ja",,,,,,,,,,,,,,,"143",,,,,,,,,,,"20240626","2024-06-26T00:00:00.000",,,,,"https://opendata.rdw.nl/resource/3huj-srit.json","https://opendata.rdw.nl/resource/8ys7-d773.json","https://opendata.rdw.nl/resource/vezc-m2t6.json","https://opendata.rdw.nl/resource/jhie-znh9.json","https://opendata.rdw.nl/resource/kmfi-hrps.json"
"GDR41Z","Personenauto","TESLA","MODEL S",,,,"hatchback","5","ZWART","Niet geregistreerd",,,"2070","2534","2170","750","1600",,,"Geen verstrekking in Open Data","102090","Nee","250",,,,,,"5","4",,,,"502","199","M1",,,,"2534","004",,"e4*2018/858*00086*08","SB1D","B1T1S5M1C2","0","0.10","296","Nee","Nee",,"Nee","4134",,,,"Niet geregistreerd","NG","Ja",,,,,,,,,,,,,,,"143",,,,,,,,,,,"20240626","2024-06-26T00:00:00.000",,,,,"https://opendata.rdw.nl/resource/3huj-srit.json","https://opendata.rdw.nl/resource/8ys7-d773.json","https://opendata.rdw.nl/resource/vezc-m2t6.json","https://opendata.rdw.nl/resource/jhie-znh9.json","https://opendata.rdw.nl/resource/kmfi-hrps.json"