"kenteken","voertuigsoort","merk","handelsbenaming","vervaldatum_apk","datum_tenaamstelling","bruto_bpm","inrichting","aantal_zitplaatsen","eerste_kleur","tweede_kleur","aantal_cilinders","cilinderinhoud","massa_ledig_voertuig","toegestane_maximum_massa_voertuig","massa_rijklaar","maximum_massa_trekken_ongeremd","maximum_trekken_massa_geremd","datum_eerste_toelating","datum_eerste_tenaamstelling_in_nederland","wacht_op_keuren","catalogusprijs","wam_verzekerd","maximale_constructiesnelheid","laadvermogen","oplegger_geremd","aanhangwagen_autonoom_geremd","aanhangwagen_middenas_geremd","aantal_staanplaatsen","aantal_deuren","aantal_wielen","afstand_hart_koppeling_tot_achterzijde_voertuig","afstand_voorzijde_voertuig_tot_hart_koppeling","afwijkende_maximum_snelheid","lengte","breedte","europese_voertuigcategorie","europese_voertuigcategorie_toevoeging","europese_uitvoeringcategorie_toevoeging","plaats_chassisnummer","technische_max_massa_voertuig","type","type_gasinstallatie","typegoedkeuringsnummer","variant","uitvoering","volgnummer_wijziging_eu_typegoedkeuring","vermogen_massarijklaar","wielbasis","export_indicator","openstaande_terugroepactie_indicator","vervaldatum_tachograaf","taxi_indicator","maximum_massa_samenstelling","aantal_rolstoelplaatsen","maximum_ondersteunende_snelheid","jaar_laatste_registratie_tellerstand","tellerstandoordeel","code_toelichting_tellerstandoordeel","tenaamstellen_mogelijk","vervaldatum_apk_dt","datum_tenaamstelling_dt","datum_eerste_toelating_dt","datum_eerste_tenaamstelling_in_nederland_dt","vervaldatum_tachograaf_dt","maximum_last_onder_de_vooras_sen_tezamen_koppeling","type_remsysteem_voertuig_code","rupsonderstelconfiguratiecode","wielbasis_voertuig_minimum","wielbasis_voertuig_maximum","lengte_voertuig_minimum","lengte_voertuig_maximum","breedte_voertuig_minimum","breedte_voertuig_maximum","hoogte_voertuig","hoogte_voertuig_minimum","hoogte_voertuig_maximum","massa_bedrijfsklaar_minimaal","massa_bedrijfsklaar_maximaal","technisch_toelaatbaar_massa_koppelpunt","maximum_massa_technisch_maximaal","maximum_massa_technisch_minimaal","subcategorie_nederland","verticale_belasting_koppelpunt_getrokken_voertuig","zuinigheidsclassificatie","registratie_datum_goedkeuring_afschrijvingsmoment_bpm","registratie_datum_goedkeuring_afschrijvingsmoment_bpm_dt","gem_lading_wrde","aerodyn_voorz","massa_alt_aandr","verl_cab_ind","api_gekentekende_voertuigen_assen","api_gekentekende_voertuigen_brandstof","api_gekentekende_voertuigen_carrosserie","api_gekentekende_voertuigen_carrosserie_specifiek","api_gekentekende_voertuigen_voertuigklasse"
"FBBD58","Personenauto","SUZUKI","SWIFT 1.3 GL AUTOMATIC U9","20230212","19920427",,"hatchback",,"WIT","Niet geregistreerd","4","1298","770","1250","870","385","800","19920427","19920427","Geen verstrekking in Open Data",,"Nee",,,,,,,"2","4","0","0",,"0","0","M1",,,"tegen schutbord onder motorkap","1250",,,,,,"0","0.06","227","Nee","Nee",,"Nee","0",,,"2022","Geen oordeel","01","Ja","2023-02-12T00:00:00.000","1992-04-27T00:00:00.000","1992-04-27T00:00:00.000","1992-04-27T00:00:00.000",,,,,,,,,,,,,,,,,,,,,,,,,,,,"https://opendata.rdw.nl/resource/3huj-srit.json","https://opendata.rdw.nl/resource/8ys7-d773.json","https://opendata.rdw.nl/resource/vezc-m2t6.json","https://opendata.rdw.nl/resource/jhie-znh9.json","https://opendata.rdw.nl/resource/kmfi-hrps.json"
"FLGN60","Personenauto","SUZUKI","SWIFT 1.3 GL AUTOMATIC U9","20241010","20230804",,"hatchback",,"ROOD","Niet geregistreerd","4","1298","770","1250","870","385","800","19920807","19920807","Geen verstrekking in Open Data",,"Ja",,,,,,,"2","4","0","0",,"0","0","M1",,,"tegen schutbord onder motorkap","1250",,,,,,"0","0.06","227","Nee","Nee",,"Nee","0",,,"2022","Geen oordeel","01","Ja","2024-10-10T00:00:00.000","2023-08-04T00:00:00.000","1992-08-07T00:00:00.000","1992-08-07T00:00:00.000",,,,,,,,,,,,,,,,,,,,,,,,,,,,"https://opendata.rdw.nl/resource/3huj-srit.json","https://opendata.rdw.nl/resource/8ys7-d773.json","https://opendata.rdw.nl/resource/vezc-m2t6.json","https://opendata.rdw.nl/resource/jhie-znh9.json","https://opendata.rdw.nl/resource/kmfi-hrps.json"
"FLZG32","Personenauto","SUZUKI","SWIFT 1.3 GL AUTOMATIC U9","20240902","20230602",,"hatchback",,"GRIJS","Niet geregistreerd","4","1298","770","1250","870","385","800","19920902","19920902","Geen verstrekking in Open Data",,"Ja",,,,,,,"2","4","0","0",,"0","0","M1",,,"tegen schutbord onder motorkap","1250",,,,,,"0","0.06","227","Nee","Nee",,"Nee","0",,,"2022","Geen oordeel","01","Ja","2024-09-02T00:00:00.000","2023-06-02T00:00:00.000","1992-09-02T00:00:00.000","1992-09-02T00:00:00.000",,,,,,,,,,,,,,,,,,,,,,,,,,,,"https://opendata.rdw.nl/resource/3huj-srit.json","https://opendata.rdw.nl/resource/8ys7-d773.json","https://opendata.rdw.nl/resource/vezc-m2t6.json","https://opendata.rdw.nl/resource/jhie-znh9.json","https://opendata.rdw.nl/resource/kmfi-hrps.json"
"FSFG63","Personenauto","SUZUKI","SWIFT 1.3 GL AUTOMATIC U9","20241028","20230916",,"hatchback",,"ROOD","Niet geregistreerd","4","1298","770","1250","870","385","800","19921022","19921022","Geen verstrekking in Open Data",,"Ja",,,,,,,"2","4","0","0",,"0","0","M1",,,"tegen schutbord onder motorkap","1250",,,,,,"0","0.06","227","Nee","Nee",,"Nee","0",,,"2023","Geen oordeel","01","Ja","2024-10-28T00:00:00.000","2023-09-16T00:00:00.000","1992-10-22T00:00:00.000","1992-10-22T00:00:00.000",,,,,,,,,,,,,,,,,,,,,,,,,,,,"https://opendata.rdw.nl/resource/3huj-srit.json","https://opendata.rdw.nl/resource/8ys7-d773.json","https://opendata.rdw.nl/resource/vezc-m2t6.json","https://opendata.rdw.nl/resource/jhie-znh9.json","https://opendata.rdw.nl/resource/kmfi-hrps.json"
"FTNR08","Personenauto","SUZUKI","SWIFT 1.3 GL AUTOMATIC U9","20250822","20130906",,"hatchback",,"BLAUW","Niet geregistreerd","4","1298","770","1250","870","385","800","19921205","19921205","Geen verstrekking in Open Data",,"Ja",,,,,,,"2","4","0","0",,"0","0","M1",,,"tegen schutbord onder motorkap","1250",,,,,,"0","0.06","227","Nee","Nee",,"Nee","0",,,"2023","Geen oordeel","01","Ja","2025-08-22T00:00:00.000","2013-09-06T00:00:00.000","1992-12-05T00:00:00.000","1992-12-05T00:00:00.000",,,,,,,,,,,,,,,,,,,,,,,,,,,,"https://opendata.rdw.nl/resource/3huj-srit.json","https://opendata.rdw.nl/resource/8ys7-d773.json","https://opendata.rdw.nl/resource/vezc-m2t6.json","https://opendata.rdw.nl/resource/jhie-znh9.json","https://opendata.rdw.nl/resource/kmfi-hrps.json"
"GFDP73","Personenauto","SUZUKI","SWIFT 1.3 GL AUTOMATIC U9","20251109","20100118","2209","hatchback",,"BLAUW","Niet geregistreerd","4","1298","770","1250","870","385","800","19930226","19930226","Geen verstrekking in Open Data",,"Ja",,,,,,,"2","4","0","0",,"0","0","M1",,,"tegen schutbord onder motorkap","1250",,,,,,"0","0.06","227","Nee","Nee",,"Nee","0",,,"2023","Geen oordeel","01","Ja","2025-11-09T00:00:00.000","2010-01-18T00:00:00.000","1993-02-26T00:00:00.000","1993-02-26T00:00:00.000",,,,,,,,,,,,,,,,,,,,,,,,,,,,"https://opendata.rdw.nl/resource/3huj-srit.json","https://opendata.rdw.nl/resource/8ys7-d773.json","https://opendata.rdw.nl/resource/vezc-m2t6.json","https://opendata.rdw.nl/resource/jhie-znh9.json","https://opendata.rdw.nl/resource/kmfi-hrps.json"
"GGFL93","Personenauto","SUZUKI","SWIFT 1.3 GL AUTOMATIC U9","20110223",,"2022","hatchback",,"GRIJS","Niet geregistreerd","4","1298","770","1250","870","385","800","19930315","19930315","Geen verstrekking in Open Data",,"Nee",,,,,,,"2","4","0","0",,"0","0","M1",,,"tegen schutbord onder motorkap","1250",,,,,,"0","0.06","227","Nee","Nee",,"Nee","0",,,"2010","Geen oordeel","01","Ja","2011-02-23T00:00:00.000",,"1993-03-15T00:00:00.000","1993-03-15T00:00:00.000",,,,,,,,,,,,,,,,,,,,,,,,,,,,"https://opendata.rdw.nl/resource/3huj-srit.json","https://opendata.rdw.nl/resource/8ys7-d773.json","https://opendata.rdw.nl/resource/vezc-m2t6.json","https://opendata.rdw.nl/resource/jhie-znh9.json","https://opendata.rdw.nl/resource/kmfi-hrps.json"
"GGFN03","Personenauto","SUZUKI","SWIFT 1.3 GL AUTOMATIC U9","20250814","20201022","2209","hatchback",,"GRIJS","Niet geregistreerd","4","1298","770","1250","870","385","800","19930402","19930402","Geen verstrekking in Open Data",,"Ja",,,,,,,"2","4","0","0",,"0","0","M1",,,"tegen schutbord onder motorkap","1250",,,,,,"0","0.06","227","Nee","Nee",,"Nee","0",,,"2023","Geen oordeel","01","Ja","2025-08-14T00:00:00.000","2020-10-22T00:00:00.000","1993-04-02T00:00:00.000","1993-04-02T00:00:00.000",,,,,,,,,,,,,,,,,,,,,,,,,,,,"https://opendata.rdw.nl/resource/3huj-srit.json","https://opendata.rdw.nl/resource/8ys7-d773.json","https://opendata.rdw.nl/resource/vezc-m2t6.json","https://opendata.rdw.nl/resource/jhie-znh9.json","https://opendata.rdw.nl/resource/kmfi-hrps.json"
"GHXF49","Personenauto","SUZUKI","SWIFT 1.3 GL AUTOMATIC U9","20260308","20240317","2209","hatchback",,"GRIJS","Niet geregistreerd","4","1298","770","1250","870","385","800","19930409","19930409","Geen verstrekking in Open Data",,"Ja",,,,,,,"2","4","0","0",,"0","0","M1",,,"tegen schutbord onder motorkap","1250",,,,,,"0","0.06","227","Nee","Nee",,"Nee","0",,,"2024","Geen oordeel","01","Ja","2026-03-08T00:00:00.000","2024-03-17T00:00:00.000","1993-04-09T00:00:00.000","1993-04-09T00:00:00.000",,,,,,,,,,,,,,,,,,,,,,,,,,,,"https://opendata.rdw.nl/resource/3huj-srit.json","https://opendata.rdw.nl/resource/8ys7-d773.json","https://opendata.rdw.nl/resource/vezc-m2t6.json","https://opendata.rdw.nl/resource/jhie-znh9.json","https://opendata.rdw.nl/resource/kmfi-hrps.json"
"GJGH19","Personenauto","SUZUKI","SWIFT 1.3 GL AUTOMATIC U9","20251123","20190130","2068","hatchback",,"ROOD","Niet geregistreerd","4","1298","770","1250","870","385","800","19930415","19930415","Geen verstrekking in Open Data",,"Ja",,,,,,,"2","4","0","0",,"0","0","M1",,,"tegen schutbord onder motorkap","1250",,,,,,"0","0.06","227","Nee","Nee",,"Nee","0",,,"2023","Geen oordeel","01","Ja","2025-11-23T00:00:00.000","2019-01-30T00:00:00.000","1993-04-15T00:00:00.000","1993-04-15T00:00:00.000",,,,,,,,,,,,,,,,,,,,,,,,,,,,"https://opendata.rdw.nl/resource/3huj-srit.json","https://opendata.rdw.nl/resource/8ys7-d773.json","https://opendata.rdw.nl/resource/vezc-m2t6.json","https://opendata.rdw.nl/resource/jhie-znh9.json","https://opendata.rdw.nl/resource/kmfi-hrps.json"
"GJHN63","Personenauto","SUZUKI","SWIFT 1.3 GL AUTOMATIC U9","20260314","20000212","2260","hatchback",,"ROOD","Niet geregistreerd","4","1298","770","1250","870","385","800","19930416","19930416","Geen verstrekking in Open Data",,"Ja",,,,,,,"2","4","0","0",,"0","0","M1",,,"tegen schutbord onder motorkap","1250",,,,,,"0","0.06","227","Nee","Nee",,"Nee","0",,,"2024","Geen oordeel","01","Ja","2026-03-14T00:00:00.000","2000-02-12T00:00:00.000","1993-04-16T00:00:00.000","1993-04-16T00:00:00.000",,,,,,,,,,,,,,,,,,,,,,,,,,,,"https://opendata.rdw.nl/resource/3huj-srit.json","https://opendata.rdw.nl/resource/8ys7-d773.json","https://opendata.rdw.nl/resource/vezc-m2t6.json","https://opendata.rdw.nl/resource/jhie-znh9.json","https://opendata.rdw.nl/resource/kmfi-hrps.json"
"GPRH92","Personenauto","SUZUKI","SWIFT 1.3 GL AUTOMATIC U9","20251111","20200616","2116","hatchback",,"BLAUW","Niet geregistreerd","4","1298","770","1250","870","385","800","19930609","19930609","Geen verstrekking in Open Data",,"Ja",,,,,,,"2","4","0","0",,"0","0","M1",,,"tegen schutbord onder motorkap","1250",,,,,,"0","0.06","227","Nee","Nee",,"Nee","0",,,"2023","Geen oordeel","01","Ja","2025-11-11T00:00:00.000","2020-06-16T00:00:00.000","1993-06-09T00:00:00.000","1993-06-09T00:00:00.000",,,,,,,,,,,,,,,,,,,,,,,,,,,,"https://opendata.rdw.nl/resource/3huj-srit.json","https://opendata.rdw.nl/resource/8ys7-d773.json","https://opendata.rdw.nl/resource/vezc-m2t6.json","https://opendata.rdw.nl/resource/jhie-znh9.json","https://opendata.rdw.nl/resource/kmfi-hrps.json"
"GXRJ08","Personenauto","SUZUKI","SWIFT 1.3 GL AUTOMATIC U9","20260504","20230704","2068","hatchback",,"WIT","Niet geregistreerd","4","1298","770","1250","870","385","800","19930917","19930917","Geen verstrekking in Open Data",,"Ja",,,,,,,"2","4","0","0",,"0","0","M1",,,"tegen schutbord onder motorkap","1250",,,,,,"0","0.06","227","Nee","Nee",,"Nee","0",,,"2024","Geen oordeel","01","Ja","2026-05-04T00:00:00.000","2023-07-04T00:00:00.000","1993-09-17T00:00:00.000","1993-09-17T00:00:00.000",,,,,,,,,,,,,,,,,,,,,,,,,,,,"https://opendata.rdw.nl/resource/3huj-srit.json","https://opendata.rdw.nl/resource/8ys7-d773.json","https://opendata.rdw.nl/resource/vezc-m2t6.json","https://opendata.rdw.nl/resource/jhie-znh9.json","https://opendata.rdw.nl/resource/kmfi-hrps.json"
"GZPH18","Personenauto","SUZUKI","SWIFT 1.3 GL AUTOMATIC U9","20251016","20231112","2308","hatchback",,"GRIJS","Niet geregistreerd","4","1298","770","1250","870","385","800","19931009","19931009","Geen verstrekking in Open Data",,"Ja",,,,,,,"2","4","0","0",,"0","0","M1",,,"tegen schutbord onder motorkap","1250",,,,,,"0","0.06","227","Nee","Nee",,"Nee","0",,,"2023","Geen oordeel","01","Ja","2025-10-16T00:00:00.000","2023-11-12T00:00:00.000","1993-10-09T00:00:00.000","1993-10-09T00:00:00.000",,,,,,,,,,,,,,,,,,,,,,,,,,,,"https://opendata.rdw.nl/resource/3huj-srit.json","https://opendata.rdw.nl/resource/8ys7-d773.json","https://opendata.rdw.nl/resource/vezc-m2t6.json","https://opendata.rdw.nl/resource/jhie-znh9.json","https://opendata.rdw.nl/resource/kmfi-hrps.json"
"HLFR81","Personenauto","SUZUKI","SWIFT 1.3 GL AUTOMATIC U9","20241208","20230428","2130","hatchback",,"ROOD","Niet geregistreerd","4","1298","770","1250","870","385","800","19940125","19940125","Geen verstrekking in Open Data",,"Ja",,,,,,,"2","4","0","0",,"0","0","M1",,,"tegen schutbord onder motorkap","1250",,,,,,"0","0.06","227","Nee","Nee",,"Nee","0",,,"2023","Logisch","00","Ja","2024-12-08T00:00:00.000","2023-04-28T00:00:00.000","1994-01-25T00:00:00.000","1994-01-25T00:00:00.000",,,,,,,,,,,,,,,,,,,,,,,,,,,,"https://opendata.rdw.nl/resource/3huj-srit.json","https://opendata.rdw.nl/resource/8ys7-d773.json","https://opendata.rdw.nl/resource/vezc-m2t6.json","https://opendata.rdw.nl/resource/jhie-znh9.json","https://opendata.rdw.nl/resource/kmfi-hrps.json"
"HLZL97","Personenauto","SUZUKI","SWIFT 1.3 GL AUTOMATIC U9","20260214","19940214","2130","hatchback",,"ROOD","Niet geregistreerd","4","1298","770","1250","870","385","800","19940214","19940214","Geen verstrekking in Open Data",,"Ja",,,,,,,"2","4","0","0",,"0","0","M1",,,"tegen schutbord onder motorkap","1250",,,,,,"0","0.06","227","Nee","Nee",,"Nee","0",,,"2024","Geen oordeel","01","Ja","2026-02-14T00:00:00.000","1994-02-14T00:00:00.000","1994-02-14T00:00:00.000","1994-02-14T00:00:00.000",,,,,,,,,,,,,,,,,,,,,,,,,,,,"https://opendata.rdw.nl/resource/3huj-srit.json","https://opendata.rdw.nl/resource/8ys7-d773.json","https://opendata.rdw.nl/resource/vezc-m2t6.json","https://opendata.rdw.nl/resource/jhie-znh9.json","https://opendata.rdw.nl/resource/kmfi-hrps.json"
"JGHF93","Personenauto","SUZUKI","SWIFT 1.3 GL AUTOMATIC U9","20250119","20230901","2192","hatchback",,"BLAUW","Niet geregistreerd","4","1298","770","1250","870","385","800","19940727","19940727","Geen verstrekking in Open Data",,"Ja",,,,,,,"2","4","0","0",,"0","0","M1",,,"tegen schutbord onder motorkap","1250",,,,,,"0","0.06","227","Nee","Nee",,"Nee","0",,,"2024","Geen oordeel","01","Ja","2025-01-19T00:00:00.000","2023-09-01T00:00:00.000","1994-07-27T00:00:00.000","1994-07-27T00:00:00.000",,,,,,,,,,,,,,,,,,,,,,,,,,,,"https://opendata.rdw.nl/resource/3huj-srit.json","https://opendata.rdw.nl/resource/8ys7-d773.json","https://opendata.rdw.nl/resource/vezc-m2t6.json","https://opendata.rdw.nl/resource/jhie-znh9.json","https://opendata.rdw.nl/resource/kmfi-hrps.json"
"JNHB90","Personenauto","SUZUKI","SWIFT 1.3 GL AUTOMATIC U9","20190529","20160927","2066","hatchback",,"BLAUW","Niet geregistreerd","4","1298","770","1250","870","385","800","19941003","19941003","Geen verstrekking in Open Data",,"Nee",,,,,,,"2","4","0","0",,"0","0","M1",,,"tegen schutbord onder motorkap","1250",,,,,,"0","0.06","227","Nee","Nee",,"Nee","0",,,"2018","Geen oordeel","01","Ja","2019-05-29T00:00:00.000","2016-09-27T00:00:00.000","1994-10-03T00:00:00.000","1994-10-03T00:00:00.000",,,,,,,,,,,,,,,,,,,,,,,,,,,,"https://opendata.rdw.nl/resource/3huj-srit.json","https://opendata.rdw.nl/resource/8ys7-d773.json","https://opendata.rdw.nl/resource/vezc-m2t6.json","https://opendata.rdw.nl/resource/jhie-znh9.json","https://opendata.rdw.nl/resource/kmfi-hrps.json"
"JRRF19","Personenauto","SUZUKI","SWIFT 1.3 GL AUTOMATIC U9","20250322","20180919","2456","hatchback",,"GROEN","Niet geregistreerd","4","1298","770","1250","870","385","800","19941110","19941110","Geen verstrekking in Open Data",,"Ja",,,,,,,"2","4","0","0",,"0","0","M1",,,"tegen schutbord onder motorkap","1250",,,,,,"0","0.06","227","Nee","Nee",,"Nee","0",,,"2024","Geen oordeel","01","Ja","2025-03-22T00:00:00.000","2018-09-19T00:00:00.000","1994-11-10T00:00:00.000","1994-11-10T00:00:00.000",,,,,,,,,,,,,,,,,,,,,,,,,,,,"https://opendata.rdw.nl/resource/3huj-srit.json","https://opendata.rdw.nl/resource/8ys7-d773.json","https://opendata.rdw.nl/resource/vezc-m2t6.json","https://opendata.rdw.nl/resource/jhie-znh9.json","https://opendata.rdw.nl/resource/kmfi-hrps.json"
"JRZJ51","Personenauto","SUZUKI","SWIFT 1.3 GL AUTOMATIC U9","20210717","20210715","2456","hatchback",,"GROEN","Niet geregistreerd","4","1298","770","1250","870","385","800","19941118","19941118","Geen verstrekking in Open Data",,"Ja",,,,,,,"2","4","0","0",,"0","0","M1",,,"tegen schutbord onder motorkap","1250",,,,,,"0","0.06","227","Nee","Nee",,"Nee","0",,,"2021","Geen oordeel","01","Ja","2021-07-17T00:00:00.000","2021-07-15T00:00:00.000","1994-11-18T00:00:00.000","1994-11-18T00:00:00.000",,,,,,,,,,,,,,,,,,,,,,,,,,,,"https://opendata.rdw.nl/resource/3huj-srit.json","https://opendata.rdw.nl/resource/8ys7-d773.json","https://opendata.rdw.nl/resource/vezc-m2t6.json","https://opendata.rdw.nl/resource/jhie-znh9.json","https://opendata.rdw.nl/resource/kmfi-hrps.json"
"LBNP55","Personenauto","SUZUKI","SWIFT 1.3 GL AUTOMATIC U9","20250319","20000228","2012","hatchback",,"GROEN","Niet geregistreerd","4","1298","770","1250","870","385","800","19950221","19950221","Geen verstrekking in Open Data",,"Ja",,,,,,,"2","4","0","0",,"0","0","M1",,,"tegen schutbord onder motorkap","1250",,,,,,"0","0.06","227","Nee","Nee",,"Nee","0",,,"2024","Geen oordeel","01","Ja","2025-03-19T00:00:00.000","2000-02-28T00:00:00.000","1995-02-21T00:00:00.000","1995-02-21T00:00:00.000",,,,,,,,,,,,,,,,,,,,,,,,,,,,"https://opendata.rdw.nl/resource/3huj-srit.json","https://opendata.rdw.nl/resource/8ys7-d773.json","https://opendata.rdw.nl/resource/vezc-m2t6.json","https://opendata.rdw.nl/resource/jhie-znh9.json","https://opendata.rdw.nl/resource/kmfi-hrps.json"
"LBXG48","Personenauto","SUZUKI","SWIFT 1.3 GL AUTOMATIC U9","20231110","20100917","1912","hatchback",,"WIT","Niet geregistreerd","4","1298","770","1250","870","385","800","19950220","19950220","Geen verstrekking in Open Data",,"Ja",,,,,,,"2","4","0","0",,"0","0","M1",,,"tegen schutbord onder motorkap","1250",,,,,,"0","0.06","227","Nee","Nee",,"Nee","0",,,"2022","Geen oordeel","01","Ja","2023-11-10T00:00:00.000","2010-09-17T00:00:00.000","1995-02-20T00:00:00.000","1995-02-20T00:00:00.000",,,,,,,,,,,,,,,,,,,,,,,,,,,,"https://opendata.rdw.nl/resource/3huj-srit.json","https://opendata.rdw.nl/resource/8ys7-d773.json","https://opendata.rdw.nl/resource/vezc-m2t6.json","https://opendata.rdw.nl/resource/jhie-znh9.json","https://opendata.rdw.nl/resource/kmfi-hrps.json"
"LDBR33","Personenauto","SUZUKI","SWIFT 1.3 GL AUTOMATIC U9","20240927","20240118","2101","hatchback",,"WIT","Niet geregistreerd","4","1298","770","1250","870","385","800","19950223","19950223","Geen verstrekking in Open Data",,"Ja",,,,,,,"2","4","0","0",,"0","0","M1",,,"tegen schutbord onder motorkap","1250",,,,,,"0","0.06","227","Nee","Nee",,"Nee","0",,,"2024","Logisch","00","Ja","2024-09-27T00:00:00.000","2024-01-18T00:00:00.000","1995-02-23T00:00:00.000","1995-02-23T00:00:00.000",,"0",,,,,,,,,,,,,,,,,,,,,,,,,,"https://opendata.rdw.nl/resource/3huj-srit.json","https://opendata.rdw.nl/resource/8ys7-d773.json","https://opendata.rdw.nl/resource/vezc-m2t6.json","https://opendata.rdw.nl/resource/jhie-znh9.json","https://opendata.rdw.nl/resource/kmfi-hrps.json"
"LHSL40","Personenauto","SUZUKI","SWIFT 1.3 GL AUTOMATIC U9","20140319","20231004","1912","hatchback",,"WIT","Niet geregistreerd","4","1298","770","1250","870","385","800","19950418","19950418","Geen verstrekking in Open Data",,"Nee",,,,,,,"2","4","0","0",,"0","0","M1",,,"tegen schutbord onder motorkap","1250",,,,,,"0","0.06","227","Nee","Nee",,"Nee","0",,,"2013","Geen oordeel","01","Ja","2014-03-19T00:00:00.000","2023-10-04T00:00:00.000","1995-04-18T00:00:00.000","1995-04-18T00:00:00.000",,,,,,,,,,,,,,,,,,,,,,,,,,,,"https://opendata.rdw.nl/resource/3huj-srit.json","https://opendata.rdw.nl/resource/8ys7-d773.json","https://opendata.rdw.nl/resource/vezc-m2t6.json","https://opendata.rdw.nl/resource/jhie-znh9.json","https://opendata.rdw.nl/resource/kmfi-hrps.json"
"LPJS40","Personenauto","SUZUKI","SWIFT 1.3 GL AUTOMATIC U9","20130629","20130114","1981","hatchback",,"BLAUW","Niet geregistreerd","4","1298","770","1250","870","385","800","19950614","19950614","Geen verstrekking in Open Data",,"Ja",,,,,,,"2","4","0","0",,"0","0","M1",,,"tegen schutbord onder motorkap","1250",,,,,,"0","0.06","227","Nee","Nee",,"Nee","0",,,"2012","Geen oordeel","01","Ja","2013-06-29T00:00:00.000","2013-01-14T00:00:00.000","1995-06-14T00:00:00.000","1995-06-14T00:00:00.000",,,,,,,,,,,,,,,,,,,,,,,,,,,,"https://opendata.rdw.nl/resource/3huj-srit.json","https://opendata.rdw.nl/resource/8ys7-d773.json","https://opendata.rdw.nl/resource/vezc-m2t6.json","https://opendata.rdw.nl/resource/jhie-znh9.json","https://opendata.rdw.nl/resource/kmfi-hrps.json"
"LXLD69","Personenauto","SUZUKI","SWIFT 1.3 GL AUTOMATIC U9","20241101","19950902","1981","Niet geregistreerd",,"BLAUW","Niet geregistreerd","4",,"770",,"870",,,"19950902","19950902","Geen verstrekking in Open Data",,"Ja",,,,,,,"2","4",,,,,,"M1",,,"tegen schutbord onder motorkap",,,,,,,,"0.00","227","Nee","Nee",,"Nee",,,,"2023","Logisch","00","Ja","2024-11-01T00:00:00.000","1995-09-02T00:00:00.000","1995-09-02T00:00:00.000","1995-09-02T00:00:00.000",,"0",,,,,,,,,,,,,,,,,,,,,,,,,,"https://opendata.rdw.nl/resource/3huj-srit.json","https://opendata.rdw.nl/resource/8ys7-d773.json","https://opendata.rdw.nl/resource/vezc-m2t6.json","https://opendata.rdw.nl/resource/jhie-znh9.json","https://opendata.rdw.nl/resource/kmfi-hrps.json"
"NGGG74","Personenauto","SUZUKI","SWIFT 1.3 GL AUTOMATIC U9","20241215","20120222","1981","hatchback",,"BLAUW","Niet geregistreerd","4","1298","770","1250","870","385","800","19951125","19951125","Geen verstrekking in Open Data",,"Ja",,,,,,,"2","4","0","0",,"0","0","M1",,,"tegen schutbord onder motorkap","1250",,,,,,"0","0.06","227","Nee","Nee",,"Nee","0",,,"2023","Geen oordeel","01","Ja","2024-12-15T00:00:00.000","2012-02-22T00:00:00.000","1995-11-25T00:00:00.000","1995-11-25T00:00:00.000",,,,,,,,,,,,,,,,,,,,,,,,,,,,"https://opendata.rdw.nl/resource/3huj-srit.json","https://opendata.rdw.nl/resource/8ys7-d773.json","https://opendata.rdw.nl/resource/vezc-m2t6.json","https://opendata.rdw.nl/resource/jhie-znh9.json","https://opendata.rdw.nl/resource/kmfi-hrps.json"