"kenteken","voertuigsoort","merk","handelsbenaming","vervaldatum_apk","datum_tenaamstelling","bruto_bpm","inrichting","aantal_zitplaatsen","eerste_kleur","tweede_kleur","aantal_cilinders","cilinderinhoud","massa_ledig_voertuig","toegestane_maximum_massa_voertuig","massa_rijklaar","maximum_massa_trekken_ongeremd","maximum_trekken_massa_geremd","datum_eerste_toelating","datum_eerste_tenaamstelling_in_nederland","wacht_op_keuren","catalogusprijs","wam_verzekerd","maximale_constructiesnelheid","laadvermogen","oplegger_geremd","aanhangwagen_autonoom_geremd","aanhangwagen_middenas_geremd","aantal_staanplaatsen","aantal_deuren","aantal_wielen","afstand_hart_koppeling_tot_achterzijde_voertuig","afstand_voorzijde_voertuig_tot_hart_koppeling","afwijkende_maximum_snelheid","lengte","breedte","europese_voertuigcategorie","europese_voertuigcategorie_toevoeging","europese_uitvoeringcategorie_toevoeging","plaats_chassisnummer","technische_max_massa_voertuig","type","type_gasinstallatie","typegoedkeuringsnummer","variant","uitvoering","volgnummer_wijziging_eu_typegoedkeuring","vermogen_massarijklaar","wielbasis","export_indicator","openstaande_terugroepactie_indicator","vervaldatum_tachograaf","taxi_indicator","maximum_massa_samenstelling","aantal_rolstoelplaatsen","maximum_ondersteunende_snelheid","jaar_laatste_registratie_tellerstand","tellerstandoordeel","code_toelichting_tellerstandoordeel","tenaamstellen_mogelijk","vervaldatum_apk_dt","datum_tenaamstelling_dt","datum_eerste_toelating_dt","datum_eerste_tenaamstelling_in_nederland_dt","vervaldatum_tachograaf_dt","maximum_last_onder_de_vooras_sen_tezamen_koppeling","type_remsysteem_voertuig_code","rupsonderstelconfiguratiecode","wielbasis_voertuig_minimum","wielbasis_voertuig_maximum","lengte_voertuig_minimum","lengte_voertuig_maximum","breedte_voertuig_minimum","breedte_voertuig_maximum","hoogte_voertuig","hoogte_voertuig_minimum","hoogte_voertuig_maximum","massa_bedrijfsklaar_minimaal","massa_bedrijfsklaar_maximaal","technisch_toelaatbaar_massa_koppelpunt","maximum_massa_technisch_maximaal","maximum_massa_technisch_minimaal","subcategorie_nederland","verticale_belasting_koppelpunt_getrokken_voertuig","zuinigheidsclassificatie","registratie_datum_goedkeuring_afschrijvingsmoment_bpm","registratie_datum_goedkeuring_afschrijvingsmoment_bpm_dt","gem_lading_wrde","aerodyn_voorz","massa_alt_aandr","verl_cab_ind","api_gekentekende_voertuigen_assen","api_gekentekende_voertuigen_brandstof","api_gekentekende_voertuigen_carrosserie","api_gekentekende_voertuigen_carrosserie_specifiek","api_gekentekende_voertuigen_voertuigklasse"
"00GJF5","Personenauto","RENAULT","LAGUNA","20240628","20201205","7627","stationwagen","5","GRIJS","Niet geregistreerd","4","1997","1365","1940","1465","650","1300","20080628","20080628","Geen verstrekking in Open Data",,"Ja",,,,,,,"4","4","0","0",,"480","0","M1",,,"r. tegen schutbord onder motorkap","1940","T",,"e2*2001/116*0363*07","KT0F","KT0F06","0","0.07","276","Nee","Nee",,"Nee","3240","0",,"2023","Logisch","00","Ja","2024-06-28T00:00:00.000","2020-12-05T00:00:00.000","2008-06-28T00:00:00.000","2008-06-28T00:00:00.000",,,,,,,,,,,,,,,,,,,,,"C",,,,,,,"https://opendata.rdw.nl/resource/3huj-srit.json","https://opendata.rdw.nl/resource/8ys7-d773.json","https://opendata.rdw.nl/resource/vezc-m2t6.json","https://opendata.rdw.nl/resource/jhie-znh9.json","https://opendata.rdw.nl/resource/kmfi-hrps.json"
"00HZF2","Personenauto","RENAULT","LAGUNA","20240828","20200829","8514","stationwagen","5","GRIJS","Niet geregistreerd","4","1997","1365","1940","1465","650","1300","20090331","20090331","Geen verstrekking in Open Data",,"Ja",,,,,,,"4","4","0","0",,"480","0","M1",,,"r. tegen schutbord onder motorkap","1940","T",,"e2*2001/116*0363*03","KTEF","KTEF06","0","0.07","276","Nee","Nee",,"Nee","3240","0","0.00","2023","Logisch","00","Ja","2024-08-28T00:00:00.000","2020-08-29T00:00:00.000","2009-03-31T00:00:00.000","2009-03-31T00:00:00.000",,,,,,,,,,,,,,,,,,,,,"C",,,,,,,"https://opendata.rdw.nl/resource/3huj-srit.json","https://opendata.rdw.nl/resource/8ys7-d773.json","https://opendata.rdw.nl/resource/vezc-m2t6.json","https://opendata.rdw.nl/resource/jhie-znh9.json","https://opendata.rdw.nl/resource/kmfi-hrps.json"
"00JLN8","Personenauto","RENAULT","LAGUNA","20250728","20150710","10684","stationwagen","5","GRIJS","Niet geregistreerd","4","1998","1463","2038","1563","650","1300","20090630","20090630","Geen verstrekking in Open Data",,"Ja",,,,,,,"4","4","0","0",,"480","0","M1",,,"r. tegen schutbord onder motorkap","2038","T",,"e2*2001/116*0363*09","KTEH","KTEH0E","0","0.08","276","Nee","Nee",,"Nee","3338","0",,"2024","Logisch","00","Ja","2025-07-28T00:00:00.000","2015-07-10T00:00:00.000","2009-06-30T00:00:00.000","2009-06-30T00:00:00.000",,,,,,,,,,,,,,,,,,,,,"D",,,,,,,"https://opendata.rdw.nl/resource/3huj-srit.json","https://opendata.rdw.nl/resource/8ys7-d773.json","https://opendata.rdw.nl/resource/vezc-m2t6.json","https://opendata.rdw.nl/resource/jhie-znh9.json","https://opendata.rdw.nl/resource/kmfi-hrps.json"
"00KKD4","Personenauto","RENAULT","LAGUNA","20250115","20140726","8348","stationwagen","5","GRIJS","Niet geregistreerd","4","1998","1463","2038","1563","650","1300","20100111","20100111","Geen verstrekking in Open Data","34044","Ja",,,,,,,"4","4","0","0",,"480","0","M1",,,"r. tegen schutbord onder motorkap","2038","T",,"e2*2001/116*0363*13","KT1H","KT1H0E","0","0.08","276","Nee","Nee",,"Nee","3338","0",,"2024","Geen oordeel","07","Ja","2025-01-15T00:00:00.000","2014-07-26T00:00:00.000","2010-01-11T00:00:00.000","2010-01-11T00:00:00.000",,,,,,,,,,,,,,,,,,,,,"E",,,,,,,"https://opendata.rdw.nl/resource/3huj-srit.json","https://opendata.rdw.nl/resource/8ys7-d773.json","https://opendata.rdw.nl/resource/vezc-m2t6.json","https://opendata.rdw.nl/resource/jhie-znh9.json","https://opendata.rdw.nl/resource/kmfi-hrps.json"
"00LBK7","Personenauto","RENAULT","LAGUNA","20250406","20180406","6703","stationwagen","5","ZWART","Niet geregistreerd","4","1997","1365","1940","1465","650","1300","20100330","20100330","Geen verstrekking in Open Data","30060","Ja",,,,,,,"4","4","0","0",,"480","0","M1",,,"r. tegen schutbord onder motorkap","1940","T",,"e2*2001/116*0363*13","KT0F","KT0F06","0","0.07","276","Nee","Nee",,"Nee","3240","0",,"2024","Logisch","00","Ja","2025-04-06T00:00:00.000","2018-04-06T00:00:00.000","2010-03-30T00:00:00.000","2010-03-30T00:00:00.000",,,,,,,,,,,,,,,,,,,,,"C",,,,,,,"https://opendata.rdw.nl/resource/3huj-srit.json","https://opendata.rdw.nl/resource/8ys7-d773.json","https://opendata.rdw.nl/resource/vezc-m2t6.json","https://opendata.rdw.nl/resource/jhie-znh9.json","https://opendata.rdw.nl/resource/kmfi-hrps.json"
"00NKR2","Personenauto","RENAULT","LAGUNA","20241005","20150914","7316","stationwagen","5","GRIJS","Niet geregistreerd","4","1461","1295","1957","1395","650","1500","20101005","20101005","Geen verstrekking in Open Data","31665","Ja",,,,,,,"4","4","0","0",,"480","0","M1",,,"r. tegen schutbord onder motorkap","1957","T",,"e2*2001/116*0363*21","KT1R","KT1R06","0","0.06","276","Nee","Nee",,"Nee","3457","0","0.00","2023","Logisch","00","Ja","2024-10-05T00:00:00.000","2015-09-14T00:00:00.000","2010-10-05T00:00:00.000","2010-10-05T00:00:00.000",,,,,,,,,,,,,,,,,,,,,"A",,,,,,,"https://opendata.rdw.nl/resource/3huj-srit.json","https://opendata.rdw.nl/resource/8ys7-d773.json","https://opendata.rdw.nl/resource/vezc-m2t6.json","https://opendata.rdw.nl/resource/jhie-znh9.json","https://opendata.rdw.nl/resource/kmfi-hrps.json"
"00SBL1","Personenauto","RENAULT","LAGUNA","20240906","20110906","8443","stationwagen","5","GRIJS","Niet geregistreerd","4","1995","1405","2051","1505","650","1500","20110906","20110906","Geen verstrekking in Open Data","36185","Ja",,,,,,,"4","4","0","0",,"480","0","M1",,,"r. tegen schutbord onder motorkap","2051","T",,"e2*2001/116*0363*27","KTF2","KTF206","0","0.07","276","Nee","Nee",,"Nee","3551","0","0.00","2024","Logisch","00","Ja","2024-09-06T00:00:00.000","2011-09-06T00:00:00.000","2011-09-06T00:00:00.000","2011-09-06T00:00:00.000",,,,,,,,,,,,,,,,,,,,,"B",,,,,,,"https://opendata.rdw.nl/resource/3huj-srit.json","https://opendata.rdw.nl/resource/8ys7-d773.json","https://opendata.rdw.nl/resource/vezc-m2t6.json","https://opendata.rdw.nl/resource/jhie-znh9.json","https://opendata.rdw.nl/resource/kmfi-hrps.json"
"00SNT1","Personenauto","RENAULT","LAGUNA","20250606","20170526","7031","stationwagen","5","GRIJS","Niet geregistreerd","4","1997","1294","1940","1394","650","1300","20111031","20111031","Geen verstrekking in Open Data","31475","Ja",,,,,,,"4","4","0","0",,"480","0","M1",,,"r. tegen schutbord onder motorkap","1940","T",,"e2*2001/116*0363*25","KTFH","KTFH06","0","0.07","276","Nee","Nee",,"Nee","3240","0","0.00","2024","Logisch","00","Ja","2025-06-06T00:00:00.000","2017-05-26T00:00:00.000","2011-10-31T00:00:00.000","2011-10-31T00:00:00.000",,,,,,,,,,,,,,,,,,,,,"C",,,,,,,"https://opendata.rdw.nl/resource/3huj-srit.json","https://opendata.rdw.nl/resource/8ys7-d773.json","https://opendata.rdw.nl/resource/vezc-m2t6.json","https://opendata.rdw.nl/resource/jhie-znh9.json","https://opendata.rdw.nl/resource/kmfi-hrps.json"
"00SNX9","Personenauto","RENAULT","LAGUNA","20250612","20220428","6038","stationwagen","5","ZWART","Niet geregistreerd","4","1461","1295","1957","1395","650","1500","20111107","20111107","Geen verstrekking in Open Data","31780","Ja",,,,,,,"4","4","0","0",,"480","0","M1",,,"r. tegen schutbord onder motorkap","1957","T",,"e2*2001/116*0363*27","KT1R","KT1RG6","0","0.06","276","Nee","Nee",,"Nee","3457","0","0.00","2024","Logisch","00","Ja","2025-06-12T00:00:00.000","2022-04-28T00:00:00.000","2011-11-07T00:00:00.000","2011-11-07T00:00:00.000",,,,,,,,,,,,,,,,,,,,,"A",,,,,,,"https://opendata.rdw.nl/resource/3huj-srit.json","https://opendata.rdw.nl/resource/8ys7-d773.json","https://opendata.rdw.nl/resource/vezc-m2t6.json","https://opendata.rdw.nl/resource/jhie-znh9.json","https://opendata.rdw.nl/resource/kmfi-hrps.json"
"00SXK4","Personenauto","RENAULT","LAGUNA","20240730","20200731","6825","stationwagen","5","GRIJS","Niet geregistreerd","4","1997","1294","1940","1394","650","1300","20111223","20111223","Geen verstrekking in Open Data","29980","Ja",,,,,,,"4","4","0","0",,"480","0","M1",,,"r. tegen schutbord onder motorkap","1940","T",,"e2*2001/116*0363*26","KT3H","KT3H06","0","0.07","276","Nee","Nee",,"Nee","3240","0","0.00","2023","Logisch","00","Ja","2024-07-30T00:00:00.000","2020-07-31T00:00:00.000","2011-12-23T00:00:00.000","2011-12-23T00:00:00.000",,,,,,,,,,,,,,,,,,,,,"C",,,,,,,"https://opendata.rdw.nl/resource/3huj-srit.json","https://opendata.rdw.nl/resource/8ys7-d773.json","https://opendata.rdw.nl/resource/vezc-m2t6.json","https://opendata.rdw.nl/resource/jhie-znh9.json","https://opendata.rdw.nl/resource/kmfi-hrps.json"
"00TFT6","Personenauto","RENAULT","LAGUNA","20250117","20210406","5860","stationwagen","5","GRIJS","Niet geregistreerd","4","1461","1295","1957","1395","650","1500","20120111","20120111","Geen verstrekking in Open Data","33280","Ja",,,,,,,"4","4","0","0",,"480","0","M1",,,"r. tegen schutbord onder motorkap","1957","T",,"e2*2001/116*0363*27","KTER","KTERG6","0","0.06","276","Nee","Nee",,"Nee","3457","0","0.00","2024","Logisch","00","Ja","2025-01-17T00:00:00.000","2021-04-06T00:00:00.000","2012-01-11T00:00:00.000","2012-01-11T00:00:00.000",,,,,,,,,,,,,,,,,,,,,"A",,,,,,,"https://opendata.rdw.nl/resource/3huj-srit.json","https://opendata.rdw.nl/resource/8ys7-d773.json","https://opendata.rdw.nl/resource/vezc-m2t6.json","https://opendata.rdw.nl/resource/jhie-znh9.json","https://opendata.rdw.nl/resource/kmfi-hrps.json"
"00ZLZ1","Personenauto","RENAULT","LAGUNA","20240818","20240501","5357","stationwagen","5","WIT","Niet geregistreerd","4","1461","1295","1957","1395","650","1500","20130107","20130107","Geen verstrekking in Open Data","32875","Ja",,,,,,,"4","4","0","0",,"480","0","M1",,,"r. tegen schutbord onder motorkap","1957","T",,"e2*2001/116*0363*34","KT1R","KT1RG6","0","0.06","276","Nee","Nee",,"Nee","3457","0","0.00","2024","Logisch","00","Ja","2024-08-18T00:00:00.000","2024-05-01T00:00:00.000","2013-01-07T00:00:00.000","2013-01-07T00:00:00.000",,,,,,,,,,,,,,,,,,,,,"A",,,,,,,"https://opendata.rdw.nl/resource/3huj-srit.json","https://opendata.rdw.nl/resource/8ys7-d773.json","https://opendata.rdw.nl/resource/vezc-m2t6.json","https://opendata.rdw.nl/resource/jhie-znh9.json","https://opendata.rdw.nl/resource/kmfi-hrps.json"
"00ZRV6","Personenauto","RENAULT","LAGUNA","20250120","20150411","5357","stationwagen","5","WIT","Niet geregistreerd","4","1461","1295","1957","1395","650","1500","20130115","20130115","Geen verstrekking in Open Data","33875","Ja",,,,,,,"4","4","0","0",,"480","0","M1",,,"r. tegen schutbord onder motorkap","1957","T",,"e2*2001/116*0363*34","KT1R","KT1RG6","0","0.06","276","Nee","Nee",,"Nee","3457","0","0.00","2024","Logisch","00","Ja","2025-01-20T00:00:00.000","2015-04-11T00:00:00.000","2013-01-15T00:00:00.000","2013-01-15T00:00:00.000",,,,,,,,,,,,,,,,,,,,,"A",,,,,,,"https://opendata.rdw.nl/resource/3huj-srit.json","https://opendata.rdw.nl/resource/8ys7-d773.json","https://opendata.rdw.nl/resource/vezc-m2t6.json","https://opendata.rdw.nl/resource/jhie-znh9.json","https://opendata.rdw.nl/resource/kmfi-hrps.json"
"01GJF5","Personenauto","RENAULT","LAGUNA","20240630","20080630","6907","stationwagen","5","ZWART","Niet geregistreerd","4","1997","1365","1940","1465","650","1300","20080630","20080630","Geen verstrekking in Open Data",,"Ja",,,,,,,"4","4","0","0",,"480","0","M1",,,"r. tegen schutbord onder motorkap","1940","T",,"e2*2001/116*0363*07","KT0F","KT0F06","0","0.07","276","Nee","Nee",,"Nee","3240","0",,"2023","Logisch","00","Ja","2024-06-30T00:00:00.000","2008-06-30T00:00:00.000","2008-06-30T00:00:00.000","2008-06-30T00:00:00.000",,,,,,,,,,,,,,,,,,,,,"C",,,,,,,"https://opendata.rdw.nl/resource/3huj-srit.json","https://opendata.rdw.nl/resource/8ys7-d773.json","https://opendata.rdw.nl/resource/vezc-m2t6.json","https://opendata.rdw.nl/resource/jhie-znh9.json","https://opendata.rdw.nl/resource/kmfi-hrps.json"
"01GTXX","Personenauto","RENAULT","LAGUNA","20160501",,"5080","stationwagen","5","GEEL","Niet geregistreerd","4","1598","1280","1870","1380","650","1300","20010327","20010327","Geen verstrekking in Open Data",,"Nee",,,,,,,"4","4","0","0",,"470","0","M1",,,"r. tegen schutbord onder motorkap","1870",,,"e2*98/14*0206*04","KG0A","KG0A05","1","0.06","274","Nee","Nee",,"Nee","2850","0",,"2015","Geen oordeel","07","Ja","2016-05-01T00:00:00.000",,"2001-03-27T00:00:00.000","2001-03-27T00:00:00.000",,,,,,,,,,,,,,,,,,,,,"B",,,,,,,"https://opendata.rdw.nl/resource/3huj-srit.json","https://opendata.rdw.nl/resource/8ys7-d773.json","https://opendata.rdw.nl/resource/vezc-m2t6.json","https://opendata.rdw.nl/resource/jhie-znh9.json","https://opendata.rdw.nl/resource/kmfi-hrps.json"
"01HSJ8","Personenauto","RENAULT","LAGUNA","20241213","20170214","14001","stationwagen","5","ZWART","Niet geregistreerd","4","1995","1532","2107","1632","650","1500","20091130","20091130","Geen verstrekking in Open Data",,"Ja",,,,,,,"4","4","0","0",,"480","0","M1",,,"r. tegen schutbord onder motorkap","2107","T",,"e2*2001/116*0363*10","KT19","KT190E","0","0.07","276","Nee","Nee",,"Nee","3607","0",,"2023","Logisch","00","Ja","2024-12-13T00:00:00.000","2017-02-14T00:00:00.000","2009-11-30T00:00:00.000","2009-11-30T00:00:00.000",,,,,,,,,,,,,,,,,,,,,"E",,,,,,,"https://opendata.rdw.nl/resource/3huj-srit.json","https://opendata.rdw.nl/resource/8ys7-d773.json","https://opendata.rdw.nl/resource/vezc-m2t6.json","https://opendata.rdw.nl/resource/jhie-znh9.json","https://opendata.rdw.nl/resource/kmfi-hrps.json"
"01HZF2","Personenauto","RENAULT","LAGUNA","20250408","20220531","8454","stationwagen","5","GRIJS","Niet geregistreerd","4","1997","1365","1940","1465","650","1300","20090331","20090331","Geen verstrekking in Open Data",,"Ja",,,,,,,"4","4","0","0",,"480","0","M1",,,"r. tegen schutbord onder motorkap","1940","T",,"e2*2001/116*0363*03","KTEF","KTEF06","0","0.07","276","Nee","Nee",,"Nee","3240","0","0.00","2024","Logisch","00","Ja","2025-04-08T00:00:00.000","2022-05-31T00:00:00.000","2009-03-31T00:00:00.000","2009-03-31T00:00:00.000",,,,,,,,,,,,,,,,,,,,,"C",,,,,,,"https://opendata.rdw.nl/resource/3huj-srit.json","https://opendata.rdw.nl/resource/8ys7-d773.json","https://opendata.rdw.nl/resource/vezc-m2t6.json","https://opendata.rdw.nl/resource/jhie-znh9.json","https://opendata.rdw.nl/resource/kmfi-hrps.json"
"01JDDD","Personenauto","RENAULT","LAGUNA","20190703","20181231","6262","stationwagen","5","ROOD","Niet geregistreerd","4","1998","1310","1920","1410","650","1300","20020214","20020214","Geen verstrekking in Open Data",,"Ja",,,,,,,"4","4","0","0",,"470","0","M1",,,"r. tegen schutbord onder motorkap","1920",,,"e2*98/14*0206*06","KG0N","KG0N05","0","0.07","274","Nee","Nee",,"Nee","2850","0",,"2018","Logisch","00","Ja","2019-07-03T00:00:00.000","2018-12-31T00:00:00.000","2002-02-14T00:00:00.000","2002-02-14T00:00:00.000",,,,,,,,,,,,,,,,,,,,,"C",,,,,,,"https://opendata.rdw.nl/resource/3huj-srit.json","https://opendata.rdw.nl/resource/8ys7-d773.json","https://opendata.rdw.nl/resource/vezc-m2t6.json","https://opendata.rdw.nl/resource/jhie-znh9.json","https://opendata.rdw.nl/resource/kmfi-hrps.json"
"01JHGF","Personenauto","RENAULT","LAGUNA","20250603","20240615","6137","stationwagen","5","GROEN","Niet geregistreerd","4","1783","1325","1935","1425","650","1300","20020405","20020405","Geen verstrekking in Open Data",,"Nee",,,,,,,"4","4","0","0",,"470","0","M1",,,"r. tegen schutbord onder motorkap","1935",,,"e2*98/14*0206*09","KG0J","KG0J0A","0","0.06","274","Nee","Nee",,"Nee","2900","0",,"2024","Logisch","00","Ja","2025-06-03T00:00:00.000","2024-06-15T00:00:00.000","2002-04-05T00:00:00.000","2002-04-05T00:00:00.000",,,,,,,,,,,,,,,,,,,,,"C",,,,,,,"https://opendata.rdw.nl/resource/3huj-srit.json","https://opendata.rdw.nl/resource/8ys7-d773.json","https://opendata.rdw.nl/resource/vezc-m2t6.json","https://opendata.rdw.nl/resource/jhie-znh9.json","https://opendata.rdw.nl/resource/kmfi-hrps.json"
"01JLF5","Personenauto","RENAULT","LAGUNA","20250125","20140123","6248","stationwagen","5","GRIJS","Niet geregistreerd","4","1997","1365","1940","1465","650","1300","20090630","20090630","Geen verstrekking in Open Data",,"Ja",,,,,,,"4","4","0","0",,"480","0","M1",,,"r. tegen schutbord onder motorkap","1940","T",,"e2*2001/116*0363*09","KT0F","KT0F06","0","0.07","276","Nee","Nee",,"Nee","3240","0",,"2024","Logisch","00","Ja","2025-01-25T00:00:00.000","2014-01-23T00:00:00.000","2009-06-30T00:00:00.000","2009-06-30T00:00:00.000",,,,,,,,,,,,,,,,,,,,,"C",,,,,,,"https://opendata.rdw.nl/resource/3huj-srit.json","https://opendata.rdw.nl/resource/8ys7-d773.json","https://opendata.rdw.nl/resource/vezc-m2t6.json","https://opendata.rdw.nl/resource/jhie-znh9.json","https://opendata.rdw.nl/resource/kmfi-hrps.json"
"01JXRV","Personenauto","RENAULT","LAGUNA","20150102",,"7985","stationwagen","5","GRIJS","Niet geregistreerd","4","1870","1360","1970","1460","650","1500","20021009","20021009","Geen verstrekking in Open Data",,"Nee",,,,,,,"4","4","0","0",,"470","0","M1",,,"r. tegen schutbord onder motorkap","1970",,,"e2*98/14*0206*13","KG0G","KG0G06","0","0.06","274","Nee","Nee",,"Nee","3100","0",,"2014","Logisch","00","Ja","2015-01-02T00:00:00.000",,"2002-10-09T00:00:00.000","2002-10-09T00:00:00.000",,,,,,,,,,,,,,,,,,,,,"C",,,,,,,"https://opendata.rdw.nl/resource/3huj-srit.json","https://opendata.rdw.nl/resource/8ys7-d773.json","https://opendata.rdw.nl/resource/vezc-m2t6.json","https://opendata.rdw.nl/resource/jhie-znh9.json","https://opendata.rdw.nl/resource/kmfi-hrps.json"
"01LBK7","Personenauto","RENAULT","LAGUNA","20250417","20190619","6573","stationwagen","5","ZWART","Niet geregistreerd","4","1997","1365","1940","1465","650","1300","20100410","20100410","Geen verstrekking in Open Data","29365","Ja",,,,,,,"4","4","0","0",,"480","0","M1",,,"r. tegen schutbord onder motorkap","1940","T",,"e2*2001/116*0363*13","KT0F","KT0F06","0","0.07","276","Nee","Nee",,"Nee","3240","0",,"2024","Logisch","00","Ja","2025-04-17T00:00:00.000","2019-06-19T00:00:00.000","2010-04-10T00:00:00.000","2010-04-10T00:00:00.000",,,,,,,,,,,,,,,,,,,,,"C",,,,,,,"https://opendata.rdw.nl/resource/3huj-srit.json","https://opendata.rdw.nl/resource/8ys7-d773.json","https://opendata.rdw.nl/resource/vezc-m2t6.json","https://opendata.rdw.nl/resource/jhie-znh9.json","https://opendata.rdw.nl/resource/kmfi-hrps.json"
"01LNBP","Personenauto","RENAULT","LAGUNA","20160928","20160218","9663","stationwagen","5","ZWART","Niet geregistreerd","4","2188","1530","2105","1630","650","1500","20030306","20030306","Geen verstrekking in Open Data",,"Ja",,,,,,,"4","4","0","0",,"470","0","M1",,,"r. tegen schutbord onder motorkap","2105",,,"e2*98/14*0206*15","KG0F","KG0F0B","0","0.07","274","Nee","Nee",,"Nee","3250","0",,"2016","Logisch","00","Ja","2016-09-28T00:00:00.000","2016-02-18T00:00:00.000","2003-03-06T00:00:00.000","2003-03-06T00:00:00.000",,,,,,,,,,,,,,,,,,,,,"F",,,,,,,"https://opendata.rdw.nl/resource/3huj-srit.json","https://opendata.rdw.nl/resource/8ys7-d773.json","https://opendata.rdw.nl/resource/vezc-m2t6.json","https://opendata.rdw.nl/resource/jhie-znh9.json","https://opendata.rdw.nl/resource/kmfi-hrps.json"
"01NDZZ","Personenauto","RENAULT","LAGUNA","20250525","20191230","4911","stationwagen","5","GRIJS","Niet geregistreerd","4","1783","1290","1900","1390","650","1300","20030809","20030809","Geen verstrekking in Open Data",,"Ja",,,,,,,"4","4","0","0",,"470","0","M1",,,"r. tegen schutbord onder motorkap","1900",,,"e2*98/14*0206*18","KG0M","KG0M05","0","0.06","274","Nee","Nee",,"Nee","2850","0",,"2024","Logisch","00","Ja","2025-05-25T00:00:00.000","2019-12-30T00:00:00.000","2003-08-09T00:00:00.000","2003-08-09T00:00:00.000",,,,,,,,,,,,,,,,,,,,,"C",,,,,,,"https://opendata.rdw.nl/resource/3huj-srit.json","https://opendata.rdw.nl/resource/8ys7-d773.json","https://opendata.rdw.nl/resource/vezc-m2t6.json","https://opendata.rdw.nl/resource/jhie-znh9.json","https://opendata.rdw.nl/resource/kmfi-hrps.json"
"01NKR2","Personenauto","RENAULT","LAGUNA","20250219","20160209","7316","stationwagen","5","ZWART","Niet geregistreerd","4","1461","1295","1957","1395","650","1500","20101012","20101012","Geen verstrekking in Open Data","31665","Ja",,,,,,,"4","4","0","0",,"480","0","M1",,,"r. tegen schutbord onder motorkap","1957","T",,"e2*2001/116*0363*21","KT1R","KT1R06","0","0.06","276","Nee","Nee",,"Nee","3457","0","0.00","2024","Logisch","00","Ja","2025-02-19T00:00:00.000","2016-02-09T00:00:00.000","2010-10-12T00:00:00.000","2010-10-12T00:00:00.000",,,,,,,,,,,,,,,,,,,,,"A",,,,,,,"https://opendata.rdw.nl/resource/3huj-srit.json","https://opendata.rdw.nl/resource/8ys7-d773.json","https://opendata.rdw.nl/resource/vezc-m2t6.json","https://opendata.rdw.nl/resource/jhie-znh9.json","https://opendata.rdw.nl/resource/kmfi-hrps.json"
"01NTDN","Personenauto","RENAULT","LAGUNA","20240719","20170629","5866","stationwagen","5","ZWART","Niet geregistreerd","4","1783","1325","1935","1425","650","1300","20040227","20040227","Geen verstrekking in Open Data",,"Ja",,,,,,,"4","4","0","0",,"470","0","M1",,,"r. tegen schutbord onder motorkap","1935",,,"e2*98/14*0206*22","KG0J","KG0J0A","0","0.06","274","Nee","Nee",,"Nee","2900","0",,"2023","Logisch","00","Ja","2024-07-19T00:00:00.000","2017-06-29T00:00:00.000","2004-02-27T00:00:00.000","2004-02-27T00:00:00.000",,,,,,,,,,,,,,,,,,,,,"D",,,,,,,"https://opendata.rdw.nl/resource/3huj-srit.json","https://opendata.rdw.nl/resource/8ys7-d773.json","https://opendata.rdw.nl/resource/vezc-m2t6.json","https://opendata.rdw.nl/resource/jhie-znh9.json","https://opendata.rdw.nl/resource/kmfi-hrps.json"