"kenteken","voertuigsoort","merk","handelsbenaming","vervaldatum_apk","datum_tenaamstelling","bruto_bpm","inrichting","aantal_zitplaatsen","eerste_kleur","tweede_kleur","aantal_cilinders","cilinderinhoud","massa_ledig_voertuig","toegestane_maximum_massa_voertuig","massa_rijklaar","maximum_massa_trekken_ongeremd","maximum_trekken_massa_geremd","datum_eerste_toelating","datum_eerste_tenaamstelling_in_nederland","wacht_op_keuren","catalogusprijs","wam_verzekerd","maximale_constructiesnelheid","laadvermogen","oplegger_geremd","aanhangwagen_autonoom_geremd","aanhangwagen_middenas_geremd","aantal_staanplaatsen","aantal_deuren","aantal_wielen","afstand_hart_koppeling_tot_achterzijde_voertuig","afstand_voorzijde_voertuig_tot_hart_koppeling","afwijkende_maximum_snelheid","lengte","breedte","europese_voertuigcategorie","europese_voertuigcategorie_toevoeging","europese_uitvoeringcategorie_toevoeging","plaats_chassisnummer","technische_max_massa_voertuig","type","type_gasinstallatie","typegoedkeuringsnummer","variant","uitvoering","volgnummer_wijziging_eu_typegoedkeuring","vermogen_massarijklaar","wielbasis","export_indicator","openstaande_terugroepactie_indicator","vervaldatum_tachograaf","taxi_indicator","maximum_massa_samenstelling","aantal_rolstoelplaatsen","maximum_ondersteunende_snelheid","jaar_laatste_registratie_tellerstand","tellerstandoordeel","code_toelichting_tellerstandoordeel","tenaamstellen_mogelijk","vervaldatum_apk_dt","datum_tenaamstelling_dt","datum_eerste_toelating_dt","datum_eerste_tenaamstelling_in_nederland_dt","vervaldatum_tachograaf_dt","maximum_last_onder_de_vooras_sen_tezamen_koppeling","type_remsysteem_voertuig_code","rupsonderstelconfiguratiecode","wielbasis_voertuig_minimum","wielbasis_voertuig_maximum","lengte_voertuig_minimum","lengte_voertuig_maximum","breedte_voertuig_minimum","breedte_voertuig_maximum","hoogte_voertuig","hoogte_voertuig_minimum","hoogte_voertuig_maximum","massa_bedrijfsklaar_minimaal","massa_bedrijfsklaar_maximaal","technisch_toelaatbaar_massa_koppelpunt","maximum_massa_technisch_maximaal","maximum_massa_technisch_minimaal","subcategorie_nederland","verticale_belasting_koppelpunt_getrokken_voertuig","zuinigheidsclassificatie","registratie_datum_goedkeuring_afschrijvingsmoment_bpm","registratie_datum_goedkeuring_afschrijvingsmoment_bpm_dt","gem_lading_wrde","aerodyn_voorz","massa_alt_aandr","verl_cab_ind","api_gekentekende_voertuigen_assen","api_gekentekende_voertuigen_brandstof","api_gekentekende_voertuigen_carrosserie","api_gekentekende_voertuigen_carrosserie_specifiek","api_gekentekende_voertuigen_voertuigklasse"
"5TZJ97","Personenauto","RENAULT","RENAULT CLIO","20240904","20220619","3958","hatchback","5","WIT","Niet geregistreerd","4","1461","1130","1645","1230",,,"20090224","20141031","Geen verstrekking in Open Data",,"Ja",,,,,,,"2","4",,,,,,"M1",,,"bodemplaat r. kofferruimte","1645",,,,,,,"0.04","258","Nee","Nee",,"Nee",,,,"2023","Geen oordeel","05","Ja","2024-09-04T00:00:00.000","2022-06-19T00:00:00.000","2009-02-24T00:00:00.000","2014-10-31T00:00:00.000",,"0",,,,,,,,,,,,,,,,,,,,,,,,,,"https://opendata.rdw.nl/resource/3huj-srit.json","https://opendata.rdw.nl/resource/8ys7-d773.json","https://opendata.rdw.nl/resource/vezc-m2t6.json","https://opendata.rdw.nl/resource/jhie-znh9.json","https://opendata.rdw.nl/resource/kmfi-hrps.json"
"H435ZL","Personenauto","RENAULT","RENAULT CLIO","20241218","20220125","412","hatchback","5","ZWART","Niet geregistreerd","4","1149","1065","1580","1165",,,"20080507","20201126","Geen verstrekking in Open Data",,"Ja","167",,,,,,"4","4",,,,,,"M1",,,"a. bodemplaat r. kofferruimte","1580",,,,,,,"0.05","258","Nee","Nee",,"Nee",,,,"2023","Geen oordeel","05","Ja","2024-12-18T00:00:00.000","2022-01-25T00:00:00.000","2008-05-07T00:00:00.000","2020-11-26T00:00:00.000",,,,,,,,,,,,,,,,,,,,,,,,,,,,"https://opendata.rdw.nl/resource/3huj-srit.json","https://opendata.rdw.nl/resource/8ys7-d773.json","https://opendata.rdw.nl/resource/vezc-m2t6.json","https://opendata.rdw.nl/resource/jhie-znh9.json","https://opendata.rdw.nl/resource/kmfi-hrps.json"
"HK551K","Personenauto","RENAULT","RENAULT CLIO","20250224","20151116","2709","hatchback","5","GRIJS","Niet geregistreerd","4","1149","920","1490","1020",,,"20050209","20151116","Geen verstrekking in Open Data",,"Ja",,,,,,,"2","4",,,,,,"M1",,,"r. bodemplaat onder voorzitting","1490",,,,,,,"0.05","247","Nee","Nee",,"Nee","2300",,,"2024","Geen oordeel","05","Ja","2025-02-24T00:00:00.000","2015-11-16T00:00:00.000","2005-02-09T00:00:00.000","2015-11-16T00:00:00.000",,,,,,,,,,,,,,,,,,,,,,,,,,,,"https://opendata.rdw.nl/resource/3huj-srit.json","https://opendata.rdw.nl/resource/8ys7-d773.json","https://opendata.rdw.nl/resource/vezc-m2t6.json","https://opendata.rdw.nl/resource/jhie-znh9.json","https://opendata.rdw.nl/resource/kmfi-hrps.json"
"JB221X","Personenauto","RENAULT","RENAULT CLIO 1.2 16V","20250130","20240406","2044","hatchback","5","WIT","Niet geregistreerd","4","1149","1105","1580","1205",,,"20100131","20160213","Geen verstrekking in Open Data","13808","Nee",,,,,,,"2","4",,,,,,"M1",,,"r. kofferruimte","1580","RENAULT CLIO",,,,,,"0.06","257","Nee","Nee",,"Nee","2500",,,"2024","Geen oordeel","05","Ja","2025-01-30T00:00:00.000","2024-04-06T00:00:00.000","2010-01-31T00:00:00.000","2016-02-13T00:00:00.000",,,,,,,,,,,,,,,,,,,,,,,,,,,,"https://opendata.rdw.nl/resource/3huj-srit.json","https://opendata.rdw.nl/resource/8ys7-d773.json","https://opendata.rdw.nl/resource/vezc-m2t6.json","https://opendata.rdw.nl/resource/jhie-znh9.json","https://opendata.rdw.nl/resource/kmfi-hrps.json"
"JL898T","Personenauto","RENAULT","RENAULT CLIO","20250429","20240413","2207","hatchback","5","GRIJS","Niet geregistreerd","4","1149","1065","1580","1165",,"920","20100114","20160430","Geen verstrekking in Open Data","13107","Ja",,,,,,,"4","4",,,,,,"M1",,,"r. in kofferruimte by reservewiel","1580","R",,,,,,"0.05","258","Nee","Nee",,"Nee","2500",,,"2024","Geen oordeel","05","Ja","2025-04-29T00:00:00.000","2024-04-13T00:00:00.000","2010-01-14T00:00:00.000","2016-04-30T00:00:00.000",,,,,,,,,,,,,,,,,,,,,,,,,,,,"https://opendata.rdw.nl/resource/3huj-srit.json","https://opendata.rdw.nl/resource/8ys7-d773.json","https://opendata.rdw.nl/resource/vezc-m2t6.json","https://opendata.rdw.nl/resource/jhie-znh9.json","https://opendata.rdw.nl/resource/kmfi-hrps.json"
"K611PF","Personenauto","RENAULT","RENAULT CLIO","20250315","20230331","2507","hatchback","5","ZWART","Niet geregistreerd","4","1149","1055","1570","1155",,"930","20080304","20210121","Geen verstrekking in Open Data",,"Ja","167",,,,,,"2","4",,,,,,"M1",,,,"1570","R",,,,,,"0.05","258","Nee","Nee",,"Nee","2500",,,"2024","Onlogisch","04","Ja","2025-03-15T00:00:00.000","2023-03-31T00:00:00.000","2008-03-04T00:00:00.000","2021-01-21T00:00:00.000",,,,,,,,,,,,,,,,,,,,,,,,,,,,"https://opendata.rdw.nl/resource/3huj-srit.json","https://opendata.rdw.nl/resource/8ys7-d773.json","https://opendata.rdw.nl/resource/vezc-m2t6.json","https://opendata.rdw.nl/resource/jhie-znh9.json","https://opendata.rdw.nl/resource/kmfi-hrps.json"
"L034RN","Personenauto","RENAULT","RENAULT CLIO","20240519","20220426",,"hatchback","5","BLAUW","Niet geregistreerd","4","1764","900","1410","1000","490","800","19920407","20210710","Geen verstrekking in Open Data",,"Ja","209",,,,,,"3","4",,,,,,"M1",,,,"1410","C57D",,,,,,"0.10","248","Nee","Nee",,"Nee",,,,"2022","Geen oordeel","05","Ja","2024-05-19T00:00:00.000","2022-04-26T00:00:00.000","1992-04-07T00:00:00.000","2021-07-10T00:00:00.000",,,,,,,,,,,,,,,,,,,,,,,,,,,,"https://opendata.rdw.nl/resource/3huj-srit.json","https://opendata.rdw.nl/resource/8ys7-d773.json","https://opendata.rdw.nl/resource/vezc-m2t6.json","https://opendata.rdw.nl/resource/jhie-znh9.json","https://opendata.rdw.nl/resource/kmfi-hrps.json"
"L639XH","Personenauto","RENAULT","RENAULT CLIO","20250602","20230617","129","hatchback","5","ROOD","Niet geregistreerd","3","898","984","1588","1084",,,"20140625","20210814","Geen verstrekking in Open Data","22960","Ja",,,,,,,"4","4",,,,,,"M1",,,"r. bodemplaat by kofferruimte","1588",,,,,,,"0.06","259","Nee","Nee",,"Nee","2488",,,"2024","Geen oordeel","05","Ja","2025-06-02T00:00:00.000","2023-06-17T00:00:00.000","2014-06-25T00:00:00.000","2021-08-14T00:00:00.000",,,,,,,,,,,,,,,,,,,,,,,,,,,,"https://opendata.rdw.nl/resource/3huj-srit.json","https://opendata.rdw.nl/resource/8ys7-d773.json","https://opendata.rdw.nl/resource/vezc-m2t6.json","https://opendata.rdw.nl/resource/jhie-znh9.json","https://opendata.rdw.nl/resource/kmfi-hrps.json"
"N335FD","Personenauto","RENAULT","RENAULT CLIO","20241206","20210922","5674","hatchback","5","GRIJS","Niet geregistreerd","4","1390","985","1390","1085",,"1010","20010220","20210922","Geen verstrekking in Open Data",,"Ja","181",,,,,,"2","4",,,,,,"M1",,,,"1390","B",,,,,,"0.07","247","Nee","Nee",,"Nee","2400",,,"2024","Geen oordeel","05","Ja","2024-12-06T00:00:00.000","2021-09-22T00:00:00.000","2001-02-20T00:00:00.000","2021-09-22T00:00:00.000",,,,,,,,,,,,,,,,,,,,,,,,,,,,"https://opendata.rdw.nl/resource/3huj-srit.json","https://opendata.rdw.nl/resource/8ys7-d773.json","https://opendata.rdw.nl/resource/vezc-m2t6.json","https://opendata.rdw.nl/resource/jhie-znh9.json","https://opendata.rdw.nl/resource/kmfi-hrps.json"
"NH107R","Personenauto","RENAULT","RENAULT CLIO 75","20241019","20211113","1473","hatchback","5","WIT","Niet geregistreerd","4","1149","952","1566","1052",,"900","20161019","20170131","Geen verstrekking in Open Data","19805","Ja",,,,,,,"4","4",,,,,,"M1",,,"r. kofferruimte","1566",,,,,,,"0.05","259","Nee","Nee",,"Nee","2466",,,"2023","Geen oordeel","05","Ja","2024-10-19T00:00:00.000","2021-11-13T00:00:00.000","2016-10-19T00:00:00.000","2017-01-31T00:00:00.000",,,,,,,,,,,,,,,,,,,,,,,,,,,,"https://opendata.rdw.nl/resource/3huj-srit.json","https://opendata.rdw.nl/resource/8ys7-d773.json","https://opendata.rdw.nl/resource/vezc-m2t6.json","https://opendata.rdw.nl/resource/jhie-znh9.json","https://opendata.rdw.nl/resource/kmfi-hrps.json"
"NH244V","Personenauto","RENAULT","RENAULT CLIO GT 120 EDC","20250130","20230223","2160","stationwagen","5","ZWART","Niet geregistreerd","4","1197","1099","1705","1199",,,"20130410","20170307","Geen verstrekking in Open Data","23085","Ja",,,,,,,"4","4",,,,,,"M1",,,"r. bodemplaat by kofferruimte","1705",,,,,,,"0.07","259","Nee","Nee",,"Nee","2605",,,"2024","Geen oordeel","05","Ja","2025-01-30T00:00:00.000","2023-02-23T00:00:00.000","2013-04-10T00:00:00.000","2017-03-07T00:00:00.000",,,,,,,,,,,,,,,,,,,,,,,,,,,,"https://opendata.rdw.nl/resource/3huj-srit.json","https://opendata.rdw.nl/resource/8ys7-d773.json","https://opendata.rdw.nl/resource/vezc-m2t6.json","https://opendata.rdw.nl/resource/jhie-znh9.json","https://opendata.rdw.nl/resource/kmfi-hrps.json"
"P583LP","Personenauto","RENAULT","RENAULT CLIO","20250629","20220413","2055","hatchback","5","ZWART","Niet geregistreerd","4","1149","1065","1580","1165",,"920","20090506","20220413","Geen verstrekking in Open Data",,"Ja","167",,,,,,"4","4",,,,,,"M1",,,,"1580","R",,,,,,"0.05","258","Nee","Nee",,"Nee","2500",,,"2024","Geen oordeel","05","Ja","2025-06-29T00:00:00.000","2022-04-13T00:00:00.000","2009-05-06T00:00:00.000","2022-04-13T00:00:00.000",,,,,,,,,,,,,,,,,,,,,,"20220331","2022-03-31T00:00:00.000",,,,,"https://opendata.rdw.nl/resource/3huj-srit.json","https://opendata.rdw.nl/resource/8ys7-d773.json","https://opendata.rdw.nl/resource/vezc-m2t6.json","https://opendata.rdw.nl/resource/jhie-znh9.json","https://opendata.rdw.nl/resource/kmfi-hrps.json"
"PB748N","Personenauto","RENAULT","RENAULT CLIO","20240726","20220925","1858","hatchback","5","ZWART","Niet geregistreerd","4","1149","1075","1588","1175",,,"20120508","20170609","Geen verstrekking in Open Data","17533","Ja",,,,,,,"4","4",,,,,,"M1",,,"by kofferruimte","1588",,,,,,,"0.06","258","Nee","Nee",,"Nee",,,,"2024","Geen oordeel","05","Ja","2024-07-26T00:00:00.000","2022-09-25T00:00:00.000","2012-05-08T00:00:00.000","2017-06-09T00:00:00.000",,,,,,,,,,,,,,,,,,,,,,,,,,,,"https://opendata.rdw.nl/resource/3huj-srit.json","https://opendata.rdw.nl/resource/8ys7-d773.json","https://opendata.rdw.nl/resource/vezc-m2t6.json","https://opendata.rdw.nl/resource/jhie-znh9.json","https://opendata.rdw.nl/resource/kmfi-hrps.json"
"PD732V","Personenauto","RENAULT","RENAULT CLIO","20250413","20210220","2456","hatchback","5","GRIJS","Niet geregistreerd","4","1149","940","1510","1040",,,"20040303","20170610","Geen verstrekking in Open Data",,"Ja",,,,,,,"4","4",,,,,,"M1",,,"r. bodemplaat by voorzitting","1510","B",,,,,,"0.05","247","Nee","Nee",,"Nee","2250",,,"2024","Geen oordeel","05","Ja","2025-04-13T00:00:00.000","2021-02-20T00:00:00.000","2004-03-03T00:00:00.000","2017-06-10T00:00:00.000",,,,,,,,,,,,,,,,,,,,,,,,,,,,"https://opendata.rdw.nl/resource/3huj-srit.json","https://opendata.rdw.nl/resource/8ys7-d773.json","https://opendata.rdw.nl/resource/vezc-m2t6.json","https://opendata.rdw.nl/resource/jhie-znh9.json","https://opendata.rdw.nl/resource/kmfi-hrps.json"
"PX051T","Personenauto","RENAULT","RENAULT CLIO","20250524","20220524","512","hatchback","5","WIT","Niet geregistreerd","4","1149","913","1425","1013",,,"20130816","20180111","Geen verstrekking in Open Data","15003","Ja",,,,,,,"2","4",,,,,,"M1",,,"r. voorzitting by bodemplaat","1425",,,,,,,"0.04","247","Nee","Nee",,"Nee","2150",,,"2024","Geen oordeel","05","Ja","2025-05-24T00:00:00.000","2022-05-24T00:00:00.000","2013-08-16T00:00:00.000","2018-01-11T00:00:00.000",,,,,,,,,,,,,,,,,,,,,,,,,,,,"https://opendata.rdw.nl/resource/3huj-srit.json","https://opendata.rdw.nl/resource/8ys7-d773.json","https://opendata.rdw.nl/resource/vezc-m2t6.json","https://opendata.rdw.nl/resource/jhie-znh9.json","https://opendata.rdw.nl/resource/kmfi-hrps.json"
"R614GZ","Personenauto","RENAULT","RENAULT CLIO","20241202","20240302",,"hatchback","5","ROOD","Niet geregistreerd","4","1390","750","1315","850",,,"19920611","20220827","Geen verstrekking in Open Data",,"Ja","175",,,,,,"3","4",,,,"371","162","M1",,,,"1315","B/C 57",,,,,,"0.06","247","Nee","Nee",,"Nee",,,,"2022","Geen oordeel","05","Ja","2024-12-02T00:00:00.000","2024-03-02T00:00:00.000","1992-06-11T00:00:00.000","2022-08-27T00:00:00.000",,,,,,,,,,,,,,,,,,,,,,"20220819","2022-08-19T00:00:00.000",,,,,"https://opendata.rdw.nl/resource/3huj-srit.json","https://opendata.rdw.nl/resource/8ys7-d773.json","https://opendata.rdw.nl/resource/vezc-m2t6.json","https://opendata.rdw.nl/resource/jhie-znh9.json","https://opendata.rdw.nl/resource/kmfi-hrps.json"
"R632DR","Personenauto","RENAULT","RENAULT CLIO","20250228","20231106",,"hatchback","5","BLAUW","Niet geregistreerd","4","1390","908","1440","1008",,,"19970212","20220729","Geen verstrekking in Open Data",,"Ja",,,,,,,"2","4",,,,,,"M1",,,,"1440",,,,,,,"0.05","248","Nee","Nee",,"Nee","2140",,,"2024","Onlogisch","04","Ja","2025-02-28T00:00:00.000","2023-11-06T00:00:00.000","1997-02-12T00:00:00.000","2022-07-29T00:00:00.000",,,,,,,,,,,,,,,,,,,,,,"20220728","2022-07-28T00:00:00.000",,,,,"https://opendata.rdw.nl/resource/3huj-srit.json","https://opendata.rdw.nl/resource/8ys7-d773.json","https://opendata.rdw.nl/resource/vezc-m2t6.json","https://opendata.rdw.nl/resource/jhie-znh9.json","https://opendata.rdw.nl/resource/kmfi-hrps.json"
"RK494F","Personenauto","RENAULT","RENAULT CLIO 120EDC","20250305","20240320","1919","hatchback","5","GRIJS","Niet geregistreerd","4","1197","1065","1686","1165","580","900","20161212","20171209","Geen verstrekking in Open Data","26189","Ja",,,,,,,"4","4",,,,,,"M1",,,,"1686",,,,,,,"0.07","260","Nee","Nee",,"Nee","2586",,,"2024","Geen oordeel","05","Ja","2025-03-05T00:00:00.000","2024-03-20T00:00:00.000","2016-12-12T00:00:00.000","2017-12-09T00:00:00.000",,,,,,,,,,,,,,,,,,,,,,,,,,,,"https://opendata.rdw.nl/resource/3huj-srit.json","https://opendata.rdw.nl/resource/8ys7-d773.json","https://opendata.rdw.nl/resource/vezc-m2t6.json","https://opendata.rdw.nl/resource/jhie-znh9.json","https://opendata.rdw.nl/resource/kmfi-hrps.json"
"RL388F","Personenauto","RENAULT","RENAULT CLIO","20250208","20240501","237","hatchback","5","GRIJS","Niet geregistreerd","4","1149","962","1580","1062",,,"20120208","20171218","Geen verstrekking in Open Data","14966","Ja",,,,,,,"4","4",,,,,,"M1",,,"r. onder achterzitting","1580",,,,,,,"0.05","258","Nee","Nee",,"Nee",,,,"2024","Geen oordeel","05","Ja","2025-02-08T00:00:00.000","2024-05-01T00:00:00.000","2012-02-08T00:00:00.000","2017-12-18T00:00:00.000",,,,,,,,,,,,,,,,,,,,,,,,,,,,"https://opendata.rdw.nl/resource/3huj-srit.json","https://opendata.rdw.nl/resource/8ys7-d773.json","https://opendata.rdw.nl/resource/vezc-m2t6.json","https://opendata.rdw.nl/resource/jhie-znh9.json","https://opendata.rdw.nl/resource/kmfi-hrps.json"
"SB154B","Personenauto","RENAULT","RENAULT CLIO","20240718","20240207","4785","hatchback","5","GRIJS","Niet geregistreerd","4","1461","1000","1535","1100",,,"20041105","20180405","Geen verstrekking in Open Data",,"Nee",,,,,,,"4","4",,,,,,"M1",,,"r. op dwarsbalk by voorzitting","1535","B",,,,,,"0.04","247","Nee","Nee",,"Nee",,,,"2023","Geen oordeel","05","Ja","2024-07-18T00:00:00.000","2024-02-07T00:00:00.000","2004-11-05T00:00:00.000","2018-04-05T00:00:00.000",,,,,,,,,,,,,,,,,,,,,,,,,,,,"https://opendata.rdw.nl/resource/3huj-srit.json","https://opendata.rdw.nl/resource/8ys7-d773.json","https://opendata.rdw.nl/resource/vezc-m2t6.json","https://opendata.rdw.nl/resource/jhie-znh9.json","https://opendata.rdw.nl/resource/kmfi-hrps.json"
"TP931Z","Personenauto","RENAULT","RENAULT CLIO","20241109","20181108","5014","hatchback","5","ZWART","Niet geregistreerd","4","1149","1075","1588","1175",,,"20080411","20181108","Geen verstrekking in Open Data",,"Ja",,,,,,,"4","4",,,,,,"M1",,,"r. kofferruimte","1588",,,,,,,"0.06","258","Nee","Nee",,"Nee",,,,"2023","Geen oordeel","05","Ja","2024-11-09T00:00:00.000","2018-11-08T00:00:00.000","2008-04-11T00:00:00.000","2018-11-08T00:00:00.000",,,,,,,,,,,,,,,,,,,,,,,,,,,,"https://opendata.rdw.nl/resource/3huj-srit.json","https://opendata.rdw.nl/resource/8ys7-d773.json","https://opendata.rdw.nl/resource/vezc-m2t6.json","https://opendata.rdw.nl/resource/jhie-znh9.json","https://opendata.rdw.nl/resource/kmfi-hrps.json"
"TS380F","Personenauto","RENAULT","RENAULT CLIO 1.2","20251114","20231117","851","stationwagen","5","GRIJS","Niet geregistreerd","4","1197","1170","1695","1270",,,"20180524","20181117","Geen verstrekking in Open Data","24190","Ja",,,,,,,"4","4",,,,,,"M1",,,,"1695","7",,,,,,"0.07","259","Nee","Nee",,"Nee","2595",,,"2023","Geen oordeel","05","Ja","2025-11-14T00:00:00.000","2023-11-17T00:00:00.000","2018-05-24T00:00:00.000","2018-11-17T00:00:00.000",,,,,,,,,,,,,,,,,,,,,,,,,,,,"https://opendata.rdw.nl/resource/3huj-srit.json","https://opendata.rdw.nl/resource/8ys7-d773.json","https://opendata.rdw.nl/resource/vezc-m2t6.json","https://opendata.rdw.nl/resource/jhie-znh9.json","https://opendata.rdw.nl/resource/kmfi-hrps.json"
"X241TB","Personenauto","RENAULT","RENAULT CLIO","20250327","20240125","328","hatchback","5","GRIJS","Niet geregistreerd","4","1149","1065","1580","1165",,,"20080327","20240120","Geen verstrekking in Open Data",,"Ja","167",,,,,,"4","4",,,,,,"M1",,,,"1580",,,,,,,"0.05","258","Nee","Nee",,"Nee","2500",,,"2024","Geen oordeel","05","Ja","2025-03-27T00:00:00.000","2024-01-25T00:00:00.000","2008-03-27T00:00:00.000","2024-01-20T00:00:00.000",,,,,,,,,,,,,,,,,,,,,,"20240116","2024-01-16T00:00:00.000",,,,,"https://opendata.rdw.nl/resource/3huj-srit.json","https://opendata.rdw.nl/resource/8ys7-d773.json","https://opendata.rdw.nl/resource/vezc-m2t6.json","https://opendata.rdw.nl/resource/jhie-znh9.json","https://opendata.rdw.nl/resource/kmfi-hrps.json"
"X251PX","Personenauto","RENAULT","RENAULT CLIO","19990423",,,"hatchback","5","GROEN","Niet geregistreerd","4","1390","888","1470","988",,,"19960423",,"Geen verstrekking in Open Data",,"Nee",,,,,,,"2","4",,,,,,"M1",,,,"1470",,,,,,,"0.06","248","Nee","Nee",,"Nee",,,,"2023","Geen oordeel","05","Ja","1999-04-23T00:00:00.000",,"1996-04-23T00:00:00.000",,,,,,,,,,,,,,,,,,,,,,,"20231218","2023-12-18T00:00:00.000",,,,,"https://opendata.rdw.nl/resource/3huj-srit.json","https://opendata.rdw.nl/resource/8ys7-d773.json","https://opendata.rdw.nl/resource/vezc-m2t6.json","https://opendata.rdw.nl/resource/jhie-znh9.json","https://opendata.rdw.nl/resource/kmfi-hrps.json"
"X652JZ","Personenauto","RENAULT","RENAULT CLIO","20260122","20240124","70","hatchback","5","GRIJS","Niet geregistreerd","3","999","1065","1603","1165",,,"20200910","20240124","Geen verstrekking in Open Data","25806","Ja",,,,,,,"4","4",,,,,,"M1",,,,"1603","RJABE2MT5TA28A5000",,,,,,"0.06","258","Nee","Nee",,"Nee","2503",,,"2024","Geen oordeel","05","Ja","2026-01-22T00:00:00.000","2024-01-24T00:00:00.000","2020-09-10T00:00:00.000","2024-01-24T00:00:00.000",,,,,,,,,,,,,,,,,,,,,,"20231116","2023-11-16T00:00:00.000",,,,,"https://opendata.rdw.nl/resource/3huj-srit.json","https://opendata.rdw.nl/resource/8ys7-d773.json","https://opendata.rdw.nl/resource/vezc-m2t6.json","https://opendata.rdw.nl/resource/jhie-znh9.json","https://opendata.rdw.nl/resource/kmfi-hrps.json"
"XB904L","Personenauto","RENAULT","RENAULT CLIO","20241215","20191126","291","hatchback","5","ZWART","Niet geregistreerd","4","1461","1140","1655","1240",,,"20090525","20181126","Geen verstrekking in Open Data",,"Ja",,,,,,,"4","4",,,,,,"M1",,,"r. kofferruimte","1655",,,,,,,"0.04","258","Nee","Nee",,"Nee","2550",,,"2023","Geen oordeel","05","Ja","2024-12-15T00:00:00.000","2019-11-26T00:00:00.000","2009-05-25T00:00:00.000","2018-11-26T00:00:00.000",,,,,,,,,,,,,,,,,,,,,,,,,,,,"https://opendata.rdw.nl/resource/3huj-srit.json","https://opendata.rdw.nl/resource/8ys7-d773.json","https://opendata.rdw.nl/resource/vezc-m2t6.json","https://opendata.rdw.nl/resource/jhie-znh9.json","https://opendata.rdw.nl/resource/kmfi-hrps.json"
"Z051LB","Personenauto","RENAULT","RENAULT CLIO","20260507","20240508","99","hatchback","5","GRIJS","Niet geregistreerd","3","898","1057","1621","1157",,"700","20180627","20240508","Geen verstrekking in Open Data","20264","Ja",,,,,,,"4","4",,,,,,"M1",,,,"1621",,,,,,,"0.06","259","Nee","Nee",,"Nee","2521",,,"2024","Geen oordeel","05","Ja","2026-05-07T00:00:00.000","2024-05-08T00:00:00.000","2018-06-27T00:00:00.000","2024-05-08T00:00:00.000",,,,,,,,,,,,,,,,,,,,,,"20240418","2024-04-18T00:00:00.000",,,,,"https://opendata.rdw.nl/resource/3huj-srit.json","https://opendata.rdw.nl/resource/8ys7-d773.json","https://opendata.rdw.nl/resource/vezc-m2t6.json","https://opendata.rdw.nl/resource/jhie-znh9.json","https://opendata.rdw.nl/resource/kmfi-hrps.json"
"ZG653B","Personenauto","RENAULT","RENAULT CLIO 90","20250209","20190513","7348","hatchback","5","ROOD","Niet geregistreerd","3","898","992","1600","1092",,,"20160209","20190513","Geen verstrekking in Open Data","23755","Ja",,,,,,,"4","4",,,,,,"M1",,,"r. bodemplaat kofferruimte","1600","RENAULT CLIO 90",,,,,,"0.06","259","Nee","Nee",,"Nee","2500",,,"2023","Geen oordeel","05","Ja","2025-02-09T00:00:00.000","2019-05-13T00:00:00.000","2016-02-09T00:00:00.000","2019-05-13T00:00:00.000",,,,,,,,,,,,,,,,,,,,,,,,,,,,"https://opendata.rdw.nl/resource/3huj-srit.json","https://opendata.rdw.nl/resource/8ys7-d773.json","https://opendata.rdw.nl/resource/vezc-m2t6.json","https://opendata.rdw.nl/resource/jhie-znh9.json","https://opendata.rdw.nl/resource/kmfi-hrps.json"
