"kenteken","voertuigsoort","merk","handelsbenaming","vervaldatum_apk","datum_tenaamstelling","bruto_bpm","inrichting","aantal_zitplaatsen","eerste_kleur","tweede_kleur","aantal_cilinders","cilinderinhoud","massa_ledig_voertuig","toegestane_maximum_massa_voertuig","massa_rijklaar","maximum_massa_trekken_ongeremd","maximum_trekken_massa_geremd","datum_eerste_toelating","datum_eerste_tenaamstelling_in_nederland","wacht_op_keuren","catalogusprijs","wam_verzekerd","maximale_constructiesnelheid","laadvermogen","oplegger_geremd","aanhangwagen_autonoom_geremd","aanhangwagen_middenas_geremd","aantal_staanplaatsen","aantal_deuren","aantal_wielen","afstand_hart_koppeling_tot_achterzijde_voertuig","afstand_voorzijde_voertuig_tot_hart_koppeling","afwijkende_maximum_snelheid","lengte","breedte","europese_voertuigcategorie","europese_voertuigcategorie_toevoeging","europese_uitvoeringcategorie_toevoeging","plaats_chassisnummer","technische_max_massa_voertuig","type","type_gasinstallatie","typegoedkeuringsnummer","variant","uitvoering","volgnummer_wijziging_eu_typegoedkeuring","vermogen_massarijklaar","wielbasis","export_indicator","openstaande_terugroepactie_indicator","vervaldatum_tachograaf","taxi_indicator","maximum_massa_samenstelling","aantal_rolstoelplaatsen","maximum_ondersteunende_snelheid","jaar_laatste_registratie_tellerstand","tellerstandoordeel","code_toelichting_tellerstandoordeel","tenaamstellen_mogelijk","vervaldatum_apk_dt","datum_tenaamstelling_dt","datum_eerste_toelating_dt","datum_eerste_tenaamstelling_in_nederland_dt","vervaldatum_tachograaf_dt","maximum_last_onder_de_vooras_sen_tezamen_koppeling","type_remsysteem_voertuig_code","rupsonderstelconfiguratiecode","wielbasis_voertuig_minimum","wielbasis_voertuig_maximum","lengte_voertuig_minimum","lengte_voertuig_maximum","breedte_voertuig_minimum","breedte_voertuig_maximum","hoogte_voertuig","hoogte_voertuig_minimum","hoogte_voertuig_maximum","massa_bedrijfsklaar_minimaal","massa_bedrijfsklaar_maximaal","technisch_toelaatbaar_massa_koppelpunt","maximum_massa_technisch_maximaal","maximum_massa_technisch_minimaal","subcategorie_nederland","verticale_belasting_koppelpunt_getrokken_voertuig","zuinigheidsclassificatie","registratie_datum_goedkeuring_afschrijvingsmoment_bpm","registratie_datum_goedkeuring_afschrijvingsmoment_bpm_dt","gem_lading_wrde","aerodyn_voorz","massa_alt_aandr","verl_cab_ind","api_gekentekende_voertuigen_assen","api_gekentekende_voertuigen_brandstof","api_gekentekende_voertuigen_carrosserie","api_gekentekende_voertuigen_carrosserie_specifiek","api_gekentekende_voertuigen_voertuigklasse"
"09RFD4","Personenauto","PORSCHE","BOXSTER SPYDER","20241017","20231018","25665","cabriolet","2","WIT","Niet geregistreerd","6","3436","1250","1555","1350",,,"20110113","20110506","Geen verstrekking in Open Data","104099","Ja",,,,,,,"2","4","0","0",,"434","0","M1",,,"r. tegen schutbord in kofferruimte","1555","987",,"e13*2001/116*0141*10","KV11","A2","0","0.17","242","Nee","Nee",,"Nee","0","0",,"2023","Geen oordeel","05","Ja","2024-10-17T00:00:00.000","2023-10-18T00:00:00.000","2011-01-13T00:00:00.000","2011-05-06T00:00:00.000",,,,,,,,,,,,,,,,,,,,,"G",,,,,,,"https://opendata.rdw.nl/resource/3huj-srit.json","https://opendata.rdw.nl/resource/8ys7-d773.json","https://opendata.rdw.nl/resource/vezc-m2t6.json","https://opendata.rdw.nl/resource/jhie-znh9.json","https://opendata.rdw.nl/resource/kmfi-hrps.json"
"15LPV5","Personenauto","PORSCHE","BOXSTER SPYDER","20250219","20240216","19921","cabriolet","2","ZWART","Niet geregistreerd","6","3436","1275","1580","1375",,,"20100608","20100608","Geen verstrekking in Open Data","104473","Ja",,,,,,,"2","4","0","0",,"434","0","M1",,,"r. schutbord","1580","987",,"e13*2001/116*0141*09","KV12","A2","0","0.17","242","Nee","Nee",,"Nee","0","0",,"2024","Logisch","00","Ja","2025-02-19T00:00:00.000","2024-02-16T00:00:00.000","2010-06-08T00:00:00.000","2010-06-08T00:00:00.000",,,,,,,,,,,,,,,,,,,,,"F",,,,,,,"https://opendata.rdw.nl/resource/3huj-srit.json","https://opendata.rdw.nl/resource/8ys7-d773.json","https://opendata.rdw.nl/resource/vezc-m2t6.json","https://opendata.rdw.nl/resource/jhie-znh9.json","https://opendata.rdw.nl/resource/kmfi-hrps.json"
"1TZF60","Personenauto","PORSCHE","BOXSTER SPYDER","20240611","20150307","18449","cabriolet","2","WIT","Niet geregistreerd","6","3436","1275","1580","1375",,,"20100607","20140604","Geen verstrekking in Open Data","90839","Ja",,,,,,,"2","4","0","0",,"434","0","M1",,,"r. tegen schutbord in kofferruimte","1580","987",,"e13*2001/116*0141*09","KV12","A2","0","0.17","242","Nee","Nee",,"Nee","0","0",,"2023","Geen oordeel","05","Ja","2024-06-11T00:00:00.000","2015-03-07T00:00:00.000","2010-06-07T00:00:00.000","2014-06-04T00:00:00.000",,"0",,,,,,,,,,,,,,,,,,,"F",,,,,,,"https://opendata.rdw.nl/resource/3huj-srit.json","https://opendata.rdw.nl/resource/8ys7-d773.json","https://opendata.rdw.nl/resource/vezc-m2t6.json","https://opendata.rdw.nl/resource/jhie-znh9.json","https://opendata.rdw.nl/resource/kmfi-hrps.json"
"2KNP59","Personenauto","PORSCHE","BOXSTER SPYDER","20240711","20210626","16713","cabriolet","2","WIT","Niet geregistreerd","6","3436","1250","1555","1350",,,"20100617","20130604","Geen verstrekking in Open Data","90370","Ja",,,,,,,"2","4","0","0",,"434","0","M1",,,"r. tegen schutbord in kofferruimte","1555","987",,"e13*2001/116*0141*09","KV11","A2","0","0.17","242","Nee","Nee",,"Nee","0","0",,"2023","Geen oordeel","05","Ja","2024-07-11T00:00:00.000","2021-06-26T00:00:00.000","2010-06-17T00:00:00.000","2013-06-04T00:00:00.000",,"0",,,,,,,,,,,,,,,,,,,"G",,,,,,,"https://opendata.rdw.nl/resource/3huj-srit.json","https://opendata.rdw.nl/resource/8ys7-d773.json","https://opendata.rdw.nl/resource/vezc-m2t6.json","https://opendata.rdw.nl/resource/jhie-znh9.json","https://opendata.rdw.nl/resource/kmfi-hrps.json"
"46TBN7","Personenauto","PORSCHE","BOXSTER SPYDER","20200408","20120112","24833","cabriolet","2","WIT","Niet geregistreerd","6","3436","1275","1580","1375",,,"20120112","20120112","Geen verstrekking in Open Data","111281","Nee",,,,,,,"2","4","0","0",,"434","0","M1",,,"r. schutbord","1580","987",,"e13*2001/116*0141*12","KV12","A2","0","0.17","242","Nee","Nee",,"Nee","0","0",,"2018","Logisch","00","Ja","2020-04-08T00:00:00.000","2012-01-12T00:00:00.000","2012-01-12T00:00:00.000","2012-01-12T00:00:00.000",,,,,,,,,,,,,,,,,,,,,"G",,,,,,,"https://opendata.rdw.nl/resource/3huj-srit.json","https://opendata.rdw.nl/resource/8ys7-d773.json","https://opendata.rdw.nl/resource/vezc-m2t6.json","https://opendata.rdw.nl/resource/jhie-znh9.json","https://opendata.rdw.nl/resource/kmfi-hrps.json"
"64LLH6","Personenauto","PORSCHE","BOXSTER SPYDER","20241205","20180627","24486","cabriolet","2","WIT","Niet geregistreerd","6","3436","1275","1580","1375",,,"20100619","20100619","Geen verstrekking in Open Data","105296","Ja",,,,,,,"2","4","0","0",,"434","0","M1",,,"r. schutbord","1580","987",,"e13*2001/116*0141*09","KV12","A2","0","0.17","242","Nee","Nee",,"Nee","0","0",,"2023","Logisch","00","Ja","2024-12-05T00:00:00.000","2018-06-27T00:00:00.000","2010-06-19T00:00:00.000","2010-06-19T00:00:00.000",,,,,,,,,,,,,,,,,,,,,"F",,,,,,,"https://opendata.rdw.nl/resource/3huj-srit.json","https://opendata.rdw.nl/resource/8ys7-d773.json","https://opendata.rdw.nl/resource/vezc-m2t6.json","https://opendata.rdw.nl/resource/jhie-znh9.json","https://opendata.rdw.nl/resource/kmfi-hrps.json"
"88SZN2","Personenauto","PORSCHE","BOXSTER SPYDER","20241123","20121102","22777","cabriolet","2","WIT","Niet geregistreerd","6","3436","1275","1580","1375",,,"20120105","20120105","Geen verstrekking in Open Data","95775","Ja",,,,,,,"2","4","0","0",,"434","0","M1",,,"r. schutbord","1580","987",,"e13*2001/116*0141*09","KV12","A2","0","0.17","242","Nee","Nee",,"Nee","0","0",,"2023","Logisch","00","Ja","2024-11-23T00:00:00.000","2012-11-02T00:00:00.000","2012-01-05T00:00:00.000","2012-01-05T00:00:00.000",,,,,,,,,,,,,,,,,,,,,"G",,,,,,,"https://opendata.rdw.nl/resource/3huj-srit.json","https://opendata.rdw.nl/resource/8ys7-d773.json","https://opendata.rdw.nl/resource/vezc-m2t6.json","https://opendata.rdw.nl/resource/jhie-znh9.json","https://opendata.rdw.nl/resource/kmfi-hrps.json"
"G114VZ","Personenauto","PORSCHE","BOXSTER SPYDER","20241103","20191211","39895","cabriolet","2","WIT","Niet geregistreerd","6","3800","1290","1650","1390",,,"20160617","20191211","Geen verstrekking in Open Data","141549","Ja","290",,,,,,"2","4","0","0",,"441","0","M1",,,,"1650","981",,"e13*2007/46*1185*05","KY11","09","0","0.20","248","Nee","Nee",,"Nee","0","0",,"2023","Geen oordeel","05","Ja","2024-11-03T00:00:00.000","2019-12-11T00:00:00.000","2016-06-17T00:00:00.000","2019-12-11T00:00:00.000",,,,,,,,,,,"126",,,,,,,,,,"G",,,,,,,"https://opendata.rdw.nl/resource/3huj-srit.json","https://opendata.rdw.nl/resource/8ys7-d773.json","https://opendata.rdw.nl/resource/vezc-m2t6.json","https://opendata.rdw.nl/resource/jhie-znh9.json","https://opendata.rdw.nl/resource/kmfi-hrps.json"
"G188TX","Personenauto","PORSCHE","718 BOXSTER SPYDER","20251215","20191212","51258","cabriolet","2","GRIJS","Niet geregistreerd","6","3995","1395","1720","1495",,,"20191212","20191212","Geen verstrekking in Open Data","175306","Ja","301",,,,,,"2","4","0","0",,"443","180","M1",,,,"1720","982",,"e13*2007/46*1607*09","KG11","32","0","0.21","248","Nee","Nee",,"Nee","0","0","0.00","2024","Logisch","00","Ja","2025-12-15T00:00:00.000","2019-12-12T00:00:00.000","2019-12-12T00:00:00.000","2019-12-12T00:00:00.000",,,,,,,,,,,"125",,,,,,,,,,,,,,,,,"https://opendata.rdw.nl/resource/3huj-srit.json","https://opendata.rdw.nl/resource/8ys7-d773.json","https://opendata.rdw.nl/resource/vezc-m2t6.json","https://opendata.rdw.nl/resource/jhie-znh9.json","https://opendata.rdw.nl/resource/kmfi-hrps.json"
"G675PZ","Personenauto","PORSCHE","718 BOXSTER SPYDER","20251115","20191115","51258","cabriolet","2","WIT","Niet geregistreerd","6","3995","1395","1720","1495",,,"20191115","20191115","Geen verstrekking in Open Data","162922","Ja","301",,,,,,"2","4","0","0",,"443","180","M1",,,,"1720","982",,"e13*2007/46*1607*09","KG11","32","0","0.21","248","Nee","Nee",,"Nee","0","0","0.00","2023","Logisch","00","Ja","2025-11-15T00:00:00.000","2019-11-15T00:00:00.000","2019-11-15T00:00:00.000","2019-11-15T00:00:00.000",,,,,,,,,,,"125",,,,,,,,,,,,,,,,,"https://opendata.rdw.nl/resource/3huj-srit.json","https://opendata.rdw.nl/resource/8ys7-d773.json","https://opendata.rdw.nl/resource/vezc-m2t6.json","https://opendata.rdw.nl/resource/jhie-znh9.json","https://opendata.rdw.nl/resource/kmfi-hrps.json"
"G984PR","Personenauto","PORSCHE","718 BOXSTER SPYDER","20260117","20191113","51258","cabriolet","2","ZWART","Niet geregistreerd","6","3995","1395","1720","1495",,,"20191113","20191113","Geen verstrekking in Open Data","154622","Ja","301",,,,,,"2","4","0","0",,"443","180","M1",,,,"1720","982",,"e13*2007/46*1607*09","KG11","32","0","0.21","248","Nee","Nee",,"Nee","0","0","0.00","2024","Logisch","00","Ja","2026-01-17T00:00:00.000","2019-11-13T00:00:00.000","2019-11-13T00:00:00.000","2019-11-13T00:00:00.000",,,,,,,,,,,"125",,,,,,,,,,,,,,,,,"https://opendata.rdw.nl/resource/3huj-srit.json","https://opendata.rdw.nl/resource/8ys7-d773.json","https://opendata.rdw.nl/resource/vezc-m2t6.json","https://opendata.rdw.nl/resource/jhie-znh9.json","https://opendata.rdw.nl/resource/kmfi-hrps.json"
"GR561L","Personenauto","PORSCHE","BOXSTER SPYDER","20250516","20150722","19898","cabriolet","2","GRIJS","Niet geregistreerd","6","3436","1250","1555","1350",,,"20110617","20150722","Geen verstrekking in Open Data","90755","Ja",,,,,,,"2","4","0","0",,"434","0","M1",,,"r. tegen schutbord in kofferruimte","1555","987",,"e13*2001/116*0141*12","KV11","A2","0","0.17","242","Nee","Nee",,"Nee","0","0",,"2024","Geen oordeel","05","Ja","2025-05-16T00:00:00.000","2015-07-22T00:00:00.000","2011-06-17T00:00:00.000","2015-07-22T00:00:00.000",,,,,,,,,,,,,,,,,,,,,"G",,,,,,,"https://opendata.rdw.nl/resource/3huj-srit.json","https://opendata.rdw.nl/resource/8ys7-d773.json","https://opendata.rdw.nl/resource/vezc-m2t6.json","https://opendata.rdw.nl/resource/jhie-znh9.json","https://opendata.rdw.nl/resource/kmfi-hrps.json"
"GX003G","Personenauto","PORSCHE","BOXSTER SPYDER","20240803","20210205","34239","cabriolet","2","GRIJS","Niet geregistreerd","6","3800","1290","1650","1390",,,"20150903","20150903","Geen verstrekking in Open Data","132996","Ja",,,,,,,"2","4","0","0",,"441","0","M1",,,"r. dwarsbalk by voorzitting","1650","981",,"e13*2007/46*1185*05","KY11","09","0","0.20","248","Nee","Ja",,"Nee","0","0",,"2022","Logisch","00","Ja","2024-08-03T00:00:00.000","2021-02-05T00:00:00.000","2015-09-03T00:00:00.000","2015-09-03T00:00:00.000",,,,,,,,,,,,,,,,,,,,,"G",,,,,,,"https://opendata.rdw.nl/resource/3huj-srit.json","https://opendata.rdw.nl/resource/8ys7-d773.json","https://opendata.rdw.nl/resource/vezc-m2t6.json","https://opendata.rdw.nl/resource/jhie-znh9.json","https://opendata.rdw.nl/resource/kmfi-hrps.json"
"H163PT","Personenauto","PORSCHE","718 BOXSTER SPYDER","20260402","20200402","52857","cabriolet","2","GRIJS","Niet geregistreerd","6","3995","1395","1720","1495",,,"20200402","20200402","Geen verstrekking in Open Data","183203","Ja","301",,,,,,"2","4","0","0",,"443","180","M1",,,,"1720","982",,"e13*2007/46*1607*09","KG11","32","0","0.21","248","Nee","Nee",,"Nee","0","0","0.00","2024","Logisch","00","Ja","2026-04-02T00:00:00.000","2020-04-02T00:00:00.000","2020-04-02T00:00:00.000","2020-04-02T00:00:00.000",,,,,,,,,,,"125",,,,,,,,,,"G",,,,,,,"https://opendata.rdw.nl/resource/3huj-srit.json","https://opendata.rdw.nl/resource/8ys7-d773.json","https://opendata.rdw.nl/resource/vezc-m2t6.json","https://opendata.rdw.nl/resource/jhie-znh9.json","https://opendata.rdw.nl/resource/kmfi-hrps.json"
"H173GZ","Personenauto","PORSCHE","BOXSTER SPYDER","20250310","20210918","34237","cabriolet","2","GRIJS","Niet geregistreerd","6","3800","1290","1650","1390",,,"20151127","20200130","Geen verstrekking in Open Data","126480","Ja","290",,,,,,"2","4","0","0",,"441","0","M1",,,,"1650","981",,"e13*2007/46*1185*05","KY11","09","0","0.20","248","Nee","Nee",,"Nee","0","0",,"2024","Geen oordeel","05","Ja","2025-03-10T00:00:00.000","2021-09-18T00:00:00.000","2015-11-27T00:00:00.000","2020-01-30T00:00:00.000",,,,,,,,,,,"126",,,,,,,,,,"G",,,,,,,"https://opendata.rdw.nl/resource/3huj-srit.json","https://opendata.rdw.nl/resource/8ys7-d773.json","https://opendata.rdw.nl/resource/vezc-m2t6.json","https://opendata.rdw.nl/resource/jhie-znh9.json","https://opendata.rdw.nl/resource/kmfi-hrps.json"
"H244NG","Personenauto","PORSCHE","BOXSTER SPYDER","20240327","20200318","39897","cabriolet","2","GRIJS","Niet geregistreerd","6","3800","1290","1650","1390",,,"20160112","20200318","Geen verstrekking in Open Data","133356","Ja","290",,,,,,"2","4","0","0",,"441","0","M1",,,,"1650","981",,"e13*2007/46*1185*05","KY11","09","0","0.20","248","Nee","Nee",,"Nee","0","0",,"2022","Geen oordeel","05","Ja","2024-03-27T00:00:00.000","2020-03-18T00:00:00.000","2016-01-12T00:00:00.000","2020-03-18T00:00:00.000",,,,,,,,,,,"126",,,,,,,,,,"G",,,,,,,"https://opendata.rdw.nl/resource/3huj-srit.json","https://opendata.rdw.nl/resource/8ys7-d773.json","https://opendata.rdw.nl/resource/vezc-m2t6.json","https://opendata.rdw.nl/resource/jhie-znh9.json","https://opendata.rdw.nl/resource/kmfi-hrps.json"
"H536LR","Personenauto","PORSCHE","BOXSTER SPYDER","20250329","20230828","39897","cabriolet","2","GRIJS","Niet geregistreerd","6","3800","1290","1650","1390",,,"20160603","20200303","Geen verstrekking in Open Data","125331","Ja",,,,,,,"2","4","0","0",,"441","0","M1",,,"r. dwarsbalk by voorzitting","1650","981",,"e13*2007/46*1185*05","KY11","09","0","0.20","248","Nee","Nee",,"Nee","0","0",,"2023","Geen oordeel","05","Ja","2025-03-29T00:00:00.000","2023-08-28T00:00:00.000","2016-06-03T00:00:00.000","2020-03-03T00:00:00.000",,,,,,,,,,,"126",,,,,,,,,,"G",,,,,,,"https://opendata.rdw.nl/resource/3huj-srit.json","https://opendata.rdw.nl/resource/8ys7-d773.json","https://opendata.rdw.nl/resource/vezc-m2t6.json","https://opendata.rdw.nl/resource/jhie-znh9.json","https://opendata.rdw.nl/resource/kmfi-hrps.json"
"H943GP","Personenauto","PORSCHE","718 BOXSTER SPYDER","20260131","20200131","52857","cabriolet","2","WIT","Niet geregistreerd","6","3995","1395","1720","1495",,,"20200131","20200131","Geen verstrekking in Open Data","157401","Ja","301",,,,,,"2","4","0","0",,"443","180","M1",,,,"1720","982",,"e13*2007/46*1607*09","KG11","32","0","0.21","248","Nee","Nee",,"Nee","0","0","0.00","2024","Logisch","00","Ja","2026-01-31T00:00:00.000","2020-01-31T00:00:00.000","2020-01-31T00:00:00.000","2020-01-31T00:00:00.000",,,,,,,,,,,"125",,,,,,,,,,"G",,,,,,,"https://opendata.rdw.nl/resource/3huj-srit.json","https://opendata.rdw.nl/resource/8ys7-d773.json","https://opendata.rdw.nl/resource/vezc-m2t6.json","https://opendata.rdw.nl/resource/jhie-znh9.json","https://opendata.rdw.nl/resource/kmfi-hrps.json"
"H957BX","Personenauto","PORSCHE","718 BOXSTER SPYDER","20240130","20200130","51258","cabriolet","2","WIT","Niet geregistreerd","6","3995","1395","1720","1495",,,"20200130","20200130","Geen verstrekking in Open Data","168146","Ja","301",,,,,,"2","4","0","0",,"443","180","M1",,,,"1720","982",,"e13*2007/46*1607*09","KG11","32","0","0.21","248","Nee","Nee",,"Nee","0","0","0.00","2022","Logisch","00","Ja","2024-01-30T00:00:00.000","2020-01-30T00:00:00.000","2020-01-30T00:00:00.000","2020-01-30T00:00:00.000",,,,,,,,,,,"125",,,,,,,,,,"G",,,,,,,"https://opendata.rdw.nl/resource/3huj-srit.json","https://opendata.rdw.nl/resource/8ys7-d773.json","https://opendata.rdw.nl/resource/vezc-m2t6.json","https://opendata.rdw.nl/resource/jhie-znh9.json","https://opendata.rdw.nl/resource/kmfi-hrps.json"
"HB162D","Personenauto","PORSCHE","BOXSTER SPYDER","20241001","20201001","34239","cabriolet","2","GRIJS","Niet geregistreerd","6","3800","1290","1650","1390",,,"20150930","20150930","Geen verstrekking in Open Data","131703","Ja",,,,,,,"2","4","0","0",,"441","0","M1",,,"r. dwarsbalk by voorzitting","1650","981",,"e13*2007/46*1185*05","KY11","09","0","0.20","248","Nee","Nee",,"Nee","0","0",,"2023","Logisch","00","Ja","2024-10-01T00:00:00.000","2020-10-01T00:00:00.000","2015-09-30T00:00:00.000","2015-09-30T00:00:00.000",,,,,,,,,,,,,,,,,,,,,"G",,,,,,,"https://opendata.rdw.nl/resource/3huj-srit.json","https://opendata.rdw.nl/resource/8ys7-d773.json","https://opendata.rdw.nl/resource/vezc-m2t6.json","https://opendata.rdw.nl/resource/jhie-znh9.json","https://opendata.rdw.nl/resource/kmfi-hrps.json"
"HB218D","Personenauto","PORSCHE","BOXSTER SPYDER","20241117","20151002","34239","cabriolet","2","WIT","Niet geregistreerd","6","3800","1290","1650","1390",,,"20151002","20151002","Geen verstrekking in Open Data","132638","Ja",,,,,,,"2","4","0","0",,"441","0","M1",,,"r. dwarsbalk by voorzitting","1650","981",,"e13*2007/46*1185*05","KY11","09","0","0.20","248","Nee","Nee",,"Nee","0","0",,"2023","Logisch","00","Ja","2024-11-17T00:00:00.000","2015-10-02T00:00:00.000","2015-10-02T00:00:00.000","2015-10-02T00:00:00.000",,,,,,,,,,,,,,,,,,,,,"G",,,,,,,"https://opendata.rdw.nl/resource/3huj-srit.json","https://opendata.rdw.nl/resource/8ys7-d773.json","https://opendata.rdw.nl/resource/vezc-m2t6.json","https://opendata.rdw.nl/resource/jhie-znh9.json","https://opendata.rdw.nl/resource/kmfi-hrps.json"
"HG834R","Personenauto","PORSCHE","BOXSTER SPYDER","20241211","20201211","34239","cabriolet","2","ZWART","Niet geregistreerd","6","3800","1290","1650","1390",,,"20151030","20151030","Geen verstrekking in Open Data","130532","Ja","290",,,,,,"2","4","0","0",,"441","0","M1",,,"onder r. voorzitting","1650","981",,"e13*2007/46*1185*05","KY11","09","0","0.20","248","Nee","Nee",,"Nee","0","0",,"2023","Geen oordeel","05","Ja","2024-12-11T00:00:00.000","2020-12-11T00:00:00.000","2015-10-30T00:00:00.000","2015-10-30T00:00:00.000",,,,,,,,,,,,,,,,,,,,,"G",,,,,,,"https://opendata.rdw.nl/resource/3huj-srit.json","https://opendata.rdw.nl/resource/8ys7-d773.json","https://opendata.rdw.nl/resource/vezc-m2t6.json","https://opendata.rdw.nl/resource/jhie-znh9.json","https://opendata.rdw.nl/resource/kmfi-hrps.json"
"HJ834R","Personenauto","PORSCHE","BOXSTER SPYDER","20241210","20170315","34239","cabriolet","2","WIT","Niet geregistreerd","6","3800","1290","1650","1390",,,"20151114","20151114","Geen verstrekking in Open Data","130942","Ja",,,,,,,"2","4","0","0",,"441","180","M1",,,"onder r. voorzitting","1650","981",,"e13*2007/46*1185*05","KY11","09","0","0.20","248","Nee","Nee",,"Nee","0","0",,"2023","Logisch","00","Ja","2024-12-10T00:00:00.000","2017-03-15T00:00:00.000","2015-11-14T00:00:00.000","2015-11-14T00:00:00.000",,,,,,,,,,,"126",,,,,,,,,,"G",,,,,,,"https://opendata.rdw.nl/resource/3huj-srit.json","https://opendata.rdw.nl/resource/8ys7-d773.json","https://opendata.rdw.nl/resource/vezc-m2t6.json","https://opendata.rdw.nl/resource/jhie-znh9.json","https://opendata.rdw.nl/resource/kmfi-hrps.json"
"HP648F","Personenauto","PORSCHE","BOXSTER SPYDER","20241211","20151211","34239","cabriolet","2","GRIJS","Niet geregistreerd","6","3800","1290","1650","1390",,,"20151211","20151211","Geen verstrekking in Open Data","132032","Ja",,,,,,,"2","4","0","0",,"441","180","M1",,,"onder r. voorzitting","1650","981",,"e13*2007/46*1185*05","KY11","09","0","0.20","248","Nee","Nee",,"Nee","0","0",,"2023","Logisch","00","Ja","2024-12-11T00:00:00.000","2015-12-11T00:00:00.000","2015-12-11T00:00:00.000","2015-12-11T00:00:00.000",,,,,,,,,,,"126",,,,,,,,,,"G",,,,,,,"https://opendata.rdw.nl/resource/3huj-srit.json","https://opendata.rdw.nl/resource/8ys7-d773.json","https://opendata.rdw.nl/resource/vezc-m2t6.json","https://opendata.rdw.nl/resource/jhie-znh9.json","https://opendata.rdw.nl/resource/kmfi-hrps.json"
"HS108P","Personenauto","PORSCHE","BOXSTER SPYDER","20250502","20160128","34239","cabriolet","2","GRIJS","Niet geregistreerd","6","3800","1290","1650","1390",,,"20160128","20160128","Geen verstrekking in Open Data","134181","Ja",,,,,,,"2","4","0","0",,"441","180","M1",,,"onder r. voorzitting","1650","981",,"e13*2007/46*1185*05","KY11","09","0","0.20","248","Nee","Nee",,"Nee","0","0",,"2024","Logisch","00","Ja","2025-05-02T00:00:00.000","2016-01-28T00:00:00.000","2016-01-28T00:00:00.000","2016-01-28T00:00:00.000",,,,,,,,,,,"126",,,,,,,,,,"G",,,,,,,"https://opendata.rdw.nl/resource/3huj-srit.json","https://opendata.rdw.nl/resource/8ys7-d773.json","https://opendata.rdw.nl/resource/vezc-m2t6.json","https://opendata.rdw.nl/resource/jhie-znh9.json","https://opendata.rdw.nl/resource/kmfi-hrps.json"
"HT047R","Personenauto","PORSCHE","BOXSTER SPYDER","20250107","20200814","34239","cabriolet","2","WIT","Niet geregistreerd","6","3800","1290","1650","1390",,,"20160107","20160107","Geen verstrekking in Open Data","127074","Ja",,,,,,,"2","4","0","0",,"441","180","M1",,,"onder r. voorzitting","1650","981",,"e13*2007/46*1185*05","KY11","09","0","0.20","248","Nee","Nee",,"Nee","0","0",,"2024","Logisch","00","Ja","2025-01-07T00:00:00.000","2020-08-14T00:00:00.000","2016-01-07T00:00:00.000","2016-01-07T00:00:00.000",,,,,,,,,,,"126",,,,,,,,,,"G",,,,,,,"https://opendata.rdw.nl/resource/3huj-srit.json","https://opendata.rdw.nl/resource/8ys7-d773.json","https://opendata.rdw.nl/resource/vezc-m2t6.json","https://opendata.rdw.nl/resource/jhie-znh9.json","https://opendata.rdw.nl/resource/kmfi-hrps.json"