"kenteken","voertuigsoort","merk","handelsbenaming","vervaldatum_apk","datum_tenaamstelling","bruto_bpm","inrichting","aantal_zitplaatsen","eerste_kleur","tweede_kleur","aantal_cilinders","cilinderinhoud","massa_ledig_voertuig","toegestane_maximum_massa_voertuig","massa_rijklaar","maximum_massa_trekken_ongeremd","maximum_trekken_massa_geremd","datum_eerste_toelating","datum_eerste_tenaamstelling_in_nederland","wacht_op_keuren","catalogusprijs","wam_verzekerd","maximale_constructiesnelheid","laadvermogen","oplegger_geremd","aanhangwagen_autonoom_geremd","aanhangwagen_middenas_geremd","aantal_staanplaatsen","aantal_deuren","aantal_wielen","afstand_hart_koppeling_tot_achterzijde_voertuig","afstand_voorzijde_voertuig_tot_hart_koppeling","afwijkende_maximum_snelheid","lengte","breedte","europese_voertuigcategorie","europese_voertuigcategorie_toevoeging","europese_uitvoeringcategorie_toevoeging","plaats_chassisnummer","technische_max_massa_voertuig","type","type_gasinstallatie","typegoedkeuringsnummer","variant","uitvoering","volgnummer_wijziging_eu_typegoedkeuring","vermogen_massarijklaar","wielbasis","export_indicator","openstaande_terugroepactie_indicator","vervaldatum_tachograaf","taxi_indicator","maximum_massa_samenstelling","aantal_rolstoelplaatsen","maximum_ondersteunende_snelheid","jaar_laatste_registratie_tellerstand","tellerstandoordeel","code_toelichting_tellerstandoordeel","tenaamstellen_mogelijk","vervaldatum_apk_dt","datum_tenaamstelling_dt","datum_eerste_toelating_dt","datum_eerste_tenaamstelling_in_nederland_dt","vervaldatum_tachograaf_dt","maximum_last_onder_de_vooras_sen_tezamen_koppeling","type_remsysteem_voertuig_code","rupsonderstelconfiguratiecode","wielbasis_voertuig_minimum","wielbasis_voertuig_maximum","lengte_voertuig_minimum","lengte_voertuig_maximum","breedte_voertuig_minimum","breedte_voertuig_maximum","hoogte_voertuig","hoogte_voertuig_minimum","hoogte_voertuig_maximum","massa_bedrijfsklaar_minimaal","massa_bedrijfsklaar_maximaal","technisch_toelaatbaar_massa_koppelpunt","maximum_massa_technisch_maximaal","maximum_massa_technisch_minimaal","subcategorie_nederland","verticale_belasting_koppelpunt_getrokken_voertuig","zuinigheidsclassificatie","registratie_datum_goedkeuring_afschrijvingsmoment_bpm","registratie_datum_goedkeuring_afschrijvingsmoment_bpm_dt","gem_lading_wrde","aerodyn_voorz","massa_alt_aandr","verl_cab_ind","api_gekentekende_voertuigen_assen","api_gekentekende_voertuigen_brandstof","api_gekentekende_voertuigen_carrosserie","api_gekentekende_voertuigen_carrosserie_specifiek","api_gekentekende_voertuigen_voertuigklasse"
"G217BN","Personenauto","MERCEDES-BENZ","CLA 220 CDI","20241025","20220604","727","stationwagen","5","GRIJS","Niet geregistreerd","4","2143","1455","2050","1555","750","1500","20150820","20190822","Geen verstrekking in Open Data","61660","Ja","228",,,,,,"5","4","0","0",,"0","178","M1",,,"r. dwarsbalk onder voorzitting","2050","245 G",,"e1*2001/116*0470*13","22S2P2","MZAAB552","0","0.08","270","Nee","Nee",,"Nee","3590","0","0.00","2023","Geen oordeel","05","Ja","2024-10-25T00:00:00.000","2022-06-04T00:00:00.000","2015-08-20T00:00:00.000","2019-08-22T00:00:00.000",,,,,,,,,,,,,,,,,,,,,"C",,,,,,,"https://opendata.rdw.nl/resource/3huj-srit.json","https://opendata.rdw.nl/resource/8ys7-d773.json","https://opendata.rdw.nl/resource/vezc-m2t6.json","https://opendata.rdw.nl/resource/jhie-znh9.json","https://opendata.rdw.nl/resource/kmfi-hrps.json"
"GF815H","Personenauto","MERCEDES-BENZ","CLA 220 CDI","20241211","20181207","5729","stationwagen","5","GRIJS","Niet geregistreerd","4","2143","1455","2050","1555","750","1500","20150430","20150430","Geen verstrekking in Open Data","51456","Ja",,,,,,,"5","4","0","0",,"0","0","M1",,,"by dwarsbalk r. voorzitting","2050","245 G",,"e1*2001/116*0470*13","22S2P2","MZAAB542","0","0.08","270","Nee","Nee",,"Nee","3590","0","0.00","2023","Logisch","00","Ja","2024-12-11T00:00:00.000","2018-12-07T00:00:00.000","2015-04-30T00:00:00.000","2015-04-30T00:00:00.000",,,,,,,,,,,,,,,,,,,,,"C",,,,,,,"https://opendata.rdw.nl/resource/3huj-srit.json","https://opendata.rdw.nl/resource/8ys7-d773.json","https://opendata.rdw.nl/resource/vezc-m2t6.json","https://opendata.rdw.nl/resource/jhie-znh9.json","https://opendata.rdw.nl/resource/kmfi-hrps.json"
"GL794X","Personenauto","MERCEDES-BENZ","CLA 220 CDI","20250425","20210827","5729","stationwagen","5","ZWART","Niet geregistreerd","4","2143","1455","2050","1555","750","1500","20150627","20150627","Geen verstrekking in Open Data","51788","Ja",,,,,,,"5","4","0","0",,"0","0","M1",,,"by dwarsbalk r. voorzitting","2050","245 G",,"e1*2001/116*0470*13","22S2P2","MZAAB542","0","0.08","270","Nee","Nee",,"Nee","3590","0","0.00","2024","Logisch","00","Ja","2025-04-25T00:00:00.000","2021-08-27T00:00:00.000","2015-06-27T00:00:00.000","2015-06-27T00:00:00.000",,,,,,,,,,,,,,,,,,,,,"C",,,,,,,"https://opendata.rdw.nl/resource/3huj-srit.json","https://opendata.rdw.nl/resource/8ys7-d773.json","https://opendata.rdw.nl/resource/vezc-m2t6.json","https://opendata.rdw.nl/resource/jhie-znh9.json","https://opendata.rdw.nl/resource/kmfi-hrps.json"
"GR896F","Personenauto","MERCEDES-BENZ","CLA 220 CDI","20241016","20210625","5729","stationwagen","5","GRIJS","Niet geregistreerd","4","2143","1455","2050","1555","750","1500","20150731","20150731","Geen verstrekking in Open Data","53204","Ja",,,,,,,"5","4","0","0",,"0","0","M1",,,"by dwarsbalk r. voorzitting","2050","245 G",,"e1*2001/116*0470*13","22S2P2","MZAAB542","0","0.08","270","Nee","Nee",,"Nee","3590","0","0.00","2023","Logisch","00","Ja","2024-10-16T00:00:00.000","2021-06-25T00:00:00.000","2015-07-31T00:00:00.000","2015-07-31T00:00:00.000",,,,,,,,,,,,,,,,,,,,,"C",,,,,,,"https://opendata.rdw.nl/resource/3huj-srit.json","https://opendata.rdw.nl/resource/8ys7-d773.json","https://opendata.rdw.nl/resource/vezc-m2t6.json","https://opendata.rdw.nl/resource/jhie-znh9.json","https://opendata.rdw.nl/resource/kmfi-hrps.json"
"GT554P","Personenauto","MERCEDES-BENZ","CLA 220 CDI","20250605","20180927","5729","stationwagen","5","GRIJS","Niet geregistreerd","4","2143","1455","2050","1555","750","1500","20150821","20150821","Geen verstrekking in Open Data","58607","Ja",,,,,,,"5","4","0","0",,"0","0","M1",,,"by dwarsbalk r. voorzitting","2050","245 G",,"e1*2001/116*0470*13","22S2P2","MZAAB552","0","0.08","270","Nee","Nee",,"Nee","3590","0","0.00","2024","Logisch","00","Ja","2025-06-05T00:00:00.000","2018-09-27T00:00:00.000","2015-08-21T00:00:00.000","2015-08-21T00:00:00.000",,,,,,,,,,,,,,,,,,,,,"C",,,,,,,"https://opendata.rdw.nl/resource/3huj-srit.json","https://opendata.rdw.nl/resource/8ys7-d773.json","https://opendata.rdw.nl/resource/vezc-m2t6.json","https://opendata.rdw.nl/resource/jhie-znh9.json","https://opendata.rdw.nl/resource/kmfi-hrps.json"
"GT564P","Personenauto","MERCEDES-BENZ","CLA 220 CDI","20250110","20200515","5264","stationwagen","5","WIT","Niet geregistreerd","4","2143","1455","2050","1555","750","1500","20150819","20150819","Geen verstrekking in Open Data","52107","Ja",,,,,,,"5","4","0","0",,"0","0","M1",,,"by dwarsbalk r. voorzitting","2050","245 G",,"e1*2001/116*0470*13","22S2P2","MZAAB541","0","0.08","270","Nee","Nee",,"Nee","3590","0","0.00","2024","Logisch","00","Ja","2025-01-10T00:00:00.000","2020-05-15T00:00:00.000","2015-08-19T00:00:00.000","2015-08-19T00:00:00.000",,,,,,,,,,,,,,,,,,,,,"C",,,,,,,"https://opendata.rdw.nl/resource/3huj-srit.json","https://opendata.rdw.nl/resource/8ys7-d773.json","https://opendata.rdw.nl/resource/vezc-m2t6.json","https://opendata.rdw.nl/resource/jhie-znh9.json","https://opendata.rdw.nl/resource/kmfi-hrps.json"
"GT768H","Personenauto","MERCEDES-BENZ","CLA 220 CDI","20240818","20150818","5729","stationwagen","5","GRIJS","Niet geregistreerd","4","2143","1455","2050","1555","750","1500","20150818","20150818","Geen verstrekking in Open Data","54696","Ja",,,,,,,"5","4","0","0",,"0","0","M1",,,"by dwarsbalk r. voorzitting","2050","245 G",,"e1*2001/116*0470*13","22S2P2","MZAAB542","0","0.08","270","Nee","Nee",,"Nee","3590","0","0.00","2024","Logisch","00","Ja","2024-08-18T00:00:00.000","2015-08-18T00:00:00.000","2015-08-18T00:00:00.000","2015-08-18T00:00:00.000",,,,,,,,,,,,,,,,,,,,,"C",,,,,,,"https://opendata.rdw.nl/resource/3huj-srit.json","https://opendata.rdw.nl/resource/8ys7-d773.json","https://opendata.rdw.nl/resource/vezc-m2t6.json","https://opendata.rdw.nl/resource/jhie-znh9.json","https://opendata.rdw.nl/resource/kmfi-hrps.json"
"GX259S","Personenauto","MERCEDES-BENZ","CLA 220 CDI","20240724","20240120","5264","stationwagen","5","WIT","Niet geregistreerd","4","2143","1455","2050","1555","750","1500","20150929","20150929","Geen verstrekking in Open Data","52107","Ja",,,,,,,"5","4","0","0",,"0","0","M1",,,"by dwarsbalk r. voorzitting","2050","245 G",,"e1*2001/116*0470*13","22S2P2","MZAAB541","0","0.08","270","Nee","Nee",,"Nee","3590","0","0.00","2024","Logisch","00","Ja","2024-07-24T00:00:00.000","2024-01-20T00:00:00.000","2015-09-29T00:00:00.000","2015-09-29T00:00:00.000",,,,,,,,,,,,,,,,,,,,,"C",,,,,,,"https://opendata.rdw.nl/resource/3huj-srit.json","https://opendata.rdw.nl/resource/8ys7-d773.json","https://opendata.rdw.nl/resource/vezc-m2t6.json","https://opendata.rdw.nl/resource/jhie-znh9.json","https://opendata.rdw.nl/resource/kmfi-hrps.json"
"H718KJ","Personenauto","MERCEDES-BENZ","CLA 220 CDI","20241206","20211209","1748","stationwagen","5","WIT","Niet geregistreerd","4","2143","1455","2050","1555","750","1500","20150527","20200220","Geen verstrekking in Open Data","57504","Ja","228",,,,,,"5","4","0","0",,"469","178","M1",,,"by dwarsbalk r. voorzitting","2050","245 G",,"e1*2001/116*0470*13","22S2P2","MZAAB554","0","0.08","270","Nee","Ja",,"Nee","3590","0","0.00","2024","Geen oordeel","05","Ja","2024-12-06T00:00:00.000","2021-12-09T00:00:00.000","2015-05-27T00:00:00.000","2020-02-20T00:00:00.000",,,,,,,,,,,"146",,,,,,,,,,"C",,,,,,,"https://opendata.rdw.nl/resource/3huj-srit.json","https://opendata.rdw.nl/resource/8ys7-d773.json","https://opendata.rdw.nl/resource/vezc-m2t6.json","https://opendata.rdw.nl/resource/jhie-znh9.json","https://opendata.rdw.nl/resource/kmfi-hrps.json"
"HB060N","Personenauto","MERCEDES-BENZ","CLA 220 CDI","20241021","20220115","5264","stationwagen","5","ZWART","Niet geregistreerd","4","2143","1455","2050","1555","750","1500","20150929","20150929","Geen verstrekking in Open Data","52882","Ja",,,,,,,"5","4","0","0",,"0","0","M1",,,"by dwarsbalk r. voorzitting","2050","245 G",,"e1*2001/116*0470*13","22S2P2","MZAAB541","0","0.08","270","Nee","Nee",,"Nee","3590","0","0.00","2023","Logisch","00","Ja","2024-10-21T00:00:00.000","2022-01-15T00:00:00.000","2015-09-29T00:00:00.000","2015-09-29T00:00:00.000",,,,,,,,,,,,,,,,,,,,,"C",,,,,,,"https://opendata.rdw.nl/resource/3huj-srit.json","https://opendata.rdw.nl/resource/8ys7-d773.json","https://opendata.rdw.nl/resource/vezc-m2t6.json","https://opendata.rdw.nl/resource/jhie-znh9.json","https://opendata.rdw.nl/resource/kmfi-hrps.json"
"HB854H","Personenauto","MERCEDES-BENZ","CLA 220 CDI","20241208","20230221","5264","stationwagen","5","GRIJS","Niet geregistreerd","4","2143","1455","2050","1555","750","1500","20150928","20150928","Geen verstrekking in Open Data","52882","Ja",,,,,,,"5","4","0","0",,"0","0","M1",,,"by dwarsbalk r. voorzitting","2050","245 G",,"e1*2001/116*0470*13","22S2P2","MZAAB541","0","0.08","270","Nee","Nee",,"Nee","3590","0","0.00","2023","Logisch","00","Ja","2024-12-08T00:00:00.000","2023-02-21T00:00:00.000","2015-09-28T00:00:00.000","2015-09-28T00:00:00.000",,,,,,,,,,,,,,,,,,,,,"C",,,,,,,"https://opendata.rdw.nl/resource/3huj-srit.json","https://opendata.rdw.nl/resource/8ys7-d773.json","https://opendata.rdw.nl/resource/vezc-m2t6.json","https://opendata.rdw.nl/resource/jhie-znh9.json","https://opendata.rdw.nl/resource/kmfi-hrps.json"
"HB917H","Personenauto","MERCEDES-BENZ","CLA 220 CDI","20241013","20231011","5264","stationwagen","5","GRIJS","Niet geregistreerd","4","2143","1455","2050","1555","750","1500","20150928","20150928","Geen verstrekking in Open Data","52882","Ja",,,,,,,"5","4","0","0",,"0","0","M1",,,"by dwarsbalk r. voorzitting","2050","245 G",,"e1*2001/116*0470*13","22S2P2","MZAAB541","0","0.08","270","Nee","Nee",,"Nee","3590","0","0.00","2023","Logisch","00","Ja","2024-10-13T00:00:00.000","2023-10-11T00:00:00.000","2015-09-28T00:00:00.000","2015-09-28T00:00:00.000",,,,,,,,,,,,,,,,,,,,,"C",,,,,,,"https://opendata.rdw.nl/resource/3huj-srit.json","https://opendata.rdw.nl/resource/8ys7-d773.json","https://opendata.rdw.nl/resource/vezc-m2t6.json","https://opendata.rdw.nl/resource/jhie-znh9.json","https://opendata.rdw.nl/resource/kmfi-hrps.json"
"HB925H","Personenauto","MERCEDES-BENZ","CLA 220 CDI","20250406","20190722","5264","stationwagen","5","GRIJS","Niet geregistreerd","4","2143","1455","2050","1555","750","1500","20150930","20150930","Geen verstrekking in Open Data","53553","Ja",,,,,,,"5","4","0","0",,"0","0","M1",,,"by dwarsbalk r. voorzitting","2050","245 G",,"e1*2001/116*0470*13","22S2P2","MZAAB541","0","0.08","270","Nee","Nee",,"Nee","3590","0","0.00","2024","Logisch","00","Ja","2025-04-06T00:00:00.000","2019-07-22T00:00:00.000","2015-09-30T00:00:00.000","2015-09-30T00:00:00.000",,,,,,,,,,,,,,,,,,,,,"C",,,,,,,"https://opendata.rdw.nl/resource/3huj-srit.json","https://opendata.rdw.nl/resource/8ys7-d773.json","https://opendata.rdw.nl/resource/vezc-m2t6.json","https://opendata.rdw.nl/resource/jhie-znh9.json","https://opendata.rdw.nl/resource/kmfi-hrps.json"
"HB953K","Personenauto","MERCEDES-BENZ","CLA 220 CDI","20250320","20170728","4696","stationwagen","5","GRIJS","Niet geregistreerd","4","2143","1455","2050","1555","750","1500","20150320","20150925","Geen verstrekking in Open Data","56345","Ja",,,,,,,"5","4","0","0",,"0","0","M1",,,"r. bodemplaat by voorzitting","2050","245 G",,"e1*2001/116*0470*13","22S2P2","MZAAB552","0","0.08","270","Nee","Nee",,"Nee","3590","0","0.00","2024","Geen oordeel","05","Ja","2025-03-20T00:00:00.000","2017-07-28T00:00:00.000","2015-03-20T00:00:00.000","2015-09-25T00:00:00.000",,,,,,,,,,,,,,,,,,,,,"C",,,,,,,"https://opendata.rdw.nl/resource/3huj-srit.json","https://opendata.rdw.nl/resource/8ys7-d773.json","https://opendata.rdw.nl/resource/vezc-m2t6.json","https://opendata.rdw.nl/resource/jhie-znh9.json","https://opendata.rdw.nl/resource/kmfi-hrps.json"
"HN664D","Personenauto","MERCEDES-BENZ","CLA 220 CDI","20240830","20240606","3933","stationwagen","5","GRIJS","Niet geregistreerd","4","2143","1455","2050","1555","750","1500","20150505","20160107","Geen verstrekking in Open Data","54122","Ja",,,,,,,"5","4","0","0",,"0","0","M1",,,"by dwarsbalk r. voorzitting","2050","245 G",,"e1*2001/116*0470*13","22S2P2","MZAAB554","0","0.08","270","Nee","Nee",,"Nee","3590","0","0.00","2024","Onlogisch","04","Ja","2024-08-30T00:00:00.000","2024-06-06T00:00:00.000","2015-05-05T00:00:00.000","2016-01-07T00:00:00.000",,,,,,,,,,,,,,,,,,,,,"C",,,,,,,"https://opendata.rdw.nl/resource/3huj-srit.json","https://opendata.rdw.nl/resource/8ys7-d773.json","https://opendata.rdw.nl/resource/vezc-m2t6.json","https://opendata.rdw.nl/resource/jhie-znh9.json","https://opendata.rdw.nl/resource/kmfi-hrps.json"
"HS010P","Personenauto","MERCEDES-BENZ","CLA 220 CDI","20250202","20191011","5264","stationwagen","5","WIT","Niet geregistreerd","4","2143","1455","2050","1555","750","1500","20160104","20160104","Geen verstrekking in Open Data","52107","Ja",,,,,,,"5","4","0","0",,"469","178","M1",,,"onder r. voorzitting","2050","245 G",,"e1*2001/116*0470*13","22S2P2","MZAAB541","0","0.08","270","Nee","Nee",,"Nee","3590","0","0.00","2024","Logisch","00","Ja","2025-02-02T00:00:00.000","2019-10-11T00:00:00.000","2016-01-04T00:00:00.000","2016-01-04T00:00:00.000",,,,,,,,,,,"146",,,,,,,,,,"D",,,,,,,"https://opendata.rdw.nl/resource/3huj-srit.json","https://opendata.rdw.nl/resource/8ys7-d773.json","https://opendata.rdw.nl/resource/vezc-m2t6.json","https://opendata.rdw.nl/resource/jhie-znh9.json","https://opendata.rdw.nl/resource/kmfi-hrps.json"
"HS017P","Personenauto","MERCEDES-BENZ","CLA 220 CDI","20250120","20220301","5264","stationwagen","5","WIT","Niet geregistreerd","4","2143","1455","2050","1555","750","1500","20160120","20160120","Geen verstrekking in Open Data","52107","Ja",,,,,,,"5","4","0","0",,"469","178","M1",,,"onder r. voorzitting","2050","245 G",,"e1*2001/116*0470*13","22S2P2","MZAAB541","0","0.08","270","Nee","Nee",,"Nee","3590","0","0.00","2024","Logisch","00","Ja","2025-01-20T00:00:00.000","2022-03-01T00:00:00.000","2016-01-20T00:00:00.000","2016-01-20T00:00:00.000",,,,,,,,,,,"146",,,,,,,,,,"D",,,,,,,"https://opendata.rdw.nl/resource/3huj-srit.json","https://opendata.rdw.nl/resource/8ys7-d773.json","https://opendata.rdw.nl/resource/vezc-m2t6.json","https://opendata.rdw.nl/resource/jhie-znh9.json","https://opendata.rdw.nl/resource/kmfi-hrps.json"
"J783PR","Personenauto","MERCEDES-BENZ","CLA 220 CDI","20250523","20240415","5892","stationwagen","5","GRIJS","Niet geregistreerd","4","2143","1455","2050","1555","750","1500","20150813","20200929","Geen verstrekking in Open Data","51161","Ja",,,,,,,"5","4",,,,,"178","M1",,,"by dwarsbalk r. voorzitting","2050","245 G",,"e1*2001/116*0470*13","22SAP2","MZAAB544","0","0.08","270","Nee","Nee",,"Nee","3590",,,"2024","Geen oordeel","05","Ja","2025-05-23T00:00:00.000","2024-04-15T00:00:00.000","2015-08-13T00:00:00.000","2020-09-29T00:00:00.000",,,,,,,,,,,,,,,,,,,,,"C",,,,,,,"https://opendata.rdw.nl/resource/3huj-srit.json","https://opendata.rdw.nl/resource/8ys7-d773.json","https://opendata.rdw.nl/resource/vezc-m2t6.json","https://opendata.rdw.nl/resource/jhie-znh9.json","https://opendata.rdw.nl/resource/kmfi-hrps.json"
"JJ615Z","Personenauto","MERCEDES-BENZ","CLA 220 CDI","20250709","20210710","5727","stationwagen","5","GRIJS","Niet geregistreerd","4","2143","1455","2050","1555","750","1500","20160407","20160407","Geen verstrekking in Open Data","53345","Ja",,,,,,,"5","4","0","0",,"469","178","M1",,,"onder r. voorzitting","2050","245 G",,"e1*2001/116*0470*13","22S2P2","MZAAB541","0","0.08","270","Nee","Nee",,"Nee","3590","0","0.00","2024","Logisch","00","Ja","2025-07-09T00:00:00.000","2021-07-10T00:00:00.000","2016-04-07T00:00:00.000","2016-04-07T00:00:00.000",,,,,,,,,,,"146",,,,,,,,,,"D",,,,,,,"https://opendata.rdw.nl/resource/3huj-srit.json","https://opendata.rdw.nl/resource/8ys7-d773.json","https://opendata.rdw.nl/resource/vezc-m2t6.json","https://opendata.rdw.nl/resource/jhie-znh9.json","https://opendata.rdw.nl/resource/kmfi-hrps.json"
"JJ904S","Personenauto","MERCEDES-BENZ","CLA 220 CDI","20241127","20201130","5727","stationwagen","5","ZWART","Niet geregistreerd","4","2143","1455","2050","1555","750","1500","20160407","20160407","Geen verstrekking in Open Data","53345","Ja",,,,,,,"5","4","0","0",,"469","178","M1",,,"onder r. voorzitting","2050","245 G",,"e1*2001/116*0470*13","22S2P2","MZAAB541","0","0.08","270","Nee","Nee",,"Nee","3590","0","0.00","2024","Logisch","00","Ja","2024-11-27T00:00:00.000","2020-11-30T00:00:00.000","2016-04-07T00:00:00.000","2016-04-07T00:00:00.000",,,,,,,,,,,"146",,,,,,,,,,"D",,,,,,,"https://opendata.rdw.nl/resource/3huj-srit.json","https://opendata.rdw.nl/resource/8ys7-d773.json","https://opendata.rdw.nl/resource/vezc-m2t6.json","https://opendata.rdw.nl/resource/jhie-znh9.json","https://opendata.rdw.nl/resource/kmfi-hrps.json"
"JL725T","Personenauto","MERCEDES-BENZ","CLA 220 CDI","20240904","20160425","805","stationwagen","5","WIT","Niet geregistreerd","4","2143","1455","2050","1555","750","1500","20150828","20160425","Geen verstrekking in Open Data","53021","Ja",,,,,,,"5","4","0","0",,"0","0","M1",,,"by dwarsbalk r. voorzitting","2050","245 G",,"e1*2001/116*0470*13","22S2P2","MZAAB542","0","0.08","270","Nee","Ja",,"Nee","3590","0","0.00","2023","Geen oordeel","05","Ja","2024-09-04T00:00:00.000","2016-04-25T00:00:00.000","2015-08-28T00:00:00.000","2016-04-25T00:00:00.000",,,,,,,,,,,,,,,,,,,,,"C",,,,,,,"https://opendata.rdw.nl/resource/3huj-srit.json","https://opendata.rdw.nl/resource/8ys7-d773.json","https://opendata.rdw.nl/resource/vezc-m2t6.json","https://opendata.rdw.nl/resource/jhie-znh9.json","https://opendata.rdw.nl/resource/kmfi-hrps.json"
"KG885F","Personenauto","MERCEDES-BENZ","CLA 220 CDI","20240831","20180202","5742","stationwagen","5","WIT","Niet geregistreerd","4","2143","1455","2050","1555","750","1500","20150629","20160826","Geen verstrekking in Open Data","62529","Ja",,,,,,,"5","4","0","0",,"0","0","M1",,,"r. bodemplaat by voorzitting","2050","245 G",,"e1*2001/116*0470*13","22S2P2","MZAAB554","0","0.08","270","Nee","Nee",,"Nee","3590","0","0.00","2023","Geen oordeel","05","Ja","2024-08-31T00:00:00.000","2018-02-02T00:00:00.000","2015-06-29T00:00:00.000","2016-08-26T00:00:00.000",,,,,,,,,,,,,,,,,,,,,"C",,,,,,,"https://opendata.rdw.nl/resource/3huj-srit.json","https://opendata.rdw.nl/resource/8ys7-d773.json","https://opendata.rdw.nl/resource/vezc-m2t6.json","https://opendata.rdw.nl/resource/jhie-znh9.json","https://opendata.rdw.nl/resource/kmfi-hrps.json"
"KJ976D","Personenauto","MERCEDES-BENZ","CLA 220 CDI","20240714","20200625","4981","stationwagen","5","ZWART","Niet geregistreerd","4","2143","1455","2050","1555","750","1500","20150714","20160922","Geen verstrekking in Open Data","56351","Ja",,,,,,,"5","4","0","0",,"0","0","M1",,,"by dwarsbalk r. voorzitting","2050","245 G",,"e1*2001/116*0470*13","22S2P2","MZAAB552","0","0.08","270","Nee","Nee",,"Nee","3590","0","0.00","2023","Geen oordeel","05","Ja","2024-07-14T00:00:00.000","2020-06-25T00:00:00.000","2015-07-14T00:00:00.000","2016-09-22T00:00:00.000",,,,,,,,,,,,,,,,,,,,,"C",,,,,,,"https://opendata.rdw.nl/resource/3huj-srit.json","https://opendata.rdw.nl/resource/8ys7-d773.json","https://opendata.rdw.nl/resource/vezc-m2t6.json","https://opendata.rdw.nl/resource/jhie-znh9.json","https://opendata.rdw.nl/resource/kmfi-hrps.json"
"KN006X","Personenauto","MERCEDES-BENZ","CLA 220 CDI","20250617","20240504","4245","stationwagen","5","ZWART","Niet geregistreerd","4","2143","1455","2050","1555","750","1500","20151124","20161020","Geen verstrekking in Open Data","51207","Ja",,,,,,,"5","4","0","0",,"0","0","M1",,,"r. bodemplaat by voorzitting","2050","245 G",,"e1*2001/116*0470*13","22S2P2","MZAAB542","0","0.08","270","Nee","Ja",,"Nee","3590","0","0.00","2024","Geen oordeel","05","Ja","2025-06-17T00:00:00.000","2024-05-04T00:00:00.000","2015-11-24T00:00:00.000","2016-10-20T00:00:00.000",,,,,,,,,,,,,,,,,,,,,"C",,,,,,,"https://opendata.rdw.nl/resource/3huj-srit.json","https://opendata.rdw.nl/resource/8ys7-d773.json","https://opendata.rdw.nl/resource/vezc-m2t6.json","https://opendata.rdw.nl/resource/jhie-znh9.json","https://opendata.rdw.nl/resource/kmfi-hrps.json"
"KS527N","Personenauto","MERCEDES-BENZ","CLA 220 CDI","20240707","20240129","6382","stationwagen","5","GRIJS","Niet geregistreerd","4","2143","1455","2050","1555","750","1500","20150629","20161115","Geen verstrekking in Open Data","55009","Nee",,,,,,,"5","4","0","0",,"0","0","M1",,,"by dwarsbalk r. voorzitting","2050","245 G",,"e1*2001/116*0470*13","22S2P2","MZAAB554","0","0.08","270","Nee","Nee",,"Nee","3590","0","0.00","2024","Geen oordeel","05","Ja","2024-07-07T00:00:00.000","2024-01-29T00:00:00.000","2015-06-29T00:00:00.000","2016-11-15T00:00:00.000",,,,,,,,,,,,,,,,,,,,,"C",,,,,,,"https://opendata.rdw.nl/resource/3huj-srit.json","https://opendata.rdw.nl/resource/8ys7-d773.json","https://opendata.rdw.nl/resource/vezc-m2t6.json","https://opendata.rdw.nl/resource/jhie-znh9.json","https://opendata.rdw.nl/resource/kmfi-hrps.json"