"kenteken","voertuigsoort","merk","handelsbenaming","vervaldatum_apk","datum_tenaamstelling","bruto_bpm","inrichting","aantal_zitplaatsen","eerste_kleur","tweede_kleur","aantal_cilinders","cilinderinhoud","massa_ledig_voertuig","toegestane_maximum_massa_voertuig","massa_rijklaar","maximum_massa_trekken_ongeremd","maximum_trekken_massa_geremd","datum_eerste_toelating","datum_eerste_tenaamstelling_in_nederland","wacht_op_keuren","catalogusprijs","wam_verzekerd","maximale_constructiesnelheid","laadvermogen","oplegger_geremd","aanhangwagen_autonoom_geremd","aanhangwagen_middenas_geremd","aantal_staanplaatsen","aantal_deuren","aantal_wielen","afstand_hart_koppeling_tot_achterzijde_voertuig","afstand_voorzijde_voertuig_tot_hart_koppeling","afwijkende_maximum_snelheid","lengte","breedte","europese_voertuigcategorie","europese_voertuigcategorie_toevoeging","europese_uitvoeringcategorie_toevoeging","plaats_chassisnummer","technische_max_massa_voertuig","type","type_gasinstallatie","typegoedkeuringsnummer","variant","uitvoering","volgnummer_wijziging_eu_typegoedkeuring","vermogen_massarijklaar","wielbasis","export_indicator","openstaande_terugroepactie_indicator","vervaldatum_tachograaf","taxi_indicator","maximum_massa_samenstelling","aantal_rolstoelplaatsen","maximum_ondersteunende_snelheid","jaar_laatste_registratie_tellerstand","tellerstandoordeel","code_toelichting_tellerstandoordeel","tenaamstellen_mogelijk","vervaldatum_apk_dt","datum_tenaamstelling_dt","datum_eerste_toelating_dt","datum_eerste_tenaamstelling_in_nederland_dt","vervaldatum_tachograaf_dt","maximum_last_onder_de_vooras_sen_tezamen_koppeling","type_remsysteem_voertuig_code","rupsonderstelconfiguratiecode","wielbasis_voertuig_minimum","wielbasis_voertuig_maximum","lengte_voertuig_minimum","lengte_voertuig_maximum","breedte_voertuig_minimum","breedte_voertuig_maximum","hoogte_voertuig","hoogte_voertuig_minimum","hoogte_voertuig_maximum","massa_bedrijfsklaar_minimaal","massa_bedrijfsklaar_maximaal","technisch_toelaatbaar_massa_koppelpunt","maximum_massa_technisch_maximaal","maximum_massa_technisch_minimaal","subcategorie_nederland","verticale_belasting_koppelpunt_getrokken_voertuig","zuinigheidsclassificatie","registratie_datum_goedkeuring_afschrijvingsmoment_bpm","registratie_datum_goedkeuring_afschrijvingsmoment_bpm_dt","gem_lading_wrde","aerodyn_voorz","massa_alt_aandr","verl_cab_ind","api_gekentekende_voertuigen_assen","api_gekentekende_voertuigen_brandstof","api_gekentekende_voertuigen_carrosserie","api_gekentekende_voertuigen_carrosserie_specifiek","api_gekentekende_voertuigen_voertuigklasse"
"GR808K","Personenauto","MERCEDES-BENZ","CLS 220 D","20240805","20221109","9207","stationwagen","5","ZWART","Niet geregistreerd","4","2143","1745","2370","1845","750","2100","20150803","20150803","Geen verstrekking in Open Data","78115","Ja",,,,,,,"5","4","0","0",,"0","0","M1",,,"r. voorzitting","2370","218",,"e1*2007/46*0485*14","G20RP0","CZCCB524","0","0.07","287","Nee","Nee",,"Nee","4570","0","0.00","2023","Logisch","00","Ja","2024-08-05T00:00:00.000","2022-11-09T00:00:00.000","2015-08-03T00:00:00.000","2015-08-03T00:00:00.000",,,,,,,,,,,,,,,,,,,,,"B",,,,,,,"https://opendata.rdw.nl/resource/3huj-srit.json","https://opendata.rdw.nl/resource/8ys7-d773.json","https://opendata.rdw.nl/resource/vezc-m2t6.json","https://opendata.rdw.nl/resource/jhie-znh9.json","https://opendata.rdw.nl/resource/kmfi-hrps.json"
"GR918F","Personenauto","MERCEDES-BENZ","CLS 220 D","20250423","20230425","8613","sedan","4","ZWART","Niet geregistreerd","4","2143","1690","2275","1790",,,"20150724","20150724","Geen verstrekking in Open Data","79407","Ja",,,,,,,"4","4","0","0",,"0","0","M1",,,"r. voorzitting","2275","218",,"e1*2007/46*0485*14","G30RP0","CZCCB404","0","0.07","287","Nee","Nee",,"Nee","0","0","0.00","2024","Onlogisch","04","Ja","2025-04-23T00:00:00.000","2023-04-25T00:00:00.000","2015-07-24T00:00:00.000","2015-07-24T00:00:00.000",,,,,,,,,,,,,,,,,,,,,"B",,,,,,,"https://opendata.rdw.nl/resource/3huj-srit.json","https://opendata.rdw.nl/resource/8ys7-d773.json","https://opendata.rdw.nl/resource/vezc-m2t6.json","https://opendata.rdw.nl/resource/jhie-znh9.json","https://opendata.rdw.nl/resource/kmfi-hrps.json"
"H253KF","Personenauto","MERCEDES-BENZ","CLS 220 D","20241208","20240503","3829","stationwagen","5","ZWART","Niet geregistreerd","4","2143","1745","2370","1845","750","2100","20160804","20201205","Geen verstrekking in Open Data","80075","Ja","217",,,,,,"5","4",,,,,"188","M1",,,,"2370","218",,"e1*2007/46*0485*16","G20QP0","CZCZ0524","0","0.07","287","Nee","Nee",,"Nee","4570",,,"2024","Geen oordeel","05","Ja","2024-12-08T00:00:00.000","2024-05-03T00:00:00.000","2016-08-04T00:00:00.000","2020-12-05T00:00:00.000",,,,,,,,,,,,,,,,,,,,,"C",,,,,,,"https://opendata.rdw.nl/resource/3huj-srit.json","https://opendata.rdw.nl/resource/8ys7-d773.json","https://opendata.rdw.nl/resource/vezc-m2t6.json","https://opendata.rdw.nl/resource/jhie-znh9.json","https://opendata.rdw.nl/resource/kmfi-hrps.json"
"HX722K","Personenauto","MERCEDES-BENZ","CLS 220 D","20250311","20230923","9405","stationwagen","5","ZWART","Niet geregistreerd","4","2143","1745","2370","1845","750","2100","20160229","20160229","Geen verstrekking in Open Data","89142","Ja",,,,,,,"5","4","0","0",,"498","188","M1",,,"onder r. voorzitting","2370","218",,"e1*2007/46*0485*15","G20RP0","CZCC0524","0","0.07","287","Nee","Nee",,"Nee","4570","0","0.00","2024","Logisch","00","Ja","2025-03-11T00:00:00.000","2023-09-23T00:00:00.000","2016-02-29T00:00:00.000","2016-02-29T00:00:00.000",,,,,,,,,,,"143",,,,,,,,,,"C",,,,,,,"https://opendata.rdw.nl/resource/3huj-srit.json","https://opendata.rdw.nl/resource/8ys7-d773.json","https://opendata.rdw.nl/resource/vezc-m2t6.json","https://opendata.rdw.nl/resource/jhie-znh9.json","https://opendata.rdw.nl/resource/kmfi-hrps.json"
"J975PR","Personenauto","MERCEDES-BENZ","CLS 220 D","20241002","20200923","1550","sedan","4","ZWART","Niet geregistreerd","4","2143","1690","2275","1790",,,"20160125","20200923","Geen verstrekking in Open Data","75374","Ja","226",,,,,,"4","4","0","0",,"0","188","M1",,,"r. voorzitting","2275","218",,"e1*2007/46*0485*15","G30RP0","CZCC0404","0","0.07","287","Nee","Nee",,"Nee","0","0","0.00","2023","Geen oordeel","05","Ja","2024-10-02T00:00:00.000","2020-09-23T00:00:00.000","2016-01-25T00:00:00.000","2020-09-23T00:00:00.000",,,,,,,,,,,,,,,,,,,,,"C",,,,,,,"https://opendata.rdw.nl/resource/3huj-srit.json","https://opendata.rdw.nl/resource/8ys7-d773.json","https://opendata.rdw.nl/resource/vezc-m2t6.json","https://opendata.rdw.nl/resource/jhie-znh9.json","https://opendata.rdw.nl/resource/kmfi-hrps.json"
"JH309V","Personenauto","MERCEDES-BENZ","CLS 220 D","20250413","20210710","9460","sedan","4","GRIJS","Niet geregistreerd","4","2143","1690","2275","1790",,,"20160331","20160331","Geen verstrekking in Open Data","78851","Ja",,,,,,,"4","4","0","0",,"497","188","M1",,,"onder r. voorzitting","2275","218",,"e1*2007/46*0485*14","G30RP0","CZCCB404","0","0.07","287","Nee","Nee",,"Nee","0","0","0.00","2024","Logisch","00","Ja","2025-04-13T00:00:00.000","2021-07-10T00:00:00.000","2016-03-31T00:00:00.000","2016-03-31T00:00:00.000",,,,,,,,,,,"143",,,,,,,,,,"C",,,,,,,"https://opendata.rdw.nl/resource/3huj-srit.json","https://opendata.rdw.nl/resource/8ys7-d773.json","https://opendata.rdw.nl/resource/vezc-m2t6.json","https://opendata.rdw.nl/resource/jhie-znh9.json","https://opendata.rdw.nl/resource/kmfi-hrps.json"
"K442RZ","Personenauto","MERCEDES-BENZ","CLS 220 D","20250219","20210219","16083","sedan","5","ZWART","Niet geregistreerd","4","1950","1700","2410","1800","750","1900","20210219","20210219","Geen verstrekking in Open Data","98084","Ja","237",,,,,,"4","4","0","0",,"500","190","M1",,,,"2410","R1ECLS",,"e1*2007/46*1818*12","E314T0","CZAA151B","0","0.08","294","Nee","Nee",,"Nee","4380","0","0.00","2024","Logisch","00","Ja","2025-02-19T00:00:00.000","2021-02-19T00:00:00.000","2021-02-19T00:00:00.000","2021-02-19T00:00:00.000",,,,,,,,,,,"144",,,,,,,,,,"C",,,,,,,"https://opendata.rdw.nl/resource/3huj-srit.json","https://opendata.rdw.nl/resource/8ys7-d773.json","https://opendata.rdw.nl/resource/vezc-m2t6.json","https://opendata.rdw.nl/resource/jhie-znh9.json","https://opendata.rdw.nl/resource/kmfi-hrps.json"
"K486SP","Personenauto","MERCEDES-BENZ","CLS 220 D","20250226","20210226","12992","sedan","5","GRIJS","Niet geregistreerd","4","1950","1700","2410","1800","750","1900","20210226","20210226","Geen verstrekking in Open Data","81012","Ja","237",,,,,,"4","4","0","0",,"500","190","M1",,,,"2410","R1ECLS",,"e1*2007/46*1818*12","E314T0","CZAA151A","0","0.08","294","Nee","Nee",,"Nee","4380","0","0.00","2024","Logisch","00","Ja","2025-02-26T00:00:00.000","2021-02-26T00:00:00.000","2021-02-26T00:00:00.000","2021-02-26T00:00:00.000",,,,,,,,,,,"144",,,,,,,,,,"B",,,,,,,"https://opendata.rdw.nl/resource/3huj-srit.json","https://opendata.rdw.nl/resource/8ys7-d773.json","https://opendata.rdw.nl/resource/vezc-m2t6.json","https://opendata.rdw.nl/resource/jhie-znh9.json","https://opendata.rdw.nl/resource/kmfi-hrps.json"
"K622GR","Personenauto","MERCEDES-BENZ","CLS 220 D","20241129","20220209","428","stationwagen","5","ZWART","Niet geregistreerd","4","2143","1745","2370","1845","750","2100","20180711","20210917","Geen verstrekking in Open Data","85421","Ja","217",,,,,,"5","4","0","0",,"0","188","M1",,,"r. voorzitting","2370","218",,"e1*2007/46*0485*16","G20QP0","CZCA0524","0","0.07","287","Nee","Nee",,"Nee","4570","0","0.00","2023","Geen oordeel","05","Ja","2024-11-29T00:00:00.000","2022-02-09T00:00:00.000","2018-07-11T00:00:00.000","2021-09-17T00:00:00.000",,,,,,,,,,,,,,,,,,,,,"D",,,,,,,"https://opendata.rdw.nl/resource/3huj-srit.json","https://opendata.rdw.nl/resource/8ys7-d773.json","https://opendata.rdw.nl/resource/vezc-m2t6.json","https://opendata.rdw.nl/resource/jhie-znh9.json","https://opendata.rdw.nl/resource/kmfi-hrps.json"
"KB457D","Personenauto","MERCEDES-BENZ","CLS 220 D","20241031","20171102","5617","stationwagen","5","ZWART","Niet geregistreerd","4","2143","1745","2370","1845","750","2100","20151030","20171102","Geen verstrekking in Open Data","72183","Ja",,,,,,,"5","4","0","0",,"0","0","M1",,,"r. voorzitting","2370","218",,"e1*2007/46*0485*14","G20RP0","CZCCB524","0","0.07","287","Nee","Nee",,"Nee","4570","0","0.00","2023","Geen oordeel","05","Ja","2024-10-31T00:00:00.000","2017-11-02T00:00:00.000","2015-10-30T00:00:00.000","2017-11-02T00:00:00.000",,,,,,,,,,,,,,,,,,,,,"B",,,,,,,"https://opendata.rdw.nl/resource/3huj-srit.json","https://opendata.rdw.nl/resource/8ys7-d773.json","https://opendata.rdw.nl/resource/vezc-m2t6.json","https://opendata.rdw.nl/resource/jhie-znh9.json","https://opendata.rdw.nl/resource/kmfi-hrps.json"
"KB894H","Personenauto","MERCEDES-BENZ","CLS 220 D","20240812","20210813","10301","stationwagen","5","GRIJS","Niet geregistreerd","4","2143","1745","2370","1845","750","2100","20160720","20160720","Geen verstrekking in Open Data","82644","Ja",,,,,,,"5","4","0","0",,"498","188","M1",,,"onder r. voorzitting","2370","218",,"e1*2007/46*0485*16","G20RP0","CZCZ0524","0","0.07","287","Nee","Nee",,"Nee","4570","0","0.00","2024","Logisch","00","Ja","2024-08-12T00:00:00.000","2021-08-13T00:00:00.000","2016-07-20T00:00:00.000","2016-07-20T00:00:00.000",,,,,,,,,,,"143",,,,,,,,,,"C",,,,,,,"https://opendata.rdw.nl/resource/3huj-srit.json","https://opendata.rdw.nl/resource/8ys7-d773.json","https://opendata.rdw.nl/resource/vezc-m2t6.json","https://opendata.rdw.nl/resource/jhie-znh9.json","https://opendata.rdw.nl/resource/kmfi-hrps.json"
"KD945J","Personenauto","MERCEDES-BENZ","CLS 220 D","20240916","20220916","7955","stationwagen","5","WIT","Niet geregistreerd","4","2143","1745","2370","1845","750","2100","20160121","20160728","Geen verstrekking in Open Data","91085","Ja",,,,,,,"5","4","0","0",,"0","0","M1",,,"r. voorzitting","2370","218",,"e1*2007/46*0485*14","G20RP0","CZCCB524","0","0.07","287","Nee","Nee",,"Nee","4570","0","0.00","2023","Geen oordeel","05","Ja","2024-09-16T00:00:00.000","2022-09-16T00:00:00.000","2016-01-21T00:00:00.000","2016-07-28T00:00:00.000",,,,,,,,,,,,,,,,,,,,,"C",,,,,,,"https://opendata.rdw.nl/resource/3huj-srit.json","https://opendata.rdw.nl/resource/8ys7-d773.json","https://opendata.rdw.nl/resource/vezc-m2t6.json","https://opendata.rdw.nl/resource/jhie-znh9.json","https://opendata.rdw.nl/resource/kmfi-hrps.json"
"KH077R","Personenauto","MERCEDES-BENZ","CLS 220 D","20241214","20220309","10301","stationwagen","5","BRUIN","Niet geregistreerd","4","2143","1745","2370","1845","750","2100","20160912","20160912","Geen verstrekking in Open Data","90669","Ja",,,,,,,"5","4","0","0",,"498","188","M1",,,"onder r. voorzitting","2370","218",,"e1*2007/46*0485*15","G20RP0","CZCC0524","0","0.07","287","Nee","Nee",,"Nee","4570","0","0.00","2024","Logisch","00","Ja","2024-12-14T00:00:00.000","2022-03-09T00:00:00.000","2016-09-12T00:00:00.000","2016-09-12T00:00:00.000",,,,,,,,,,,"143",,,,,,,,,,"C",,,,,,,"https://opendata.rdw.nl/resource/3huj-srit.json","https://opendata.rdw.nl/resource/8ys7-d773.json","https://opendata.rdw.nl/resource/vezc-m2t6.json","https://opendata.rdw.nl/resource/jhie-znh9.json","https://opendata.rdw.nl/resource/kmfi-hrps.json"
"KH493N","Personenauto","MERCEDES-BENZ","CLS 220 D","20240919","20180813","10301","stationwagen","5","ZWART","Niet geregistreerd","4","2143","1745","2370","1845","750","2100","20160919","20160919","Geen verstrekking in Open Data","89568","Ja",,,,,,,"5","4","0","0",,"498","188","M1",,,"onder r. voorzitting","2370","218",,"e1*2007/46*0485*16","G20RP0","CZCZ0524","0","0.07","287","Nee","Nee",,"Nee","4570","0","0.00","2024","Logisch","00","Ja","2024-09-19T00:00:00.000","2018-08-13T00:00:00.000","2016-09-19T00:00:00.000","2016-09-19T00:00:00.000",,,,,,,,,,,"143",,,,,,,,,,"C",,,,,,,"https://opendata.rdw.nl/resource/3huj-srit.json","https://opendata.rdw.nl/resource/8ys7-d773.json","https://opendata.rdw.nl/resource/vezc-m2t6.json","https://opendata.rdw.nl/resource/jhie-znh9.json","https://opendata.rdw.nl/resource/kmfi-hrps.json"
"KJ490Z","Personenauto","MERCEDES-BENZ","CLS 220 D","20240926","20230220","10301","stationwagen","5","GRIJS","Niet geregistreerd","4","2143","1745","2370","1845","750","2100","20160930","20160930","Geen verstrekking in Open Data","82874","Ja",,,,,,,"5","4","0","0",,"498","188","M1",,,"onder r. voorzitting","2370","218",,"e1*2007/46*0485*16","G20RP0","CZCZ0524","0","0.07","287","Nee","Nee",,"Nee","4570","0","0.00","2024","Logisch","00","Ja","2024-09-26T00:00:00.000","2023-02-20T00:00:00.000","2016-09-30T00:00:00.000","2016-09-30T00:00:00.000",,,,,,,,,,,"143",,,,,,,,,,"C",,,,,,,"https://opendata.rdw.nl/resource/3huj-srit.json","https://opendata.rdw.nl/resource/8ys7-d773.json","https://opendata.rdw.nl/resource/vezc-m2t6.json","https://opendata.rdw.nl/resource/jhie-znh9.json","https://opendata.rdw.nl/resource/kmfi-hrps.json"
"KP253K","Personenauto","MERCEDES-BENZ","CLS 220 D","20250124","20220121","10301","stationwagen","5","GRIJS","Niet geregistreerd","4","2143","1745","2370","1845","750","2100","20161031","20161031","Geen verstrekking in Open Data","90669","Ja",,,,,,,"5","4","0","0",,"498","188","M1",,,"onder r. voorzitting","2370","218",,"e1*2007/46*0485*15","G20RP0","CZCC0524","0","0.07","287","Nee","Nee",,"Nee","4570","0","0.00","2023","Logisch","00","Ja","2025-01-24T00:00:00.000","2022-01-21T00:00:00.000","2016-10-31T00:00:00.000","2016-10-31T00:00:00.000",,,,,,,,,,,"143",,,,,,,,,,"C",,,,,,,"https://opendata.rdw.nl/resource/3huj-srit.json","https://opendata.rdw.nl/resource/8ys7-d773.json","https://opendata.rdw.nl/resource/vezc-m2t6.json","https://opendata.rdw.nl/resource/jhie-znh9.json","https://opendata.rdw.nl/resource/kmfi-hrps.json"
"ND814F","Personenauto","MERCEDES-BENZ","CLS 220 D","20241016","20240430","10091","stationwagen","5","GRIJS","Niet geregistreerd","4","2143","1745","2370","1845","750","2100","20170103","20170103","Geen verstrekking in Open Data","81497","Ja",,,,,,,"5","4","0","0",,"498","188","M1",,,"onder r. voorzitting","2370","218",,"e1*2007/46*0485*14","G20RP0","CZCCB524","0","0.07","287","Nee","Nee",,"Nee","4570","0","0.00","2024","Logisch","00","Ja","2024-10-16T00:00:00.000","2024-04-30T00:00:00.000","2017-01-03T00:00:00.000","2017-01-03T00:00:00.000",,,,,,,,,,,"143",,,,,,,,,,"C",,,,,,,"https://opendata.rdw.nl/resource/3huj-srit.json","https://opendata.rdw.nl/resource/8ys7-d773.json","https://opendata.rdw.nl/resource/vezc-m2t6.json","https://opendata.rdw.nl/resource/jhie-znh9.json","https://opendata.rdw.nl/resource/kmfi-hrps.json"
"NH209N","Personenauto","MERCEDES-BENZ","CLS 220 D","20250304","20220716","10294","sedan","4","ZWART","Niet geregistreerd","4","2143","1690","2275","1790",,,"20170201","20170201","Geen verstrekking in Open Data","81742","Ja",,,,,,,"4","4","0","0",,"497","188","M1",,,"onder r. voorzitting","2275","218",,"e1*2007/46*0485*16","G30RP0","CZCZ0404","0","0.07","287","Nee","Nee",,"Nee","0","0","0.00","2024","Logisch","00","Ja","2025-03-04T00:00:00.000","2022-07-16T00:00:00.000","2017-02-01T00:00:00.000","2017-02-01T00:00:00.000",,,,,,,,,,,"143",,,,,,,,,,"C",,,,,,,"https://opendata.rdw.nl/resource/3huj-srit.json","https://opendata.rdw.nl/resource/8ys7-d773.json","https://opendata.rdw.nl/resource/vezc-m2t6.json","https://opendata.rdw.nl/resource/jhie-znh9.json","https://opendata.rdw.nl/resource/kmfi-hrps.json"
"NH434B","Personenauto","MERCEDES-BENZ","CLS 220 D","20250221","20171103","11220","stationwagen","5","ZWART","Niet geregistreerd","4","2143","1745","2370","1845","750","2100","20170124","20170124","Geen verstrekking in Open Data","84604","Ja",,,,,,,"5","4","0","0",,"498","188","M1",,,"onder r. voorzitting","2370","218",,"e1*2007/46*0485*16","G20RP0","CZCZ0524","0","0.07","287","Nee","Nee",,"Nee","4570","0","0.00","2024","Logisch","00","Ja","2025-02-21T00:00:00.000","2017-11-03T00:00:00.000","2017-01-24T00:00:00.000","2017-01-24T00:00:00.000",,,,,,,,,,,"143",,,,,,,,,,"C",,,,,,,"https://opendata.rdw.nl/resource/3huj-srit.json","https://opendata.rdw.nl/resource/8ys7-d773.json","https://opendata.rdw.nl/resource/vezc-m2t6.json","https://opendata.rdw.nl/resource/jhie-znh9.json","https://opendata.rdw.nl/resource/kmfi-hrps.json"
"NH527F","Personenauto","MERCEDES-BENZ","CLS 220 D","20250127","20180425","10294","sedan","4","ZWART","Niet geregistreerd","4","2143","1690","2275","1790",,,"20170127","20170127","Geen verstrekking in Open Data","81439","Ja",,,,,,,"4","4","0","0",,"497","188","M1",,,"onder r. voorzitting","2275","218",,"e1*2007/46*0485*16","G30RP0","CZCA0404","0","0.07","287","Nee","Nee",,"Nee","0","0","0.00","2024","Logisch","00","Ja","2025-01-27T00:00:00.000","2018-04-25T00:00:00.000","2017-01-27T00:00:00.000","2017-01-27T00:00:00.000",,,,,,,,,,,"143",,,,,,,,,,"C",,,,,,,"https://opendata.rdw.nl/resource/3huj-srit.json","https://opendata.rdw.nl/resource/8ys7-d773.json","https://opendata.rdw.nl/resource/vezc-m2t6.json","https://opendata.rdw.nl/resource/jhie-znh9.json","https://opendata.rdw.nl/resource/kmfi-hrps.json"
"NK466V","Personenauto","MERCEDES-BENZ","CLS 220 D","20241028","20210315","11220","stationwagen","5","ZWART","Niet geregistreerd","4","2143","1745","2370","1845","750","2100","20170227","20170227","Geen verstrekking in Open Data","84604","Ja",,,,,,,"5","4","0","0",,"498","188","M1",,,"onder r. voorzitting","2370","218",,"e1*2007/46*0485*16","G20RP0","CZCZ0524","0","0.07","287","Nee","Nee",,"Nee","4570","0","0.00","2023","Logisch","00","Ja","2024-10-28T00:00:00.000","2021-03-15T00:00:00.000","2017-02-27T00:00:00.000","2017-02-27T00:00:00.000",,,,,,,,,,,"143",,,,,,,,,,"C",,,,,,,"https://opendata.rdw.nl/resource/3huj-srit.json","https://opendata.rdw.nl/resource/8ys7-d773.json","https://opendata.rdw.nl/resource/vezc-m2t6.json","https://opendata.rdw.nl/resource/jhie-znh9.json","https://opendata.rdw.nl/resource/kmfi-hrps.json"
"NK474V","Personenauto","MERCEDES-BENZ","CLS 220 D","20250228","20170703","10294","sedan","4","ZWART","Niet geregistreerd","4","2143","1690","2275","1790",,,"20170228","20170228","Geen verstrekking in Open Data","81439","Ja",,,,,,,"4","4","0","0",,"497","188","M1",,,"onder r. voorzitting","2275","218",,"e1*2007/46*0485*16","G30RP0","CZCZ0404","0","0.07","287","Nee","Nee",,"Nee","0","0","0.00","2024","Logisch","00","Ja","2025-02-28T00:00:00.000","2017-07-03T00:00:00.000","2017-02-28T00:00:00.000","2017-02-28T00:00:00.000",,,,,,,,,,,"143",,,,,,,,,,"C",,,,,,,"https://opendata.rdw.nl/resource/3huj-srit.json","https://opendata.rdw.nl/resource/8ys7-d773.json","https://opendata.rdw.nl/resource/vezc-m2t6.json","https://opendata.rdw.nl/resource/jhie-znh9.json","https://opendata.rdw.nl/resource/kmfi-hrps.json"
"NT751B","Personenauto","MERCEDES-BENZ","CLS 220 D","20240704","20240329","4271","sedan","4","GRIJS","Niet geregistreerd","4","2143","1690","2275","1790",,,"20160224","20170410","Geen verstrekking in Open Data","68998","Ja",,,,,,,"4","4","0","0",,"0","0","M1",,,"r. voorzitting","2275","218",,"e1*2007/46*0485*15","G30RP0","CZCC0404","0","0.07","287","Nee","Nee",,"Nee","0","0","0.00","2024","Geen oordeel","05","Ja","2024-07-04T00:00:00.000","2024-03-29T00:00:00.000","2016-02-24T00:00:00.000","2017-04-10T00:00:00.000",,,,,,,,,,,,,,,,,,,,,"C",,,,,,,"https://opendata.rdw.nl/resource/3huj-srit.json","https://opendata.rdw.nl/resource/8ys7-d773.json","https://opendata.rdw.nl/resource/vezc-m2t6.json","https://opendata.rdw.nl/resource/jhie-znh9.json","https://opendata.rdw.nl/resource/kmfi-hrps.json"
"NT967J","Personenauto","MERCEDES-BENZ","CLS 220 D","20250418","20171030","10294","sedan","4","ZWART","Niet geregistreerd","4","2143","1690","2275","1790",,,"20170418","20170418","Geen verstrekking in Open Data","66617","Ja",,,,,,,"4","4","0","0",,"497","188","M1",,,"onder r. voorzitting","2275","218",,"e1*2007/46*0485*16","G30RP0","CZCZ0404","0","0.07","287","Nee","Nee",,"Nee","0","0","0.00","2024","Logisch","00","Ja","2025-04-18T00:00:00.000","2017-10-30T00:00:00.000","2017-04-18T00:00:00.000","2017-04-18T00:00:00.000",,,,,,,,,,,"143",,,,,,,,,,"C",,,,,,,"https://opendata.rdw.nl/resource/3huj-srit.json","https://opendata.rdw.nl/resource/8ys7-d773.json","https://opendata.rdw.nl/resource/vezc-m2t6.json","https://opendata.rdw.nl/resource/jhie-znh9.json","https://opendata.rdw.nl/resource/kmfi-hrps.json"
"NV458D","Personenauto","MERCEDES-BENZ","CLS 220 D","20250425","20170929","11220","stationwagen","5","BLAUW","Niet geregistreerd","4","2143","1745","2370","1845","750","2100","20170425","20170425","Geen verstrekking in Open Data","69358","Ja",,,,,,,"5","4","0","0",,"498","188","M1",,,"onder r. voorzitting","2370","218",,"e1*2007/46*0485*16","G20RP0","CZCA0524","0","0.07","287","Nee","Nee",,"Nee","4570","0","0.00","2024","Logisch","00","Ja","2025-04-25T00:00:00.000","2017-09-29T00:00:00.000","2017-04-25T00:00:00.000","2017-04-25T00:00:00.000",,,,,,,,,,,"143",,,,,,,,,,"C",,,,,,,"https://opendata.rdw.nl/resource/3huj-srit.json","https://opendata.rdw.nl/resource/8ys7-d773.json","https://opendata.rdw.nl/resource/vezc-m2t6.json","https://opendata.rdw.nl/resource/jhie-znh9.json","https://opendata.rdw.nl/resource/kmfi-hrps.json"
"P393DT","Personenauto","MERCEDES-BENZ","CLS 220 D","20250221","20230327","17059","sedan","5","GROEN","Niet geregistreerd","4","1950","1700","2410","1800","750","1900","20220221","20220221","Geen verstrekking in Open Data","93047","Ja","235",,,,,,"4","4",,,,"501","190","M1",,,,"2410","R1ECLS",,"e1*2007/46*1818*14","E314T0","CZAA151B","0","0.08","294","Nee","Nee",,"Nee","4380",,,"2024","Logisch","00","Ja","2025-02-21T00:00:00.000","2023-03-27T00:00:00.000","2022-02-21T00:00:00.000","2022-02-21T00:00:00.000",,,,,,,,,,,"144",,,,,,,,,"76","C","20220211","2022-02-11T00:00:00.000",,,,,"https://opendata.rdw.nl/resource/3huj-srit.json","https://opendata.rdw.nl/resource/8ys7-d773.json","https://opendata.rdw.nl/resource/vezc-m2t6.json","https://opendata.rdw.nl/resource/jhie-znh9.json","https://opendata.rdw.nl/resource/kmfi-hrps.json"