"kenteken","voertuigsoort","merk","handelsbenaming","vervaldatum_apk","datum_tenaamstelling","bruto_bpm","inrichting","aantal_zitplaatsen","eerste_kleur","tweede_kleur","aantal_cilinders","cilinderinhoud","massa_ledig_voertuig","toegestane_maximum_massa_voertuig","massa_rijklaar","maximum_massa_trekken_ongeremd","maximum_trekken_massa_geremd","datum_eerste_toelating","datum_eerste_tenaamstelling_in_nederland","wacht_op_keuren","catalogusprijs","wam_verzekerd","maximale_constructiesnelheid","laadvermogen","oplegger_geremd","aanhangwagen_autonoom_geremd","aanhangwagen_middenas_geremd","aantal_staanplaatsen","aantal_deuren","aantal_wielen","afstand_hart_koppeling_tot_achterzijde_voertuig","afstand_voorzijde_voertuig_tot_hart_koppeling","afwijkende_maximum_snelheid","lengte","breedte","europese_voertuigcategorie","europese_voertuigcategorie_toevoeging","europese_uitvoeringcategorie_toevoeging","plaats_chassisnummer","technische_max_massa_voertuig","type","type_gasinstallatie","typegoedkeuringsnummer","variant","uitvoering","volgnummer_wijziging_eu_typegoedkeuring","vermogen_massarijklaar","wielbasis","export_indicator","openstaande_terugroepactie_indicator","vervaldatum_tachograaf","taxi_indicator","maximum_massa_samenstelling","aantal_rolstoelplaatsen","maximum_ondersteunende_snelheid","jaar_laatste_registratie_tellerstand","tellerstandoordeel","code_toelichting_tellerstandoordeel","tenaamstellen_mogelijk","vervaldatum_apk_dt","datum_tenaamstelling_dt","datum_eerste_toelating_dt","datum_eerste_tenaamstelling_in_nederland_dt","vervaldatum_tachograaf_dt","maximum_last_onder_de_vooras_sen_tezamen_koppeling","type_remsysteem_voertuig_code","rupsonderstelconfiguratiecode","wielbasis_voertuig_minimum","wielbasis_voertuig_maximum","lengte_voertuig_minimum","lengte_voertuig_maximum","breedte_voertuig_minimum","breedte_voertuig_maximum","hoogte_voertuig","hoogte_voertuig_minimum","hoogte_voertuig_maximum","massa_bedrijfsklaar_minimaal","massa_bedrijfsklaar_maximaal","technisch_toelaatbaar_massa_koppelpunt","maximum_massa_technisch_maximaal","maximum_massa_technisch_minimaal","subcategorie_nederland","verticale_belasting_koppelpunt_getrokken_voertuig","zuinigheidsclassificatie","registratie_datum_goedkeuring_afschrijvingsmoment_bpm","registratie_datum_goedkeuring_afschrijvingsmoment_bpm_dt","gem_lading_wrde","aerodyn_voorz","massa_alt_aandr","verl_cab_ind","api_gekentekende_voertuigen_assen","api_gekentekende_voertuigen_brandstof","api_gekentekende_voertuigen_carrosserie","api_gekentekende_voertuigen_carrosserie_specifiek","api_gekentekende_voertuigen_voertuigklasse"
"G067DS","Personenauto","MASERATI","LEVANTE DIESEL","20250103","20190905","22843","stationwagen","5","GROEN","Niet geregistreerd","6","2987","2180","2900","2280","750","2700","20171117","20190905","Geen verstrekking in Open Data","133560","Ja","230",,,,,,"4","4","0","0",,"500","197","M1",,,,"2900","M156",,"e3*2007/46*0224*08","1G4","5HW","0","0.09","300","Nee","Nee",,"Nee","5600","0","0.00","2024","Geen oordeel","05","Ja","2025-01-03T00:00:00.000","2019-09-05T00:00:00.000","2017-11-17T00:00:00.000","2019-09-05T00:00:00.000",,,,,,,,,,,"168",,,,,,,,,,"E",,,,,,,"https://opendata.rdw.nl/resource/3huj-srit.json","https://opendata.rdw.nl/resource/8ys7-d773.json","https://opendata.rdw.nl/resource/vezc-m2t6.json","https://opendata.rdw.nl/resource/jhie-znh9.json","https://opendata.rdw.nl/resource/kmfi-hrps.json"
"G109ND","Personenauto","MASERATI","LEVANTE DIESEL","20240908","20240118","14167","stationwagen","5","GRIJS","Niet geregistreerd","6","2987","2180","2900","2280","750","2700","20161228","20191025","Geen verstrekking in Open Data","114478","Nee","230",,,,,,"4","4",,,,"500","197","M1",,,,"2900","M156",,,,,,"0.09","300","Nee","Nee",,"Nee","5600",,,"2024","Geen oordeel","05","Ja","2024-09-08T00:00:00.000","2024-01-18T00:00:00.000","2016-12-28T00:00:00.000","2019-10-25T00:00:00.000",,,,,,,,,,,"168",,,,,,,,,,"E",,,,,,,"https://opendata.rdw.nl/resource/3huj-srit.json","https://opendata.rdw.nl/resource/8ys7-d773.json","https://opendata.rdw.nl/resource/vezc-m2t6.json","https://opendata.rdw.nl/resource/jhie-znh9.json","https://opendata.rdw.nl/resource/kmfi-hrps.json"
"H629PP","Personenauto","MASERATI","LEVANTE DIESEL","20250425","20240424","5798","stationwagen","5","ZWART","Niet geregistreerd","6","2987","2180","2900","2280","750","2700","20170120","20200805","Geen verstrekking in Open Data","119058","Ja","230",,,,,,"4","4","0","0",,"500","197","M1",,,"r. bodemplaat by achterzitting","2900","M156",,"e3*2007/46*0224*08","1G4","5HW","0","0.09","300","Nee","Nee",,"Nee","5600","0","0.00","2024","Geen oordeel","05","Ja","2025-04-25T00:00:00.000","2024-04-24T00:00:00.000","2017-01-20T00:00:00.000","2020-08-05T00:00:00.000",,,,,,,,,,,"168",,,,,,,,,,"E",,,,,,,"https://opendata.rdw.nl/resource/3huj-srit.json","https://opendata.rdw.nl/resource/8ys7-d773.json","https://opendata.rdw.nl/resource/vezc-m2t6.json","https://opendata.rdw.nl/resource/jhie-znh9.json","https://opendata.rdw.nl/resource/kmfi-hrps.json"
"J239JS","Personenauto","MASERATI","LEVANTE DIESEL","20241021","20200819","25532","stationwagen","5","GROEN","Niet geregistreerd","6","2987","2180","2900","2280","750","2700","20170109","20200819","Geen verstrekking in Open Data","119652","Ja","230",,,,,,"4","4","0","0",,"500","197","M1",,,,"2900","M156",,"e3*2007/46*0224*08","1G4","5HW","0","0.09","300","Nee","Nee",,"Nee","5600","0","0.00","2024","Geen oordeel","05","Ja","2024-10-21T00:00:00.000","2020-08-19T00:00:00.000","2017-01-09T00:00:00.000","2020-08-19T00:00:00.000",,,,,,,,,,,"168",,,,,,,,,,"E",,,,,,,"https://opendata.rdw.nl/resource/3huj-srit.json","https://opendata.rdw.nl/resource/8ys7-d773.json","https://opendata.rdw.nl/resource/vezc-m2t6.json","https://opendata.rdw.nl/resource/jhie-znh9.json","https://opendata.rdw.nl/resource/kmfi-hrps.json"
"J707DJ","Personenauto","MASERATI","LEVANTE DIESEL","20240713","20230719","15210","stationwagen","5","WIT","Niet geregistreerd","6","2987","2180","2900","2280","750","2700","20170503","20200710","Geen verstrekking in Open Data","134963","Ja","230",,,,,,"4","4","0","0",,"500","197","M1",,,,"2900","M156",,"e3*2007/46*0224*08","1G4","5HW","0","0.09","300","Nee","Nee",,"Nee","5600","0","0.00","2023","Geen oordeel","05","Ja","2024-07-13T00:00:00.000","2023-07-19T00:00:00.000","2017-05-03T00:00:00.000","2020-07-10T00:00:00.000",,,,,,,,,,,"168",,,,,,,,,,"E",,,,,,,"https://opendata.rdw.nl/resource/3huj-srit.json","https://opendata.rdw.nl/resource/8ys7-d773.json","https://opendata.rdw.nl/resource/vezc-m2t6.json","https://opendata.rdw.nl/resource/jhie-znh9.json","https://opendata.rdw.nl/resource/kmfi-hrps.json"
"J883HK","Personenauto","MASERATI","LEVANTE DIESEL","20240907","20230901","24894","stationwagen","5","ZWART","Niet geregistreerd","6","2987","2180","2900","2280","750","2700","20170317","20200807","Geen verstrekking in Open Data","113277","Ja","230",,,,,,"4","4","0","0",,"500","197","M1",,,"r. bodemplaat by voorzitting","2900","M156",,"e3*2007/46*0224*08","1G4","5HW","0","0.09","300","Nee","Nee",,"Nee","5600","0","0.00","2023","Geen oordeel","05","Ja","2024-09-07T00:00:00.000","2023-09-01T00:00:00.000","2017-03-17T00:00:00.000","2020-08-07T00:00:00.000",,,,,,,,,,,"168",,,,,,,,,,"E",,,,,,,"https://opendata.rdw.nl/resource/3huj-srit.json","https://opendata.rdw.nl/resource/8ys7-d773.json","https://opendata.rdw.nl/resource/vezc-m2t6.json","https://opendata.rdw.nl/resource/jhie-znh9.json","https://opendata.rdw.nl/resource/kmfi-hrps.json"
"K067TL","Personenauto","MASERATI","LEVANTE DIESEL","20241027","20210301","18434","stationwagen","5","GRIJS","Niet geregistreerd","6","2987","2180","2900","2280","750","2700","20171018","20210301","Geen verstrekking in Open Data","106585","Ja","230",,,,,,"4","4","0","0",,"500","197","M1",,,"r. bodemplaat by voorzitting","2900","M156",,"e3*2007/46*0224*10","1G4","5HWS","0","0.09","300","Nee","Nee",,"Nee","5600","0","0.00","2023","Geen oordeel","05","Ja","2024-10-27T00:00:00.000","2021-03-01T00:00:00.000","2017-10-18T00:00:00.000","2021-03-01T00:00:00.000",,,,,,,,,,,"168",,,,,,,,,,"E",,,,,,,"https://opendata.rdw.nl/resource/3huj-srit.json","https://opendata.rdw.nl/resource/8ys7-d773.json","https://opendata.rdw.nl/resource/vezc-m2t6.json","https://opendata.rdw.nl/resource/jhie-znh9.json","https://opendata.rdw.nl/resource/kmfi-hrps.json"
"K196RX","Personenauto","MASERATI","LEVANTE DIESEL","20231229","20210212","17112","stationwagen","5","WIT","Niet geregistreerd","6","2987","2180","2900","2280","750","2700","20170510","20210212","Geen verstrekking in Open Data","114114","Nee","230",,,,,,"4","4","0","0",,"500","197","M1",,,"r. bodemplaat by voorzitting","2900","M156",,"e3*2007/46*0224*08","1G4","5HW","0","0.09","300","Nee","Nee",,"Nee","5600","0","0.00","2022","Geen oordeel","05","Ja","2023-12-29T00:00:00.000","2021-02-12T00:00:00.000","2017-05-10T00:00:00.000","2021-02-12T00:00:00.000",,,,,,,,,,,"168",,,,,,,,,,"E",,,,,,,"https://opendata.rdw.nl/resource/3huj-srit.json","https://opendata.rdw.nl/resource/8ys7-d773.json","https://opendata.rdw.nl/resource/vezc-m2t6.json","https://opendata.rdw.nl/resource/jhie-znh9.json","https://opendata.rdw.nl/resource/kmfi-hrps.json"
"K720VJ","Personenauto","MASERATI","LEVANTE DIESEL","20250404","20210318","27759","stationwagen","5","GROEN","Niet geregistreerd","6","2987","2180","2900","2280","750","2700","20190829","20210311","Geen verstrekking in Open Data","140081","Ja","230",,,,,,"4","4",,,,"500","197","M1",,,"r. bodemplaat by voorzitting","2900","M156",,,,,,"0.09","300","Nee","Nee",,"Nee","5600",,,"2024","Geen oordeel","05","Ja","2025-04-04T00:00:00.000","2021-03-18T00:00:00.000","2019-08-29T00:00:00.000","2021-03-11T00:00:00.000",,,,,,,,,,,"168",,,,,,,,,,,,,,,,,"https://opendata.rdw.nl/resource/3huj-srit.json","https://opendata.rdw.nl/resource/8ys7-d773.json","https://opendata.rdw.nl/resource/vezc-m2t6.json","https://opendata.rdw.nl/resource/jhie-znh9.json","https://opendata.rdw.nl/resource/kmfi-hrps.json"
"KB669N","Personenauto","MASERATI","LEVANTE DIESEL","20250430","20210508","30843","stationwagen","5","GRIJS","Niet geregistreerd","6","2987","2180","2900","2280","750","2700","20160727","20160727","Geen verstrekking in Open Data","125698","Ja",,,,,,,"5","4","0","0",,"500","197","M1",,,"in bodemplaat r. v.","2900","M156",,"e3*2007/46*0224*08","1G4","5HW","0","0.09","300","Nee","Ja",,"Nee","5600","0","0.00","2024","Logisch","00","Ja","2025-04-30T00:00:00.000","2021-05-08T00:00:00.000","2016-07-27T00:00:00.000","2016-07-27T00:00:00.000",,,,,,,,,,,"168",,,,,,,,,,"E",,,,,,,"https://opendata.rdw.nl/resource/3huj-srit.json","https://opendata.rdw.nl/resource/8ys7-d773.json","https://opendata.rdw.nl/resource/vezc-m2t6.json","https://opendata.rdw.nl/resource/jhie-znh9.json","https://opendata.rdw.nl/resource/kmfi-hrps.json"
"KH906L","Personenauto","MASERATI","LEVANTE DIESEL","20250426","20220104","24125","stationwagen","5","ZWART","Niet geregistreerd","6","2987","2180","2900","2280","750","2700","20160802","20160909","Geen verstrekking in Open Data","120045","Ja",,,,,,,"4","4","0","0",,"500","0","M1",,,"r. bodemplaat by voorzitting","2900","M156",,"e3*2007/46*0224*08","1G4","5HW","0","0.09","300","Nee","Ja",,"Nee","5600","0","0.00","2024","Geen oordeel","05","Ja","2025-04-26T00:00:00.000","2022-01-04T00:00:00.000","2016-08-02T00:00:00.000","2016-09-09T00:00:00.000",,,,,,,,,,,,,,,,,,,,,"E",,,,,,,"https://opendata.rdw.nl/resource/3huj-srit.json","https://opendata.rdw.nl/resource/8ys7-d773.json","https://opendata.rdw.nl/resource/vezc-m2t6.json","https://opendata.rdw.nl/resource/jhie-znh9.json","https://opendata.rdw.nl/resource/kmfi-hrps.json"
"KN704L","Personenauto","MASERATI","LEVANTE DIESEL","20241021","20161020","30843","stationwagen","5","GRIJS","Niet geregistreerd","6","2987","2180","2900","2280","750","2700","20161020","20161020","Geen verstrekking in Open Data","115803","Ja",,,,,,,"5","4","0","0",,"500","197","M1",,,"in bodemplaat r. v.","2900","M156",,"e3*2007/46*0224*08","1G4","5HW","0","0.09","300","Nee","Ja",,"Nee","5600","0","0.00","2023","Logisch","00","Ja","2024-10-21T00:00:00.000","2016-10-20T00:00:00.000","2016-10-20T00:00:00.000","2016-10-20T00:00:00.000",,,,,,,,,,,"168",,,,,,,,,,"E",,,,,,,"https://opendata.rdw.nl/resource/3huj-srit.json","https://opendata.rdw.nl/resource/8ys7-d773.json","https://opendata.rdw.nl/resource/vezc-m2t6.json","https://opendata.rdw.nl/resource/jhie-znh9.json","https://opendata.rdw.nl/resource/kmfi-hrps.json"
"KR225K","Personenauto","MASERATI","LEVANTE DIESEL","20250109","20220510","30843","stationwagen","5","WIT","Niet geregistreerd","6","2987","2180","2900","2280","750","2700","20161124","20161124","Geen verstrekking in Open Data","129114","Ja",,,,,,,"5","4","0","0",,"500","197","M1",,,"in bodemplaat r. v.","2900","M156",,"e3*2007/46*0224*08","1G4","5HW","0","0.09","300","Nee","Ja",,"Nee","5600","0","0.00","2024","Logisch","00","Ja","2025-01-09T00:00:00.000","2022-05-10T00:00:00.000","2016-11-24T00:00:00.000","2016-11-24T00:00:00.000",,,,,,,,,,,"168",,,,,,,,,,"E",,,,,,,"https://opendata.rdw.nl/resource/3huj-srit.json","https://opendata.rdw.nl/resource/8ys7-d773.json","https://opendata.rdw.nl/resource/vezc-m2t6.json","https://opendata.rdw.nl/resource/jhie-znh9.json","https://opendata.rdw.nl/resource/kmfi-hrps.json"
"L110GF","Personenauto","MASERATI","LEVANTE DIESEL","20241231","20231208","16574","stationwagen","5","ZWART","Niet geregistreerd","6","2987","2180","2900","2280","750","2700","20170517","20210507","Geen verstrekking in Open Data","123111","Ja","230",,,,,,"4","4","0","0",,"500","197","M1",,,,"2900","M156",,"e3*2007/46*0224*08","1G4","5HW","0","0.09","300","Nee","Nee",,"Nee","5600","0","0.00","2023","Geen oordeel","05","Ja","2024-12-31T00:00:00.000","2023-12-08T00:00:00.000","2017-05-17T00:00:00.000","2021-05-07T00:00:00.000",,,,,,,,,,,"168",,,,,,,,,,,,,,,,,"https://opendata.rdw.nl/resource/3huj-srit.json","https://opendata.rdw.nl/resource/8ys7-d773.json","https://opendata.rdw.nl/resource/vezc-m2t6.json","https://opendata.rdw.nl/resource/jhie-znh9.json","https://opendata.rdw.nl/resource/kmfi-hrps.json"
"L379TZ","Personenauto","MASERATI","LEVANTE DIESEL","20230512","20240201","21686","stationwagen","5","ZWART","Niet geregistreerd","6","2987","2180","2900","2280","750","2700","20161020","20210809","Geen verstrekking in Open Data","114464","Ja","230",,,,,,"4","4","0","0",,"500","197","M1",,,,"2900","M156",,"e3*2007/46*0224*08","1G4","5HW","0","0.09","300","Nee","Nee",,"Nee","5600","0","0.00","2024","Geen oordeel","05","Ja","2023-05-12T00:00:00.000","2024-02-01T00:00:00.000","2016-10-20T00:00:00.000","2021-08-09T00:00:00.000",,,,,,,,,,,"168",,,,,,,,,,,,,,,,,"https://opendata.rdw.nl/resource/3huj-srit.json","https://opendata.rdw.nl/resource/8ys7-d773.json","https://opendata.rdw.nl/resource/vezc-m2t6.json","https://opendata.rdw.nl/resource/jhie-znh9.json","https://opendata.rdw.nl/resource/kmfi-hrps.json"
"L825DB","Personenauto","MASERATI","LEVANTE DIESEL","20250122","20210930","39943","stationwagen","5","GRIJS","Niet geregistreerd","6","2987","2180","2900","2280","750","2700","20200122","20210419","Geen verstrekking in Open Data","160435","Ja","230",,,,,,"5","4",,,,"500","197","M1",,,,"2900","M156",,"e3*2007/46*0224*17","1G4","5HDG","0","0.09","300","Nee","Nee",,"Nee","5600",,,"2024","Geen oordeel","05","Ja","2025-01-22T00:00:00.000","2021-09-30T00:00:00.000","2020-01-22T00:00:00.000","2021-04-19T00:00:00.000",,,,,,,,,,,"168",,,,,,,,,,,,,,,,,"https://opendata.rdw.nl/resource/3huj-srit.json","https://opendata.rdw.nl/resource/8ys7-d773.json","https://opendata.rdw.nl/resource/vezc-m2t6.json","https://opendata.rdw.nl/resource/jhie-znh9.json","https://opendata.rdw.nl/resource/kmfi-hrps.json"
"L853NH","Personenauto","MASERATI","LEVANTE DIESEL","20241110","20231202","26182","stationwagen","5","BLAUW","Niet geregistreerd","6","2987","2180","2900","2280","750","2700","20170822","20210622","Geen verstrekking in Open Data","125113","Ja","230",,,,,,"4","4","0","0",,"500","197","M1",,,,"2900","M156",,"e3*2007/46*0224*08","1G4","5HW","0","0.09","300","Nee","Nee",,"Nee","5600","0","0.00","2024","Geen oordeel","05","Ja","2024-11-10T00:00:00.000","2023-12-02T00:00:00.000","2017-08-22T00:00:00.000","2021-06-22T00:00:00.000",,,,,,,,,,,"168",,,,,,,,,,,,,,,,,"https://opendata.rdw.nl/resource/3huj-srit.json","https://opendata.rdw.nl/resource/8ys7-d773.json","https://opendata.rdw.nl/resource/vezc-m2t6.json","https://opendata.rdw.nl/resource/jhie-znh9.json","https://opendata.rdw.nl/resource/kmfi-hrps.json"
"N254XX","Personenauto","MASERATI","LEVANTE DIESEL","20241005","20220105","32795","stationwagen","5","GRIJS","Niet geregistreerd","6","2987","2180","2900","2280","750","2700","20210107","20220105","Geen verstrekking in Open Data","176175","Ja","230",,,,,,"5","4",,,,"500","197","M1",,,,"2900","M156",,"e3*2007/46*0224*20","1G4","5HDGD","0","0.09","300","Nee","Nee",,"Nee","5600",,,"2024","Geen oordeel","05","Ja","2024-10-05T00:00:00.000","2022-01-05T00:00:00.000","2021-01-07T00:00:00.000","2022-01-05T00:00:00.000",,,,,,,,,,,"168",,,,,,,,,,,"20211222","2021-12-22T00:00:00.000",,,,,"https://opendata.rdw.nl/resource/3huj-srit.json","https://opendata.rdw.nl/resource/8ys7-d773.json","https://opendata.rdw.nl/resource/vezc-m2t6.json","https://opendata.rdw.nl/resource/jhie-znh9.json","https://opendata.rdw.nl/resource/kmfi-hrps.json"
"N305NL","Personenauto","MASERATI","LEVANTE DIESEL","20250223",,"41943","stationwagen","5","ZWART","Niet geregistreerd","6","2987","2180","2900","2280","750","2700","20190122","20211119","Geen verstrekking in Open Data","140968","Ja","230",,,,,,"5","4","0","0",,"500","197","M1",,,"r. bodemplaat by voorzitting","2900","M156",,"e3*2007/46*0224*13","1G4","5HAD","0","0.09","300","Nee","Nee",,"Nee","5600","0","0.00","2024","Geen oordeel","05","Ja","2025-02-23T00:00:00.000",,"2019-01-22T00:00:00.000","2021-11-19T00:00:00.000",,,,,,,,,,,"168",,,,,,,,,,,"20211026","2021-10-26T00:00:00.000",,,,,"https://opendata.rdw.nl/resource/3huj-srit.json","https://opendata.rdw.nl/resource/8ys7-d773.json","https://opendata.rdw.nl/resource/vezc-m2t6.json","https://opendata.rdw.nl/resource/jhie-znh9.json","https://opendata.rdw.nl/resource/kmfi-hrps.json"
"NB906F","Personenauto","MASERATI","LEVANTE DIESEL","20240329","20240426","30843","stationwagen","5","ZWART","Niet geregistreerd","6","2987","2180","2900","2280","750","2700","20170104","20170104","Geen verstrekking in Open Data","122401","Ja",,,,,,,"5","4","0","0",,"500","197","M1",,,"in bodemplaat r. v.","2900","M156",,"e3*2007/46*0224*08","1G4","5HW","0","0.09","300","Nee","Ja",,"Nee","5600","0","0.00","2024","Logisch","00","Ja","2024-03-29T00:00:00.000","2024-04-26T00:00:00.000","2017-01-04T00:00:00.000","2017-01-04T00:00:00.000",,,,,,,,,,,"168",,,,,,,,,,"E",,,,,,,"https://opendata.rdw.nl/resource/3huj-srit.json","https://opendata.rdw.nl/resource/8ys7-d773.json","https://opendata.rdw.nl/resource/vezc-m2t6.json","https://opendata.rdw.nl/resource/jhie-znh9.json","https://opendata.rdw.nl/resource/kmfi-hrps.json"
"NB907F","Personenauto","MASERATI","LEVANTE DIESEL","20250224","20170110","30843","stationwagen","5","GRIJS","Niet geregistreerd","6","2987","2180","2900","2280","750","2700","20170110","20170110","Geen verstrekking in Open Data","132631","Ja",,,,,,,"5","4","0","0",,"500","197","M1",,,"in bodemplaat r. v.","2900","M156",,"e3*2007/46*0224*08","1G4","5HW","0","0.09","300","Nee","Nee",,"Nee","5600","0","0.00","2024","Logisch","00","Ja","2025-02-24T00:00:00.000","2017-01-10T00:00:00.000","2017-01-10T00:00:00.000","2017-01-10T00:00:00.000",,,,,,,,,,,"168",,,,,,,,,,"E",,,,,,,"https://opendata.rdw.nl/resource/3huj-srit.json","https://opendata.rdw.nl/resource/8ys7-d773.json","https://opendata.rdw.nl/resource/vezc-m2t6.json","https://opendata.rdw.nl/resource/jhie-znh9.json","https://opendata.rdw.nl/resource/kmfi-hrps.json"
"NB908F","Personenauto","MASERATI","LEVANTE DIESEL","20250123","20190125","30843","stationwagen","5","ZWART","Niet geregistreerd","6","2987","2180","2900","2280","750","2700","20170106","20170106","Geen verstrekking in Open Data","123162","Ja",,,,,,,"5","4","0","0",,"500","197","M1",,,"in bodemplaat r. v.","2900","M156",,"e3*2007/46*0224*08","1G4","5HW","0","0.09","300","Nee","Ja",,"Nee","5600","0","0.00","2023","Logisch","00","Ja","2025-01-23T00:00:00.000","2019-01-25T00:00:00.000","2017-01-06T00:00:00.000","2017-01-06T00:00:00.000",,,,,,,,,,,"168",,,,,,,,,,"E",,,,,,,"https://opendata.rdw.nl/resource/3huj-srit.json","https://opendata.rdw.nl/resource/8ys7-d773.json","https://opendata.rdw.nl/resource/vezc-m2t6.json","https://opendata.rdw.nl/resource/jhie-znh9.json","https://opendata.rdw.nl/resource/kmfi-hrps.json"
"NB997H","Personenauto","MASERATI","LEVANTE DIESEL","20250227","20170227","30843","stationwagen","5","GRIJS","Niet geregistreerd","6","2987","2180","2900","2280","750","2700","20170227","20170227","Geen verstrekking in Open Data","122113","Ja",,,,,,,"5","4","0","0",,"500","197","M1",,,"in bodemplaat r. v.","2900","M156",,"e3*2007/46*0224*08","1G4","5HW","0","0.09","300","Nee","Ja",,"Nee","5600","0","0.00","2024","Logisch","00","Ja","2025-02-27T00:00:00.000","2017-02-27T00:00:00.000","2017-02-27T00:00:00.000","2017-02-27T00:00:00.000",,,,,,,,,,,"168",,,,,,,,,,"E",,,,,,,"https://opendata.rdw.nl/resource/3huj-srit.json","https://opendata.rdw.nl/resource/8ys7-d773.json","https://opendata.rdw.nl/resource/vezc-m2t6.json","https://opendata.rdw.nl/resource/jhie-znh9.json","https://opendata.rdw.nl/resource/kmfi-hrps.json"
"ND376K","Personenauto","MASERATI","LEVANTE DIESEL","20250103","20190608","30843","stationwagen","5","WIT","Niet geregistreerd","6","2987","2180","2900","2280","750","2700","20170103","20170103","Geen verstrekking in Open Data","132117","Ja",,,,,,,"5","4","0","0",,"500","197","M1",,,"in bodemplaat r. v.","2900","M156",,"e3*2007/46*0224*08","1G4","5HW","0","0.09","300","Nee","Ja",,"Nee","5600","0","0.00","2023","Logisch","00","Ja","2025-01-03T00:00:00.000","2019-06-08T00:00:00.000","2017-01-03T00:00:00.000","2017-01-03T00:00:00.000",,,,,,,,,,,"168",,,,,,,,,,"E",,,,,,,"https://opendata.rdw.nl/resource/3huj-srit.json","https://opendata.rdw.nl/resource/8ys7-d773.json","https://opendata.rdw.nl/resource/vezc-m2t6.json","https://opendata.rdw.nl/resource/jhie-znh9.json","https://opendata.rdw.nl/resource/kmfi-hrps.json"
"ND380K","Personenauto","MASERATI","LEVANTE DIESEL","20250108","20201002","30843","stationwagen","5","WIT","Niet geregistreerd","6","2987","2180","2900","2280","750","2700","20170106","20170106","Geen verstrekking in Open Data","129199","Ja",,,,,,,"5","4","0","0",,"500","197","M1",,,"in bodemplaat r. v.","2900","M156",,"e3*2007/46*0224*08","1G4","5HW","0","0.09","300","Nee","Nee",,"Nee","5600","0","0.00","2023","Logisch","00","Ja","2025-01-08T00:00:00.000","2020-10-02T00:00:00.000","2017-01-06T00:00:00.000","2017-01-06T00:00:00.000",,,,,,,,,,,"168",,,,,,,,,,"E",,,,,,,"https://opendata.rdw.nl/resource/3huj-srit.json","https://opendata.rdw.nl/resource/8ys7-d773.json","https://opendata.rdw.nl/resource/vezc-m2t6.json","https://opendata.rdw.nl/resource/jhie-znh9.json","https://opendata.rdw.nl/resource/kmfi-hrps.json"
"NF162X","Personenauto","MASERATI","LEVANTE DIESEL","20250116","20170109","30843","stationwagen","5","WIT","Niet geregistreerd","6","2987","2180","2900","2280","750","2700","20170109","20170109","Geen verstrekking in Open Data","107148","Ja",,,,,,,"4","4","0","0",,"500","0","M1",,,"r. bodemplaat by voorzitting","2900","M156",,"e3*2007/46*0224*08","1G4","5HW","0","0.09","300","Nee","Ja",,"Nee","5600","0","0.00","2024","Logisch","00","Ja","2025-01-16T00:00:00.000","2017-01-09T00:00:00.000","2017-01-09T00:00:00.000","2017-01-09T00:00:00.000",,,,,,,,,,,,,,,,,,,,,"E",,,,,,,"https://opendata.rdw.nl/resource/3huj-srit.json","https://opendata.rdw.nl/resource/8ys7-d773.json","https://opendata.rdw.nl/resource/vezc-m2t6.json","https://opendata.rdw.nl/resource/jhie-znh9.json","https://opendata.rdw.nl/resource/kmfi-hrps.json"