"kenteken","voertuigsoort","merk","handelsbenaming","vervaldatum_apk","datum_tenaamstelling","bruto_bpm","inrichting","aantal_zitplaatsen","eerste_kleur","tweede_kleur","aantal_cilinders","cilinderinhoud","massa_ledig_voertuig","toegestane_maximum_massa_voertuig","massa_rijklaar","maximum_massa_trekken_ongeremd","maximum_trekken_massa_geremd","datum_eerste_toelating","datum_eerste_tenaamstelling_in_nederland","wacht_op_keuren","catalogusprijs","wam_verzekerd","maximale_constructiesnelheid","laadvermogen","oplegger_geremd","aanhangwagen_autonoom_geremd","aanhangwagen_middenas_geremd","aantal_staanplaatsen","aantal_deuren","aantal_wielen","afstand_hart_koppeling_tot_achterzijde_voertuig","afstand_voorzijde_voertuig_tot_hart_koppeling","afwijkende_maximum_snelheid","lengte","breedte","europese_voertuigcategorie","europese_voertuigcategorie_toevoeging","europese_uitvoeringcategorie_toevoeging","plaats_chassisnummer","technische_max_massa_voertuig","type","type_gasinstallatie","typegoedkeuringsnummer","variant","uitvoering","volgnummer_wijziging_eu_typegoedkeuring","vermogen_massarijklaar","wielbasis","export_indicator","openstaande_terugroepactie_indicator","vervaldatum_tachograaf","taxi_indicator","maximum_massa_samenstelling","aantal_rolstoelplaatsen","maximum_ondersteunende_snelheid","jaar_laatste_registratie_tellerstand","tellerstandoordeel","code_toelichting_tellerstandoordeel","tenaamstellen_mogelijk","vervaldatum_apk_dt","datum_tenaamstelling_dt","datum_eerste_toelating_dt","datum_eerste_tenaamstelling_in_nederland_dt","vervaldatum_tachograaf_dt","maximum_last_onder_de_vooras_sen_tezamen_koppeling","type_remsysteem_voertuig_code","rupsonderstelconfiguratiecode","wielbasis_voertuig_minimum","wielbasis_voertuig_maximum","lengte_voertuig_minimum","lengte_voertuig_maximum","breedte_voertuig_minimum","breedte_voertuig_maximum","hoogte_voertuig","hoogte_voertuig_minimum","hoogte_voertuig_maximum","massa_bedrijfsklaar_minimaal","massa_bedrijfsklaar_maximaal","technisch_toelaatbaar_massa_koppelpunt","maximum_massa_technisch_maximaal","maximum_massa_technisch_minimaal","subcategorie_nederland","verticale_belasting_koppelpunt_getrokken_voertuig","zuinigheidsclassificatie","registratie_datum_goedkeuring_afschrijvingsmoment_bpm","registratie_datum_goedkeuring_afschrijvingsmoment_bpm_dt","gem_lading_wrde","aerodyn_voorz","massa_alt_aandr","verl_cab_ind","api_gekentekende_voertuigen_assen","api_gekentekende_voertuigen_brandstof","api_gekentekende_voertuigen_carrosserie","api_gekentekende_voertuigen_carrosserie_specifiek","api_gekentekende_voertuigen_voertuigklasse"
"G033LF","Personenauto","LEXUS","LEXUS ES300H","20251024","20191024","2990","sedan","5","ZWART","Niet geregistreerd","4","2487","1655","2150","1755",,,"20191024","20191024","Geen verstrekking in Open Data","67545","Ja","180",,,,,,"4","4","0","0",,"498","187","M1",,,,"2150","XZ1L(EU,M)",,"e6*2007/46*0250*01","AXZH10(E)","AXZH10L-AEXGBW(1B)","0","0.07","287","Nee","Nee",,"Nee","2150","0","0.00","2024","Logisch","00","Ja","2025-10-24T00:00:00.000","2019-10-24T00:00:00.000","2019-10-24T00:00:00.000","2019-10-24T00:00:00.000",,,,,,,,,,,"145",,,,,,,,,,,,,,,,,"https://opendata.rdw.nl/resource/3huj-srit.json","https://opendata.rdw.nl/resource/8ys7-d773.json","https://opendata.rdw.nl/resource/vezc-m2t6.json","https://opendata.rdw.nl/resource/jhie-znh9.json","https://opendata.rdw.nl/resource/kmfi-hrps.json"
"G053BT","Personenauto","LEXUS","LEXUS ES300H","20250831","20210729","2990","sedan","5","ZWART","Niet geregistreerd","4","2487","1655","2150","1755",,,"20190829","20190829","Geen verstrekking in Open Data","67545","Ja","180",,,,,,"4","4","0","0",,"498","187","M1",,,,"2150","XZ1L(EU,M)",,"e6*2007/46*0250*01","AXZH10(E)","AXZH10L-AEXGBW(1B)","0","0.07","287","Nee","Nee",,"Nee","2150","0","0.00","2024","Logisch","00","Ja","2025-08-31T00:00:00.000","2021-07-29T00:00:00.000","2019-08-29T00:00:00.000","2019-08-29T00:00:00.000",,,,,,,,,,,"145",,,,,,,,,,,,,,,,,"https://opendata.rdw.nl/resource/3huj-srit.json","https://opendata.rdw.nl/resource/8ys7-d773.json","https://opendata.rdw.nl/resource/vezc-m2t6.json","https://opendata.rdw.nl/resource/jhie-znh9.json","https://opendata.rdw.nl/resource/kmfi-hrps.json"
"G057ZS","Personenauto","LEXUS","LEXUS ES300H","20251223","20201029","2990","sedan","5","GROEN","Niet geregistreerd","4","2487","1655","2150","1755",,,"20191223","20191223","Geen verstrekking in Open Data","67545","Ja","180",,,,,,"4","4","0","0",,"498","187","M1",,,,"2150","XZ1L(EU,M)",,"e6*2007/46*0250*01","AXZH10(E)","AXZH10L-AEXGBW(1B)","0","0.07","287","Nee","Nee",,"Nee","2150","0","0.00","2023","Logisch","00","Ja","2025-12-23T00:00:00.000","2020-10-29T00:00:00.000","2019-12-23T00:00:00.000","2019-12-23T00:00:00.000",,,,,,,,,,,"145",,,,,,,,,,,,,,,,,"https://opendata.rdw.nl/resource/3huj-srit.json","https://opendata.rdw.nl/resource/8ys7-d773.json","https://opendata.rdw.nl/resource/vezc-m2t6.json","https://opendata.rdw.nl/resource/jhie-znh9.json","https://opendata.rdw.nl/resource/kmfi-hrps.json"
"G060HG","Personenauto","LEXUS","LEXUS ES300H","20251011","20240423","2597","sedan","5","GRIJS","Niet geregistreerd","4","2487","1655","2150","1755",,,"20191009","20191009","Geen verstrekking in Open Data","52845","Ja","180",,,,,,"4","4","0","0",,"498","187","M1",,,,"2150","XZ1L(EU,M)",,"e6*2007/46*0250*02","AXZH10(E)","AXZH10L-AEXGBW(1C)","0","0.07","287","Nee","Nee",,"Nee","2150","0","0.00","2024","Logisch","00","Ja","2025-10-11T00:00:00.000","2024-04-23T00:00:00.000","2019-10-09T00:00:00.000","2019-10-09T00:00:00.000",,,,,,,,,,,"145",,,,,,,,,,,,,,,,,"https://opendata.rdw.nl/resource/3huj-srit.json","https://opendata.rdw.nl/resource/8ys7-d773.json","https://opendata.rdw.nl/resource/vezc-m2t6.json","https://opendata.rdw.nl/resource/jhie-znh9.json","https://opendata.rdw.nl/resource/kmfi-hrps.json"
"G076KS","Personenauto","LEXUS","LEXUS ES300H","20250327","20240308","2990","sedan","5","ZWART","Niet geregistreerd","4","2487","1655","2150","1755",,,"20191018","20191018","Geen verstrekking in Open Data","58295","Ja","180",,,,,,"4","4","0","0",,"498","187","M1",,,,"2150","XZ1L(EU,M)",,"e6*2007/46*0250*02","AXZH10(E)","AXZH10L-AEXGBW(1C)","0","0.07","287","Nee","Nee",,"Nee","2150","0","0.00","2024","Logisch","00","Ja","2025-03-27T00:00:00.000","2024-03-08T00:00:00.000","2019-10-18T00:00:00.000","2019-10-18T00:00:00.000",,,,,,,,,,,"145",,,,,,,,,,,,,,,,,"https://opendata.rdw.nl/resource/3huj-srit.json","https://opendata.rdw.nl/resource/8ys7-d773.json","https://opendata.rdw.nl/resource/vezc-m2t6.json","https://opendata.rdw.nl/resource/jhie-znh9.json","https://opendata.rdw.nl/resource/kmfi-hrps.json"
"G087RR","Personenauto","LEXUS","LEXUS ES300H","20251120","20240308","2990","sedan","5","BLAUW","Niet geregistreerd","4","2487","1655","2150","1755",,,"20191120","20191120","Geen verstrekking in Open Data","67545","Ja","180",,,,,,"4","4","0","0",,"498","187","M1",,,,"2150","XZ1L(EU,M)",,"e6*2007/46*0250*02","AXZH10(E)","AXZH10L-AEXGBW(2C)","0","0.07","287","Nee","Nee",,"Nee","2150","0","0.00","2024","Logisch","00","Ja","2025-11-20T00:00:00.000","2024-03-08T00:00:00.000","2019-11-20T00:00:00.000","2019-11-20T00:00:00.000",,,,,,,,,,,"145",,,,,,,,,,,,,,,,,"https://opendata.rdw.nl/resource/3huj-srit.json","https://opendata.rdw.nl/resource/8ys7-d773.json","https://opendata.rdw.nl/resource/vezc-m2t6.json","https://opendata.rdw.nl/resource/jhie-znh9.json","https://opendata.rdw.nl/resource/kmfi-hrps.json"
"G105RT","Personenauto","LEXUS","LEXUS ES300H","20251118","20191118","2597","sedan","5","ZWART","Niet geregistreerd","4","2487","1655","2150","1755",,,"20191118","20191118","Geen verstrekking in Open Data","51550","Ja","180",,,,,,"4","4","0","0",,"498","187","M1",,,,"2150","XZ1L(EU,M)",,"e6*2007/46*0250*02","AXZH10(E)","AXZH10L-AEXGBW(1C)","0","0.07","287","Nee","Nee",,"Nee","2150","0","0.00","2023","Logisch","00","Ja","2025-11-18T00:00:00.000","2019-11-18T00:00:00.000","2019-11-18T00:00:00.000","2019-11-18T00:00:00.000",,,,,,,,,,,"145",,,,,,,,,,,,,,,,,"https://opendata.rdw.nl/resource/3huj-srit.json","https://opendata.rdw.nl/resource/8ys7-d773.json","https://opendata.rdw.nl/resource/vezc-m2t6.json","https://opendata.rdw.nl/resource/jhie-znh9.json","https://opendata.rdw.nl/resource/kmfi-hrps.json"
"G122XB","Personenauto","LEXUS","LEXUS ES300H","20260102","20200102","2597","sedan","5","GRIJS","Niet geregistreerd","4","2487","1655","2150","1755",,,"20200102","20200102","Geen verstrekking in Open Data","52845","Ja","180",,,,,,"4","4","0","0",,"498","187","M1",,,,"2150","XZ1L(EU,M)",,"e6*2007/46*0250*02","AXZH10(E)","AXZH10L-AEXGBW(1C)","0","0.07","287","Nee","Nee",,"Nee","2150","0","0.00","2024","Logisch","00","Ja","2026-01-02T00:00:00.000","2020-01-02T00:00:00.000","2020-01-02T00:00:00.000","2020-01-02T00:00:00.000",,,,,,,,,,,"145",,,,,,,,,,"A",,,,,,,"https://opendata.rdw.nl/resource/3huj-srit.json","https://opendata.rdw.nl/resource/8ys7-d773.json","https://opendata.rdw.nl/resource/vezc-m2t6.json","https://opendata.rdw.nl/resource/jhie-znh9.json","https://opendata.rdw.nl/resource/kmfi-hrps.json"
"G134KP","Personenauto","LEXUS","LEXUS ES300H","20251022","20240418","2990","sedan","5","BLAUW","Niet geregistreerd","4","2487","1655","2150","1755",,,"20191022","20191022","Geen verstrekking in Open Data","57845","Ja","180",,,,,,"4","4","0","0",,"498","187","M1",,,,"2150","XZ1L(EU,M)",,"e6*2007/46*0250*01","AXZH10(E)","AXZH10L-AEXGBW(1B)","0","0.07","287","Nee","Nee",,"Nee","2150","0","0.00","2024","Logisch","00","Ja","2025-10-22T00:00:00.000","2024-04-18T00:00:00.000","2019-10-22T00:00:00.000","2019-10-22T00:00:00.000",,,,,,,,,,,"145",,,,,,,,,,,,,,,,,"https://opendata.rdw.nl/resource/3huj-srit.json","https://opendata.rdw.nl/resource/8ys7-d773.json","https://opendata.rdw.nl/resource/vezc-m2t6.json","https://opendata.rdw.nl/resource/jhie-znh9.json","https://opendata.rdw.nl/resource/kmfi-hrps.json"
"G171BF","Personenauto","LEXUS","LEXUS ES300H","20250826","20230525","2990","sedan","5","GRIJS","Niet geregistreerd","4","2487","1655","2150","1755",,,"20190826","20190826","Geen verstrekking in Open Data","64645","Ja","180",,,,,,"4","4","0","0",,"498","187","M1",,,,"2150","XZ1L(EU,M)",,"e6*2007/46*0250*00","AXZH10(E)","AXZH10L-AEXGBW(1A)","0","0.07","287","Nee","Nee",,"Nee","2150","0","0.00","2023","Logisch","00","Ja","2025-08-26T00:00:00.000","2023-05-25T00:00:00.000","2019-08-26T00:00:00.000","2019-08-26T00:00:00.000",,,,,,,,,,,"145",,,,,,,,,,,,,,,,,"https://opendata.rdw.nl/resource/3huj-srit.json","https://opendata.rdw.nl/resource/8ys7-d773.json","https://opendata.rdw.nl/resource/vezc-m2t6.json","https://opendata.rdw.nl/resource/jhie-znh9.json","https://opendata.rdw.nl/resource/kmfi-hrps.json"
"G215HR","Personenauto","LEXUS","LEXUS ES300H","20250930","20190930","2597","sedan","5","BRUIN","Niet geregistreerd","4","2487","1655","2150","1755",,,"20190930","20190930","Geen verstrekking in Open Data","52845","Ja","180",,,,,,"4","4","0","0",,"498","187","M1",,,,"2150","XZ1L(EU,M)",,"e6*2007/46*0250*00","AXZH10(E)","AXZH10L-AEXGBW(1A)","0","0.07","287","Nee","Nee",,"Nee","2150","0","0.00","2024","Logisch","00","Ja","2025-09-30T00:00:00.000","2019-09-30T00:00:00.000","2019-09-30T00:00:00.000","2019-09-30T00:00:00.000",,,,,,,,,,,"145",,,,,,,,,,,,,,,,,"https://opendata.rdw.nl/resource/3huj-srit.json","https://opendata.rdw.nl/resource/8ys7-d773.json","https://opendata.rdw.nl/resource/vezc-m2t6.json","https://opendata.rdw.nl/resource/jhie-znh9.json","https://opendata.rdw.nl/resource/kmfi-hrps.json"
"G218SR","Personenauto","LEXUS","LEXUS ES300H","20251123","20200323","2597","sedan","5","BRUIN","Niet geregistreerd","4","2487","1655","2150","1755",,,"20191123","20191123","Geen verstrekking in Open Data","52845","Ja","180",,,,,,"4","4","0","0",,"498","187","M1",,,,"2150","XZ1L(EU,M)",,"e6*2007/46*0250*00","AXZH10(E)","AXZH10L-AEXGBW(1A)","0","0.07","287","Nee","Nee",,"Nee","2150","0","0.00","2024","Logisch","00","Ja","2025-11-23T00:00:00.000","2020-03-23T00:00:00.000","2019-11-23T00:00:00.000","2019-11-23T00:00:00.000",,,,,,,,,,,"145",,,,,,,,,,,,,,,,,"https://opendata.rdw.nl/resource/3huj-srit.json","https://opendata.rdw.nl/resource/8ys7-d773.json","https://opendata.rdw.nl/resource/vezc-m2t6.json","https://opendata.rdw.nl/resource/jhie-znh9.json","https://opendata.rdw.nl/resource/kmfi-hrps.json"
"G221SR","Personenauto","LEXUS","LEXUS ES300H","20251128","20191128","2597","sedan","5","GRIJS","Niet geregistreerd","4","2487","1655","2150","1755",,,"20191128","20191128","Geen verstrekking in Open Data","52845","Ja","180",,,,,,"4","4","0","0",,"498","187","M1",,,,"2150","XZ1L(EU,M)",,"e6*2007/46*0250*02","AXZH10(E)","AXZH10L-AEXGBW(1C)","0","0.07","287","Nee","Nee",,"Nee","2150","0","0.00","2024","Logisch","00","Ja","2025-11-28T00:00:00.000","2019-11-28T00:00:00.000","2019-11-28T00:00:00.000","2019-11-28T00:00:00.000",,,,,,,,,,,"145",,,,,,,,,,,,,,,,,"https://opendata.rdw.nl/resource/3huj-srit.json","https://opendata.rdw.nl/resource/8ys7-d773.json","https://opendata.rdw.nl/resource/vezc-m2t6.json","https://opendata.rdw.nl/resource/jhie-znh9.json","https://opendata.rdw.nl/resource/kmfi-hrps.json"
"G241DR","Personenauto","LEXUS","LEXUS ES300H","20250613","20190907","2990","sedan","5","GRIJS","Niet geregistreerd","4","2487","1655","2150","1755",,,"20190907","20190907","Geen verstrekking in Open Data","59445","Ja","180",,,,,,"4","4","0","0",,"498","187","M1",,,,"2150","XZ1L(EU,M)",,"e6*2007/46*0250*00","AXZH10(E)","AXZH10L-AEXGBW(1A)","0","0.07","287","Nee","Nee",,"Nee","2150","0","0.00","2024","Logisch","00","Ja","2025-06-13T00:00:00.000","2019-09-07T00:00:00.000","2019-09-07T00:00:00.000","2019-09-07T00:00:00.000",,,,,,,,,,,"145",,,,,,,,,,,,,,,,,"https://opendata.rdw.nl/resource/3huj-srit.json","https://opendata.rdw.nl/resource/8ys7-d773.json","https://opendata.rdw.nl/resource/vezc-m2t6.json","https://opendata.rdw.nl/resource/jhie-znh9.json","https://opendata.rdw.nl/resource/kmfi-hrps.json"
"G241HR","Personenauto","LEXUS","LEXUS ES300H","20251025","20231031","2990","sedan","5","GRIJS","Niet geregistreerd","4","2487","1655","2150","1755",,,"20190927","20190927","Geen verstrekking in Open Data","58295","Ja","180",,,,,,"4","4","0","0",,"498","187","M1",,,,"2150","XZ1L(EU,M)",,"e6*2007/46*0250*00","AXZH10(E)","AXZH10L-AEXGBW(1A)","0","0.07","287","Nee","Nee",,"Nee","2150","0","0.00","2024","Logisch","00","Ja","2025-10-25T00:00:00.000","2023-10-31T00:00:00.000","2019-09-27T00:00:00.000","2019-09-27T00:00:00.000",,,,,,,,,,,"145",,,,,,,,,,,,,,,,,"https://opendata.rdw.nl/resource/3huj-srit.json","https://opendata.rdw.nl/resource/8ys7-d773.json","https://opendata.rdw.nl/resource/vezc-m2t6.json","https://opendata.rdw.nl/resource/jhie-znh9.json","https://opendata.rdw.nl/resource/kmfi-hrps.json"
"G242GD","Personenauto","LEXUS","LEXUS ES300H","20250921","20190921","2990","sedan","5","GRIJS","Niet geregistreerd","4","2487","1655","2150","1755",,,"20190921","20190921","Geen verstrekking in Open Data","59690","Ja","180",,,,,,"4","4","0","0",,"498","187","M1",,,,"2150","XZ1L(EU,M)",,"e6*2007/46*0250*01","AXZH10(E)","AXZH10L-AEXGBW(1B)","0","0.07","287","Nee","Nee",,"Nee","2150","0","0.00","2023","Logisch","00","Ja","2025-09-21T00:00:00.000","2019-09-21T00:00:00.000","2019-09-21T00:00:00.000","2019-09-21T00:00:00.000",,,,,,,,,,,"145",,,,,,,,,,,,,,,,,"https://opendata.rdw.nl/resource/3huj-srit.json","https://opendata.rdw.nl/resource/8ys7-d773.json","https://opendata.rdw.nl/resource/vezc-m2t6.json","https://opendata.rdw.nl/resource/jhie-znh9.json","https://opendata.rdw.nl/resource/kmfi-hrps.json"
"G255VX","Personenauto","LEXUS","LEXUS ES300H","20260102","20210706","3383","sedan","5","WIT","Niet geregistreerd","4","2487","1655","2150","1755",,,"20200102","20200102","Geen verstrekking in Open Data","61545","Ja","180",,,,,,"4","4","0","0",,"498","187","M1",,,,"2150","XZ1L(EU,M)",,"e6*2007/46*0250*00","AXZH10(E)","AXZH10L-AEXGBW(1A)","0","0.07","287","Nee","Nee",,"Nee","2150","0","0.00","2023","Logisch","00","Ja","2026-01-02T00:00:00.000","2021-07-06T00:00:00.000","2020-01-02T00:00:00.000","2020-01-02T00:00:00.000",,,,,,,,,,,"145",,,,,,,,,,"A",,,,,,,"https://opendata.rdw.nl/resource/3huj-srit.json","https://opendata.rdw.nl/resource/8ys7-d773.json","https://opendata.rdw.nl/resource/vezc-m2t6.json","https://opendata.rdw.nl/resource/jhie-znh9.json","https://opendata.rdw.nl/resource/kmfi-hrps.json"
"G307LL","Personenauto","LEXUS","LEXUS ES300H","20251029","20191029","2990","sedan","5","ZWART","Niet geregistreerd","4","2487","1655","2150","1755",,,"20191029","20191029","Geen verstrekking in Open Data","66250","Ja","180",,,,,,"4","4","0","0",,"498","187","M1",,,,"2150","XZ1L(EU,M)",,"e6*2007/46*0250*02","AXZH10(E)","AXZH10L-AEXGBW(2C)","0","0.07","287","Nee","Nee",,"Nee","2150","0","0.00","2024","Logisch","00","Ja","2025-10-29T00:00:00.000","2019-10-29T00:00:00.000","2019-10-29T00:00:00.000","2019-10-29T00:00:00.000",,,,,,,,,,,"145",,,,,,,,,,,,,,,,,"https://opendata.rdw.nl/resource/3huj-srit.json","https://opendata.rdw.nl/resource/8ys7-d773.json","https://opendata.rdw.nl/resource/vezc-m2t6.json","https://opendata.rdw.nl/resource/jhie-znh9.json","https://opendata.rdw.nl/resource/kmfi-hrps.json"
"G405DL","Personenauto","LEXUS","LEXUS ES300H","20250512","20220528","2597","sedan","5","BLAUW","Niet geregistreerd","4","2487","1655","2150","1755",,,"20190904","20190904","Geen verstrekking in Open Data","52845","Ja","180",,,,,,"4","4","0","0",,"498","187","M1",,,,"2150","XZ1L(EU,M)",,"e6*2007/46*0250*00","AXZH10(E)","AXZH10L-AEXGBW(1A)","0","0.07","287","Nee","Nee",,"Nee","2150","0","0.00","2023","Logisch","00","Ja","2025-05-12T00:00:00.000","2022-05-28T00:00:00.000","2019-09-04T00:00:00.000","2019-09-04T00:00:00.000",,,,,,,,,,,"145",,,,,,,,,,,,,,,,,"https://opendata.rdw.nl/resource/3huj-srit.json","https://opendata.rdw.nl/resource/8ys7-d773.json","https://opendata.rdw.nl/resource/vezc-m2t6.json","https://opendata.rdw.nl/resource/jhie-znh9.json","https://opendata.rdw.nl/resource/kmfi-hrps.json"
"G418GZ","Personenauto","LEXUS","LEXUS ES300H","20251204","20191001","2597","sedan","5","ZWART","Niet geregistreerd","4","2487","1655","2150","1755",,,"20191001","20191001","Geen verstrekking in Open Data","51550","Ja","180",,,,,,"4","4","0","0",,"498","187","M1",,,,"2150","XZ1L(EU,M)",,"e6*2007/46*0250*02","AXZH10(E)","AXZH10L-AEXGBW(1C)","0","0.07","287","Nee","Nee",,"Nee","2150","0","0.00","2024","Logisch","00","Ja","2025-12-04T00:00:00.000","2019-10-01T00:00:00.000","2019-10-01T00:00:00.000","2019-10-01T00:00:00.000",,,,,,,,,,,"145",,,,,,,,,,,,,,,,,"https://opendata.rdw.nl/resource/3huj-srit.json","https://opendata.rdw.nl/resource/8ys7-d773.json","https://opendata.rdw.nl/resource/vezc-m2t6.json","https://opendata.rdw.nl/resource/jhie-znh9.json","https://opendata.rdw.nl/resource/kmfi-hrps.json"
"G426SX","Personenauto","LEXUS","LEXUS ES300H","20251128","20231013","2990","sedan","5","ZWART","Niet geregistreerd","4","2487","1655","2150","1755",,,"20191128","20191128","Geen verstrekking in Open Data","67545","Ja","180",,,,,,"4","4","0","0",,"498","187","M1",,,,"2150","XZ1L(EU,M)",,"e6*2007/46*0250*01","AXZH10(E)","AXZH10L-AEXGBW(1B)","0","0.07","287","Nee","Nee",,"Nee","2150","0","0.00","2023","Logisch","00","Ja","2025-11-28T00:00:00.000","2023-10-13T00:00:00.000","2019-11-28T00:00:00.000","2019-11-28T00:00:00.000",,,,,,,,,,,"145",,,,,,,,,,,,,,,,,"https://opendata.rdw.nl/resource/3huj-srit.json","https://opendata.rdw.nl/resource/8ys7-d773.json","https://opendata.rdw.nl/resource/vezc-m2t6.json","https://opendata.rdw.nl/resource/jhie-znh9.json","https://opendata.rdw.nl/resource/kmfi-hrps.json"
"G435SB","Personenauto","LEXUS","LEXUS ES300H","20251128","20240517","2990","sedan","5","GROEN","Niet geregistreerd","4","2487","1655","2150","1755",,,"20191128","20191128","Geen verstrekking in Open Data","58295","Ja","180",,,,,,"4","4","0","0",,"498","187","M1",,,,"2150","XZ1L(EU,M)",,"e6*2007/46*0250*02","AXZH10(E)","AXZH10L-AEXGBW(1C)","0","0.07","287","Nee","Nee",,"Nee","2150","0","0.00","2024","Logisch","00","Ja","2025-11-28T00:00:00.000","2024-05-17T00:00:00.000","2019-11-28T00:00:00.000","2019-11-28T00:00:00.000",,,,,,,,,,,"145",,,,,,,,,,,,,,,,,"https://opendata.rdw.nl/resource/3huj-srit.json","https://opendata.rdw.nl/resource/8ys7-d773.json","https://opendata.rdw.nl/resource/vezc-m2t6.json","https://opendata.rdw.nl/resource/jhie-znh9.json","https://opendata.rdw.nl/resource/kmfi-hrps.json"
"G464GK","Personenauto","LEXUS","LEXUS ES300H","20241219","20200514","2419","sedan","5","ROOD","Niet geregistreerd","4","2487","1655","2150","1755",,,"20181219","20200514","Geen verstrekking in Open Data","64450","Ja","180",,,,,,"4","4","0","0",,"498","187","M1",,,,"2150","XZ1L(EU,M)",,"e6*2007/46*0250*00","AXZH10(E)","AXZH10L-AEXGBW(1A)","0","0.03","287","Nee","Nee",,"Nee","2150","0","0.00","2024","Geen oordeel","05","Ja","2024-12-19T00:00:00.000","2020-05-14T00:00:00.000","2018-12-19T00:00:00.000","2020-05-14T00:00:00.000",,,,,,,,,,,"145",,,,,,,,,,,,,,,,,"https://opendata.rdw.nl/resource/3huj-srit.json","https://opendata.rdw.nl/resource/8ys7-d773.json","https://opendata.rdw.nl/resource/vezc-m2t6.json","https://opendata.rdw.nl/resource/jhie-znh9.json","https://opendata.rdw.nl/resource/kmfi-hrps.json"
"G508RL","Personenauto","LEXUS","LEXUS ES300H","20250612","20230613","2597","sedan","5","GRIJS","Niet geregistreerd","4","2487","1655","2150","1755",,,"20191116","20191116","Geen verstrekking in Open Data","52845","Ja","180",,,,,,"4","4","0","0",,"498","187","M1",,,,"2150","XZ1L(EU,M)",,"e6*2007/46*0250*00","AXZH10(E)","AXZH10L-AEXGBW(1A)","0","0.07","287","Nee","Nee",,"Nee","2150","0","0.00","2024","Logisch","00","Ja","2025-06-12T00:00:00.000","2023-06-13T00:00:00.000","2019-11-16T00:00:00.000","2019-11-16T00:00:00.000",,,,,,,,,,,"145",,,,,,,,,,,,,,,,,"https://opendata.rdw.nl/resource/3huj-srit.json","https://opendata.rdw.nl/resource/8ys7-d773.json","https://opendata.rdw.nl/resource/vezc-m2t6.json","https://opendata.rdw.nl/resource/jhie-znh9.json","https://opendata.rdw.nl/resource/kmfi-hrps.json"
"G509RL","Personenauto","LEXUS","LEXUS ES300H","20250619","20230620","2990","sedan","5","BLAUW","Niet geregistreerd","4","2487","1655","2150","1755",,,"20200102","20200102","Geen verstrekking in Open Data","67545","Ja","180",,,,,,"4","4","0","0",,"498","187","M1",,,,"2150","XZ1L(EU,M)",,"e6*2007/46*0250*01","AXZH10(E)","AXZH10L-AEXGBW(1B)","0","0.07","287","Nee","Nee",,"Nee","2150","0","0.00","2024","Logisch","00","Ja","2025-06-19T00:00:00.000","2023-06-20T00:00:00.000","2020-01-02T00:00:00.000","2020-01-02T00:00:00.000",,,,,,,,,,,"145",,,,,,,,,,"A",,,,,,,"https://opendata.rdw.nl/resource/3huj-srit.json","https://opendata.rdw.nl/resource/8ys7-d773.json","https://opendata.rdw.nl/resource/vezc-m2t6.json","https://opendata.rdw.nl/resource/jhie-znh9.json","https://opendata.rdw.nl/resource/kmfi-hrps.json"
"G524FX","Personenauto","LEXUS","LEXUS ES300H","20250918","20240115","2990","sedan","5","GRIJS","Niet geregistreerd","4","2487","1655","2150","1755",,,"20190918","20190918","Geen verstrekking in Open Data","67545","Ja","180",,,,,,"4","4","0","0",,"498","187","M1",,,,"2150","XZ1L(EU,M)",,"e6*2007/46*0250*01","AXZH10(E)","AXZH10L-AEXGBW(1B)","0","0.07","287","Nee","Nee",,"Nee","2150","0","0.00","2024","Logisch","00","Ja","2025-09-18T00:00:00.000","2024-01-15T00:00:00.000","2019-09-18T00:00:00.000","2019-09-18T00:00:00.000",,,,,,,,,,,"145",,,,,,,,,,,,,,,,,"https://opendata.rdw.nl/resource/3huj-srit.json","https://opendata.rdw.nl/resource/8ys7-d773.json","https://opendata.rdw.nl/resource/vezc-m2t6.json","https://opendata.rdw.nl/resource/jhie-znh9.json","https://opendata.rdw.nl/resource/kmfi-hrps.json"