"kenteken","voertuigsoort","merk","handelsbenaming","vervaldatum_apk","datum_tenaamstelling","bruto_bpm","inrichting","aantal_zitplaatsen","eerste_kleur","tweede_kleur","aantal_cilinders","cilinderinhoud","massa_ledig_voertuig","toegestane_maximum_massa_voertuig","massa_rijklaar","maximum_massa_trekken_ongeremd","maximum_trekken_massa_geremd","datum_eerste_toelating","datum_eerste_tenaamstelling_in_nederland","wacht_op_keuren","catalogusprijs","wam_verzekerd","maximale_constructiesnelheid","laadvermogen","oplegger_geremd","aanhangwagen_autonoom_geremd","aanhangwagen_middenas_geremd","aantal_staanplaatsen","aantal_deuren","aantal_wielen","afstand_hart_koppeling_tot_achterzijde_voertuig","afstand_voorzijde_voertuig_tot_hart_koppeling","afwijkende_maximum_snelheid","lengte","breedte","europese_voertuigcategorie","europese_voertuigcategorie_toevoeging","europese_uitvoeringcategorie_toevoeging","plaats_chassisnummer","technische_max_massa_voertuig","type","type_gasinstallatie","typegoedkeuringsnummer","variant","uitvoering","volgnummer_wijziging_eu_typegoedkeuring","vermogen_massarijklaar","wielbasis","export_indicator","openstaande_terugroepactie_indicator","vervaldatum_tachograaf","taxi_indicator","maximum_massa_samenstelling","aantal_rolstoelplaatsen","maximum_ondersteunende_snelheid","jaar_laatste_registratie_tellerstand","tellerstandoordeel","code_toelichting_tellerstandoordeel","tenaamstellen_mogelijk","vervaldatum_apk_dt","datum_tenaamstelling_dt","datum_eerste_toelating_dt","datum_eerste_tenaamstelling_in_nederland_dt","vervaldatum_tachograaf_dt","maximum_last_onder_de_vooras_sen_tezamen_koppeling","type_remsysteem_voertuig_code","rupsonderstelconfiguratiecode","wielbasis_voertuig_minimum","wielbasis_voertuig_maximum","lengte_voertuig_minimum","lengte_voertuig_maximum","breedte_voertuig_minimum","breedte_voertuig_maximum","hoogte_voertuig","hoogte_voertuig_minimum","hoogte_voertuig_maximum","massa_bedrijfsklaar_minimaal","massa_bedrijfsklaar_maximaal","technisch_toelaatbaar_massa_koppelpunt","maximum_massa_technisch_maximaal","maximum_massa_technisch_minimaal","subcategorie_nederland","verticale_belasting_koppelpunt_getrokken_voertuig","zuinigheidsclassificatie","registratie_datum_goedkeuring_afschrijvingsmoment_bpm","registratie_datum_goedkeuring_afschrijvingsmoment_bpm_dt","gem_lading_wrde","aerodyn_voorz","massa_alt_aandr","verl_cab_ind","api_gekentekende_voertuigen_assen","api_gekentekende_voertuigen_brandstof","api_gekentekende_voertuigen_carrosserie","api_gekentekende_voertuigen_carrosserie_specifiek","api_gekentekende_voertuigen_voertuigklasse"
"06ZHP7","Personenauto","BYD","BYD E6","20221206","20130409",,"hatchback","5","BLAUW","Niet geregistreerd","0",,"2355","2830","2455",,,"20121114","20121114","Geen verstrekking in Open Data","41869","Nee",,,,,,,"4","4",,,,,,"M1",,,"r. balk v. voorzitting","2830","E6",,,,,,"0.03","283","Nee","Nee",,"Nee",,,,"2021","Logisch","00","Ja","2022-12-06T00:00:00.000","2013-04-09T00:00:00.000","2012-11-14T00:00:00.000","2012-11-14T00:00:00.000",,"0",,,,,,,,,,,,,,,,,,,,,,,,,,"https://opendata.rdw.nl/resource/3huj-srit.json","https://opendata.rdw.nl/resource/8ys7-d773.json","https://opendata.rdw.nl/resource/vezc-m2t6.json","https://opendata.rdw.nl/resource/jhie-znh9.json","https://opendata.rdw.nl/resource/kmfi-hrps.json"
"5KGP91","Personenauto","BYD","BYD E6","20240417","20231220",,"hatchback","5","BLAUW","Niet geregistreerd",,,"2355","2830","2455",,,"20130410","20130410","Geen verstrekking in Open Data","22523","Ja",,,,,,,"4","4","0","0",,"456","0","M1",,,"r. by voorzitting","2830","E6Y",,"e4*KS07/46*0014*01","20002L11","20060500010","0","0.02","283","Nee","Nee",,"Nee","0","0","0.00","2023","Logisch","00","Ja","2024-04-17T00:00:00.000","2023-12-20T00:00:00.000","2013-04-10T00:00:00.000","2013-04-10T00:00:00.000",,,,,,,,,,,,,,,,,,,,,,,,,,,,"https://opendata.rdw.nl/resource/3huj-srit.json","https://opendata.rdw.nl/resource/8ys7-d773.json","https://opendata.rdw.nl/resource/vezc-m2t6.json","https://opendata.rdw.nl/resource/jhie-znh9.json","https://opendata.rdw.nl/resource/kmfi-hrps.json"
"7ZRS83","Personenauto","BYD","BYD E6","20250403","20201013",,"hatchback","5","GRIJS","Niet geregistreerd",,,"2355","2830","2455",,,"20150306","20150306","Geen verstrekking in Open Data","54450","Ja",,,,,,,"4","4","0","0",,"456","0","M1",,,"r. by voorzitting","2830","E6Y",,"e4*KS07/46*0014*02","20002L11","20060500010","0","0.02","283","Nee","Nee",,"Nee","0","0","0.00","2024","Logisch","00","Ja","2025-04-03T00:00:00.000","2020-10-13T00:00:00.000","2015-03-06T00:00:00.000","2015-03-06T00:00:00.000",,,,,,,,,,,,,,,,,,,,,,,,,,,,"https://opendata.rdw.nl/resource/3huj-srit.json","https://opendata.rdw.nl/resource/8ys7-d773.json","https://opendata.rdw.nl/resource/vezc-m2t6.json","https://opendata.rdw.nl/resource/jhie-znh9.json","https://opendata.rdw.nl/resource/kmfi-hrps.json"
"SK345G","Personenauto","BYD","BYD E6H","20241005","20220119",,"hatchback","5","WIT","Niet geregistreerd",,,"2395","2870","2495",,,"20180416","20180416","Geen verstrekking in Open Data","59895","Ja",,,,,,,"5","4","0","0",,"456","0","M1",,,,"2870","E6H",,"e4*KS07/46*0025*00","4E2F00","00250000","0","0.00","283","Nee","Nee",,"Nee","0","0","0.00","2022","Logisch","00","Ja","2024-10-05T00:00:00.000","2022-01-19T00:00:00.000","2018-04-16T00:00:00.000","2018-04-16T00:00:00.000",,,,,,,,,,,,,,,,,,,,,,,,,,,,"https://opendata.rdw.nl/resource/3huj-srit.json","https://opendata.rdw.nl/resource/8ys7-d773.json","https://opendata.rdw.nl/resource/vezc-m2t6.json","https://opendata.rdw.nl/resource/jhie-znh9.json","https://opendata.rdw.nl/resource/kmfi-hrps.json"
"SK346G","Personenauto","BYD","BYD E6H","20240911","20240422",,"hatchback","5","WIT","Niet geregistreerd",,,"2395","2870","2495",,,"20180416","20180416","Geen verstrekking in Open Data","59895","Ja",,,,,,,"5","4","0","0",,"456","182","M1",,,,"2870","E6H",,"e4*KS07/46*0025*00","4E2F00","00250000","0","0.00","283","Nee","Nee",,"Nee","0","0","0.00","2022","Logisch","00","Ja","2024-09-11T00:00:00.000","2024-04-22T00:00:00.000","2018-04-16T00:00:00.000","2018-04-16T00:00:00.000",,,,,,,,,,,"163",,,,,,,,,,,,,,,,,"https://opendata.rdw.nl/resource/3huj-srit.json","https://opendata.rdw.nl/resource/8ys7-d773.json","https://opendata.rdw.nl/resource/vezc-m2t6.json","https://opendata.rdw.nl/resource/jhie-znh9.json","https://opendata.rdw.nl/resource/kmfi-hrps.json"
"SK347G","Personenauto","BYD","BYD E6H","20240911","20221202",,"hatchback","5","WIT","Niet geregistreerd",,,"2395","2870","2495",,,"20180416","20180416","Geen verstrekking in Open Data","59895","Ja",,,,,,,"5","4","0","0",,"456","182","M1",,,,"2870","E6H",,"e4*KS07/46*0025*00","4E2F00","00250000","0","0.00","283","Nee","Nee",,"Nee","0","0","0.00","2022","Onlogisch","04","Ja","2024-09-11T00:00:00.000","2022-12-02T00:00:00.000","2018-04-16T00:00:00.000","2018-04-16T00:00:00.000",,,,,,,,,,,"163",,,,,,,,,,,,,,,,,"https://opendata.rdw.nl/resource/3huj-srit.json","https://opendata.rdw.nl/resource/8ys7-d773.json","https://opendata.rdw.nl/resource/vezc-m2t6.json","https://opendata.rdw.nl/resource/jhie-znh9.json","https://opendata.rdw.nl/resource/kmfi-hrps.json"
"SK348G","Personenauto","BYD","BYD E6H","20240930","20220217",,"hatchback","5","WIT","Niet geregistreerd",,,"2395","2870","2495",,,"20180416","20180416","Geen verstrekking in Open Data","46247","Ja",,,,,,,"5","4","0","0",,"456","182","M1",,,,"2870","E6H",,"e4*KS07/46*0025*00","4E2F00","00250000","0","0.00","283","Nee","Nee",,"Nee","0","0","0.00","2023","Logisch","00","Ja","2024-09-30T00:00:00.000","2022-02-17T00:00:00.000","2018-04-16T00:00:00.000","2018-04-16T00:00:00.000",,,,,,,,,,,"163",,,,,,,,,,,,,,,,,"https://opendata.rdw.nl/resource/3huj-srit.json","https://opendata.rdw.nl/resource/8ys7-d773.json","https://opendata.rdw.nl/resource/vezc-m2t6.json","https://opendata.rdw.nl/resource/jhie-znh9.json","https://opendata.rdw.nl/resource/kmfi-hrps.json"
"SK349G","Personenauto","BYD","BYD E6H","20240903","20220114",,"hatchback","5","WIT","Niet geregistreerd",,,"2395","2870","2495",,,"20180416","20180416","Geen verstrekking in Open Data","59895","Ja",,,,,,,"5","4","0","0",,"456","182","M1",,,,"2870","E6H",,"e4*KS07/46*0025*00","4E2F00","00250000","0","0.00","283","Nee","Nee",,"Nee","0","0","0.00","2023","Logisch","00","Ja","2024-09-03T00:00:00.000","2022-01-14T00:00:00.000","2018-04-16T00:00:00.000","2018-04-16T00:00:00.000",,,,,,,,,,,"163",,,,,,,,,,,,,,,,,"https://opendata.rdw.nl/resource/3huj-srit.json","https://opendata.rdw.nl/resource/8ys7-d773.json","https://opendata.rdw.nl/resource/vezc-m2t6.json","https://opendata.rdw.nl/resource/jhie-znh9.json","https://opendata.rdw.nl/resource/kmfi-hrps.json"
"SK350G","Personenauto","BYD","BYD E6H","20260416","20211224",,"hatchback","5","WIT","Niet geregistreerd",,,"2395","2870","2495",,,"20180416","20180416","Geen verstrekking in Open Data","59895","Ja",,,,,,,"5","4","0","0",,"456","182","M1",,,,"2870","E6H",,"e4*KS07/46*0025*00","4E2F00","00250000","0","0.00","283","Nee","Nee",,"Nee","0","0","0.00","2024","Logisch","00","Ja","2026-04-16T00:00:00.000","2021-12-24T00:00:00.000","2018-04-16T00:00:00.000","2018-04-16T00:00:00.000",,,,,,,,,,,"163",,,,,,,,,,,,,,,,,"https://opendata.rdw.nl/resource/3huj-srit.json","https://opendata.rdw.nl/resource/8ys7-d773.json","https://opendata.rdw.nl/resource/vezc-m2t6.json","https://opendata.rdw.nl/resource/jhie-znh9.json","https://opendata.rdw.nl/resource/kmfi-hrps.json"
"SK351G","Personenauto","BYD","BYD E6H","20240907","20220221",,"hatchback","5","WIT","Niet geregistreerd",,,"2395","2870","2495",,,"20180416","20180416","Geen verstrekking in Open Data","59895","Ja",,,,,,,"5","4","0","0",,"456","182","M1",,,,"2870","E6H",,"e4*KS07/46*0025*00","4E2F00","00250000","0","0.00","283","Nee","Nee",,"Nee","0","0","0.00","2022","Logisch","00","Ja","2024-09-07T00:00:00.000","2022-02-21T00:00:00.000","2018-04-16T00:00:00.000","2018-04-16T00:00:00.000",,,,,,,,,,,"163",,,,,,,,,,,,,,,,,"https://opendata.rdw.nl/resource/3huj-srit.json","https://opendata.rdw.nl/resource/8ys7-d773.json","https://opendata.rdw.nl/resource/vezc-m2t6.json","https://opendata.rdw.nl/resource/jhie-znh9.json","https://opendata.rdw.nl/resource/kmfi-hrps.json"
"SK352G","Personenauto","BYD","BYD E6H","20240906","20211218",,"hatchback","5","WIT","Niet geregistreerd",,,"2395","2870","2495",,,"20180416","20180416","Geen verstrekking in Open Data","59895","Ja",,,,,,,"5","4","0","0",,"456","182","M1",,,,"2870","E6H",,"e4*KS07/46*0025*00","4E2F00","00250000","0","0.00","283","Nee","Nee",,"Nee","0","0","0.00","2024","Logisch","00","Ja","2024-09-06T00:00:00.000","2021-12-18T00:00:00.000","2018-04-16T00:00:00.000","2018-04-16T00:00:00.000",,,,,,,,,,,"163",,,,,,,,,,,,,,,,,"https://opendata.rdw.nl/resource/3huj-srit.json","https://opendata.rdw.nl/resource/8ys7-d773.json","https://opendata.rdw.nl/resource/vezc-m2t6.json","https://opendata.rdw.nl/resource/jhie-znh9.json","https://opendata.rdw.nl/resource/kmfi-hrps.json"
"SK353G","Personenauto","BYD","BYD E6H","20240416","20211228",,"hatchback","5","WIT","Niet geregistreerd",,,"2395","2870","2495",,,"20180416","20180416","Geen verstrekking in Open Data","59895","Nee",,,,,,,"5","4","0","0",,"456","182","M1",,,,"2870","E6H",,"e4*KS07/46*0025*00","4E2F00","00250000","0","0.00","283","Nee","Nee",,"Nee","0","0","0.00","2022","Logisch","00","Ja","2024-04-16T00:00:00.000","2021-12-28T00:00:00.000","2018-04-16T00:00:00.000","2018-04-16T00:00:00.000",,,,,,,,,,,"163",,,,,,,,,,,,,,,,,"https://opendata.rdw.nl/resource/3huj-srit.json","https://opendata.rdw.nl/resource/8ys7-d773.json","https://opendata.rdw.nl/resource/vezc-m2t6.json","https://opendata.rdw.nl/resource/jhie-znh9.json","https://opendata.rdw.nl/resource/kmfi-hrps.json"
