"kenteken","voertuigsoort","merk","handelsbenaming","vervaldatum_apk","datum_tenaamstelling","bruto_bpm","inrichting","aantal_zitplaatsen","eerste_kleur","tweede_kleur","aantal_cilinders","cilinderinhoud","massa_ledig_voertuig","toegestane_maximum_massa_voertuig","massa_rijklaar","maximum_massa_trekken_ongeremd","maximum_trekken_massa_geremd","datum_eerste_toelating","datum_eerste_tenaamstelling_in_nederland","wacht_op_keuren","catalogusprijs","wam_verzekerd","maximale_constructiesnelheid","laadvermogen","oplegger_geremd","aanhangwagen_autonoom_geremd","aanhangwagen_middenas_geremd","aantal_staanplaatsen","aantal_deuren","aantal_wielen","afstand_hart_koppeling_tot_achterzijde_voertuig","afstand_voorzijde_voertuig_tot_hart_koppeling","afwijkende_maximum_snelheid","lengte","breedte","europese_voertuigcategorie","europese_voertuigcategorie_toevoeging","europese_uitvoeringcategorie_toevoeging","plaats_chassisnummer","technische_max_massa_voertuig","type","type_gasinstallatie","typegoedkeuringsnummer","variant","uitvoering","volgnummer_wijziging_eu_typegoedkeuring","vermogen_massarijklaar","wielbasis","export_indicator","openstaande_terugroepactie_indicator","vervaldatum_tachograaf","taxi_indicator","maximum_massa_samenstelling","aantal_rolstoelplaatsen","maximum_ondersteunende_snelheid","jaar_laatste_registratie_tellerstand","tellerstandoordeel","code_toelichting_tellerstandoordeel","tenaamstellen_mogelijk","vervaldatum_apk_dt","datum_tenaamstelling_dt","datum_eerste_toelating_dt","datum_eerste_tenaamstelling_in_nederland_dt","vervaldatum_tachograaf_dt","maximum_last_onder_de_vooras_sen_tezamen_koppeling","type_remsysteem_voertuig_code","rupsonderstelconfiguratiecode","wielbasis_voertuig_minimum","wielbasis_voertuig_maximum","lengte_voertuig_minimum","lengte_voertuig_maximum","breedte_voertuig_minimum","breedte_voertuig_maximum","hoogte_voertuig","hoogte_voertuig_minimum","hoogte_voertuig_maximum","massa_bedrijfsklaar_minimaal","massa_bedrijfsklaar_maximaal","technisch_toelaatbaar_massa_koppelpunt","maximum_massa_technisch_maximaal","maximum_massa_technisch_minimaal","subcategorie_nederland","verticale_belasting_koppelpunt_getrokken_voertuig","zuinigheidsclassificatie","registratie_datum_goedkeuring_afschrijvingsmoment_bpm","registratie_datum_goedkeuring_afschrijvingsmoment_bpm_dt","gem_lading_wrde","aerodyn_voorz","massa_alt_aandr","verl_cab_ind","api_gekentekende_voertuigen_assen","api_gekentekende_voertuigen_brandstof","api_gekentekende_voertuigen_carrosserie","api_gekentekende_voertuigen_carrosserie_specifiek","api_gekentekende_voertuigen_voertuigklasse"
"00GFN4","Personenauto","RENAULT","LAGUNA","20231230",,"8330","stationwagen","5","ZWART","Niet geregistreerd","4","1997","1365","1940","1465","650","1300","20080610","20080610","Geen verstrekking in Open Data",,"Nee",,,,,,,"4","4","0","0",,"480","0","M1",,,"r. tegen schutbord onder motorkap","1940","T",,"e2*2001/116*0363*07","KT1F","KT1F06","0","0.07","276","Ja","Nee",,"Nee","3240","0",,"2023","Logisch","00","Nee","2023-12-30T00:00:00.000",,"2008-06-10T00:00:00.000","2008-06-10T00:00:00.000",,,,,,,,,,,,,,,,,,,,,"C",,,,,,,"https://opendata.rdw.nl/resource/3huj-srit.json","https://opendata.rdw.nl/resource/8ys7-d773.json","https://opendata.rdw.nl/resource/vezc-m2t6.json","https://opendata.rdw.nl/resource/jhie-znh9.json","https://opendata.rdw.nl/resource/kmfi-hrps.json"
"00GJF2","Personenauto","RENAULT","LAGUNA","20230723","20230421","7442","hatchback","5","ZWART","Niet geregistreerd","4","1997","1344","1919","1444","650","1300","20080630","20080630","Geen verstrekking in Open Data",,"Ja",,,,,,,"4","4","0","0",,"470","0","M1",,,"r. tegen schutbord onder motorkap","1919","T",,"e2*2001/116*0363*07","BT1F","BT1F06","0","0.07","276","Ja","Nee",,"Nee","3219","0",,"2024","Logisch","00","Nee","2023-07-23T00:00:00.000","2023-04-21T00:00:00.000","2008-06-30T00:00:00.000","2008-06-30T00:00:00.000",,,,,,,,,,,,,,,,,,,,,"C",,,,,,,"https://opendata.rdw.nl/resource/3huj-srit.json","https://opendata.rdw.nl/resource/8ys7-d773.json","https://opendata.rdw.nl/resource/vezc-m2t6.json","https://opendata.rdw.nl/resource/jhie-znh9.json","https://opendata.rdw.nl/resource/kmfi-hrps.json"
"00GSP4","Personenauto","RENAULT","LAGUNA","20230325",,"8656","stationwagen","5","GRIJS","Niet geregistreerd","4","1998","1463","2038","1563","650","1300","20080829","20080829","Geen verstrekking in Open Data",,"Nee",,,,,,,"4","4","0","0",,"480","0","M1",,,"r. tegen schutbord onder motorkap","2038","T",,"e2*2001/116*0363*08","KT1H","KT1H0E","0","0.08","276","Ja","Nee",,"Nee","3338","0",,"2022","Logisch","00","Nee","2023-03-25T00:00:00.000",,"2008-08-29T00:00:00.000","2008-08-29T00:00:00.000",,,,,,,,,,,,,,,,,,,,,"D",,,,,,,"https://opendata.rdw.nl/resource/3huj-srit.json","https://opendata.rdw.nl/resource/8ys7-d773.json","https://opendata.rdw.nl/resource/vezc-m2t6.json","https://opendata.rdw.nl/resource/jhie-znh9.json","https://opendata.rdw.nl/resource/kmfi-hrps.json"
"00JHV2","Personenauto","RENAULT","LAGUNA",,,"7868","stationwagen","5","GRIJS","Niet geregistreerd","4","1995","1476","2051","1576","650","1500","20090606","20090606","Geen verstrekking in Open Data",,"Nee",,,,,,,"4","4","0","0",,"480","0","M1",,,"r. tegen schutbord onder motorkap","2051","T",,"e2*2001/116*0363*09","KT2A","KT2A06","0","0.06","276","Ja","Nee",,"Nee","3551","0","0.00","2023","Logisch","00","Nee",,,"2009-06-06T00:00:00.000","2009-06-06T00:00:00.000",,,,,,,,,,,,,,,,,,,,,"C",,,,,,,"https://opendata.rdw.nl/resource/3huj-srit.json","https://opendata.rdw.nl/resource/8ys7-d773.json","https://opendata.rdw.nl/resource/vezc-m2t6.json","https://opendata.rdw.nl/resource/jhie-znh9.json","https://opendata.rdw.nl/resource/kmfi-hrps.json"
"00JZP6","Personenauto","RENAULT","LAGUNA","20231115",,"10831","coupe","4","ZWART","Niet geregistreerd","4","1998","1403","1923","1503","650","1500","20090930","20090930","Geen verstrekking in Open Data",,"Nee",,,,,,,"2","4","0","0",,"464","0","M1",,,"r. tegen schutbord onder motorkap","1923","T",,"e2*2001/116*0363*09","DTBG","DTBG06","0","0.10","269","Ja","Nee",,"Nee","3423","0",,"2023","Logisch","00","Nee","2023-11-15T00:00:00.000",,"2009-09-30T00:00:00.000","2009-09-30T00:00:00.000",,,,,,,,,,,,,,,,,,,,,"C",,,,,,,"https://opendata.rdw.nl/resource/3huj-srit.json","https://opendata.rdw.nl/resource/8ys7-d773.json","https://opendata.rdw.nl/resource/vezc-m2t6.json","https://opendata.rdw.nl/resource/jhie-znh9.json","https://opendata.rdw.nl/resource/kmfi-hrps.json"
"00KVT1","Personenauto","RENAULT","LAGUNA","20230220",,"10890","stationwagen","5","ZWART","Niet geregistreerd","4","1998","1463","2038","1563","650","1300","20100305","20100305","Geen verstrekking in Open Data","37110","Nee",,,,,,,"4","4","0","0",,"480","0","M1",,,"r. tegen schutbord onder motorkap","2038","T",,"e2*2001/116*0363*15","KT1H","KT1H0E","0","0.08","276","Ja","Nee",,"Nee","3338","0",,"2022","Logisch","00","Nee","2023-02-20T00:00:00.000",,"2010-03-05T00:00:00.000","2010-03-05T00:00:00.000",,,,,,,,,,,,,,,,,,,,,"E",,,,,,,"https://opendata.rdw.nl/resource/3huj-srit.json","https://opendata.rdw.nl/resource/8ys7-d773.json","https://opendata.rdw.nl/resource/vezc-m2t6.json","https://opendata.rdw.nl/resource/jhie-znh9.json","https://opendata.rdw.nl/resource/kmfi-hrps.json"
"00PLB3","Personenauto","RENAULT","LAGUNA","20230425",,"12271","stationwagen","5","GRIJS","Niet geregistreerd","4","1998","1386","2038","1486","650","1300","20110215","20110215","Geen verstrekking in Open Data","41060","Nee",,,,,,,"4","4","0","0",,"480","0","M1",,,"r. tegen schutbord onder motorkap","2038","T",,"e2*2001/116*0363*23","KTD5","KTD50E","0","0.08","276","Ja","Nee",,"Nee","3338","0","0.00","2022","Logisch","00","Nee","2023-04-25T00:00:00.000",,"2011-02-15T00:00:00.000","2011-02-15T00:00:00.000",,,,,,,,,,,,,,,,,,,,,"D",,,,,,,"https://opendata.rdw.nl/resource/3huj-srit.json","https://opendata.rdw.nl/resource/8ys7-d773.json","https://opendata.rdw.nl/resource/vezc-m2t6.json","https://opendata.rdw.nl/resource/jhie-znh9.json","https://opendata.rdw.nl/resource/kmfi-hrps.json"
"00RXS4","Personenauto","RENAULT","LAGUNA","20230720",,"5820","hatchback","5","BRUIN","Niet geregistreerd","4","1461","1285","1936","1385","650","1500","20110819","20110819","Geen verstrekking in Open Data","30580","Nee",,,,,,,"4","4","0","0",,"470","0","M1",,,"r. tegen schutbord onder motorkap","1936","T",,"e2*2001/116*0363*27","BTER","BTERG6","0","0.06","276","Ja","Nee",,"Nee","3436","0","0.00","2023","Logisch","00","Nee","2023-07-20T00:00:00.000",,"2011-08-19T00:00:00.000","2011-08-19T00:00:00.000",,,,,,,,,,,,,,,,,,,,,"A",,,,,,,"https://opendata.rdw.nl/resource/3huj-srit.json","https://opendata.rdw.nl/resource/8ys7-d773.json","https://opendata.rdw.nl/resource/vezc-m2t6.json","https://opendata.rdw.nl/resource/jhie-znh9.json","https://opendata.rdw.nl/resource/kmfi-hrps.json"
"00XJF4","Personenauto","RENAULT","LAGUNA","20221210",,"6176","stationwagen","5","GRIJS","Niet geregistreerd","4","1461","1295","1957","1395","650","1500","20120615","20120615","Geen verstrekking in Open Data","34965","Nee",,,,,,,"4","4","0","0",,"480","0","M1",,,"r. tegen schutbord onder motorkap","1957","T",,"e2*2001/116*0363*30","KTER","KTERG6","0","0.06","276","Ja","Nee",,"Nee","3457","0","0.00","2022","Logisch","00","Nee","2022-12-10T00:00:00.000",,"2012-06-15T00:00:00.000","2012-06-15T00:00:00.000",,,,,,,,,,,,,,,,,,,,,"A",,,,,,,"https://opendata.rdw.nl/resource/3huj-srit.json","https://opendata.rdw.nl/resource/8ys7-d773.json","https://opendata.rdw.nl/resource/vezc-m2t6.json","https://opendata.rdw.nl/resource/jhie-znh9.json","https://opendata.rdw.nl/resource/kmfi-hrps.json"
"01HVZ4","Personenauto","RENAULT","LAGUNA","20230525",,"6777","stationwagen","5","BLAUW","Niet geregistreerd","4","1997","1365","1940","1465","650","1300","20090325","20090325","Geen verstrekking in Open Data",,"Nee",,,,,,,"4","4","0","0",,"480","0","M1",,,"r. tegen schutbord onder motorkap","1940","T",,"e2*2001/116*0363*06","KT0F","KT0F06","0","0.07","276","Ja","Nee",,"Nee","3240","0",,"2022","Logisch","00","Nee","2023-05-25T00:00:00.000",,"2009-03-25T00:00:00.000","2009-03-25T00:00:00.000",,,,,,,,,,,,,,,,,,,,,"C",,,,,,,"https://opendata.rdw.nl/resource/3huj-srit.json","https://opendata.rdw.nl/resource/8ys7-d773.json","https://opendata.rdw.nl/resource/vezc-m2t6.json","https://opendata.rdw.nl/resource/jhie-znh9.json","https://opendata.rdw.nl/resource/kmfi-hrps.json"
"01JLXF","Personenauto","RENAULT","LAGUNA","20240920","20231018","5450","hatchback","5","GRIJS","Niet geregistreerd","4","1783","1290","1900","1390","650","1300","20020715","20020715","Geen verstrekking in Open Data",,"Nee",,,,,,,"4","4","0","0",,"458","0","M1",,,"r. tegen schutbord onder motorkap","1900",,,"e2*98/14*0206*10","BG0J","BG0J0A","0","0.06","274","Ja","Nee",,"Nee","2850","0",,"2023","Logisch","00","Nee","2024-09-20T00:00:00.000","2023-10-18T00:00:00.000","2002-07-15T00:00:00.000","2002-07-15T00:00:00.000",,,,,,,,,,,,,,,,,,,,,"C",,,,,,,"https://opendata.rdw.nl/resource/3huj-srit.json","https://opendata.rdw.nl/resource/8ys7-d773.json","https://opendata.rdw.nl/resource/vezc-m2t6.json","https://opendata.rdw.nl/resource/jhie-znh9.json","https://opendata.rdw.nl/resource/kmfi-hrps.json"
"01JXR3","Personenauto","RENAULT","LAGUNA","20250121","20240228","6511","hatchback","5","GRIJS","Niet geregistreerd","4","1997","1344","1919","1444","650","1300","20090924","20090924","Geen verstrekking in Open Data",,"Ja",,,,,,,"4","4","0","0",,"470","0","M1",,,"r. tegen schutbord onder motorkap","1919","T",,"e2*2001/116*0363*13","BT1F","BT1F06","0","0.07","276","Ja","Nee",,"Nee","3219","0",,"2024","Logisch","00","Nee","2025-01-21T00:00:00.000","2024-02-28T00:00:00.000","2009-09-24T00:00:00.000","2009-09-24T00:00:00.000",,,,,,,,,,,,,,,,,,,,,"C",,,,,,,"https://opendata.rdw.nl/resource/3huj-srit.json","https://opendata.rdw.nl/resource/8ys7-d773.json","https://opendata.rdw.nl/resource/vezc-m2t6.json","https://opendata.rdw.nl/resource/jhie-znh9.json","https://opendata.rdw.nl/resource/kmfi-hrps.json"
"01LGRJ","Personenauto","RENAULT","LAGUNA","20230526",,"5061","hatchback","5","GRIJS","Niet geregistreerd","4","1598","1245","1835","1345","650","1300","20020218","20030828","Geen verstrekking in Open Data",,"Nee",,,,,,,"4","4","0","0",,"458","0","M1",,,"r. op schutbord onder motorkap","1835",,,"e2*98/14*0206*06","BG0A","BG0A05","0","0.06","274","Ja","Nee",,"Nee","2800","0",,"2023","Geen oordeel","05","Nee","2023-05-26T00:00:00.000",,"2002-02-18T00:00:00.000","2003-08-28T00:00:00.000",,,,,,,,,,,,,,,,,,,,,"B",,,,,,,"https://opendata.rdw.nl/resource/3huj-srit.json","https://opendata.rdw.nl/resource/8ys7-d773.json","https://opendata.rdw.nl/resource/vezc-m2t6.json","https://opendata.rdw.nl/resource/jhie-znh9.json","https://opendata.rdw.nl/resource/kmfi-hrps.json"
"01LGV7","Personenauto","RENAULT","LAGUNA","20240420",,"6555","hatchback","5","GRIJS","Niet geregistreerd","4","1997","1344","1919","1444","650","1300","20100420","20100420","Geen verstrekking in Open Data","30360","Nee",,,,,,,"4","4","0","0",,"470","0","M1",,,"r. tegen schutbord onder motorkap","1919","T",,"e2*2001/116*0363*15","BT0F","BT0F06","0","0.07","276","Ja","Nee",,"Nee","3219","0",,"2023","Logisch","00","Nee","2024-04-20T00:00:00.000",,"2010-04-20T00:00:00.000","2010-04-20T00:00:00.000",,,,,,,,,,,,,,,,,,,,,"C",,,,,,,"https://opendata.rdw.nl/resource/3huj-srit.json","https://opendata.rdw.nl/resource/8ys7-d773.json","https://opendata.rdw.nl/resource/vezc-m2t6.json","https://opendata.rdw.nl/resource/jhie-znh9.json","https://opendata.rdw.nl/resource/kmfi-hrps.json"
"01NNK8","Personenauto","RENAULT","LAGUNA","20221206",,"7316","stationwagen","5","GRIJS","Niet geregistreerd","4","1461","1295","1957","1395","650","1500","20101015","20101015","Geen verstrekking in Open Data","31665","Nee",,,,,,,"4","4","0","0",,"480","0","M1",,,"r. tegen schutbord onder motorkap","1957","T",,"e2*2001/116*0363*21","KT1R","KT1R06","0","0.06","276","Ja","Nee",,"Nee","3457","0","0.00","2023","Logisch","00","Nee","2022-12-06T00:00:00.000",,"2010-10-15T00:00:00.000","2010-10-15T00:00:00.000",,,,,,,,,,,,,,,,,,,,,"A",,,,,,,"https://opendata.rdw.nl/resource/3huj-srit.json","https://opendata.rdw.nl/resource/8ys7-d773.json","https://opendata.rdw.nl/resource/vezc-m2t6.json","https://opendata.rdw.nl/resource/jhie-znh9.json","https://opendata.rdw.nl/resource/kmfi-hrps.json"
"01NZX9","Personenauto","RENAULT","LAGUNA","20250313","20240328","6698","stationwagen","5","GRIJS","Niet geregistreerd","4","1461","1295","1957","1395","650","1500","20110103","20110103","Geen verstrekking in Open Data","28365","Ja",,,,,,,"4","4","0","0",,"480","0","M1",,,"r. tegen schutbord onder motorkap","1957","T",,"e2*2001/116*0363*21","KT1R","KT1R06","0","0.06","276","Ja","Nee",,"Nee","3457","0","0.00","2024","Logisch","00","Nee","2025-03-13T00:00:00.000","2024-03-28T00:00:00.000","2011-01-03T00:00:00.000","2011-01-03T00:00:00.000",,,,,,,,,,,,,,,,,,,,,"A",,,,,,,"https://opendata.rdw.nl/resource/3huj-srit.json","https://opendata.rdw.nl/resource/8ys7-d773.json","https://opendata.rdw.nl/resource/vezc-m2t6.json","https://opendata.rdw.nl/resource/jhie-znh9.json","https://opendata.rdw.nl/resource/kmfi-hrps.json"
"01PDRG","Personenauto","RENAULT","LAGUNA","20231112",,"6438","stationwagen","5","GRIJS","Niet geregistreerd","4","1783","1325","1935","1425","650","1300","20040514","20040514","Geen verstrekking in Open Data",,"Nee",,,,,,,"4","4","0","0",,"470","0","M1",,,"r. tegen schutbord onder motorkap","1935",,,"e2*98/14*0206*23","KG0J","KG0J0A","0","0.06","274","Ja","Nee",,"Nee","2900","0",,"2023","Logisch","00","Nee","2023-11-12T00:00:00.000",,"2004-05-14T00:00:00.000","2004-05-14T00:00:00.000",,,,,,,,,,,,,,,,,,,,,"D",,,,,,,"https://opendata.rdw.nl/resource/3huj-srit.json","https://opendata.rdw.nl/resource/8ys7-d773.json","https://opendata.rdw.nl/resource/vezc-m2t6.json","https://opendata.rdw.nl/resource/jhie-znh9.json","https://opendata.rdw.nl/resource/kmfi-hrps.json"
"01XNJ1","Personenauto","RENAULT","LAGUNA","20230326",,"5808","hatchback","5","ZWART","Niet geregistreerd","4","1461","1285","1936","1385","650","1500","20120707","20120707","Geen verstrekking in Open Data","33675","Ja",,,,,,,"4","4","0","0",,"470","0","M1",,,"r. tegen schutbord onder motorkap","1936","T",,"e2*2001/116*0363*30","BT1R","BT1RG6","0","0.06","276","Ja","Nee",,"Nee","3436","0","0.00","2022","Logisch","00","Nee","2023-03-26T00:00:00.000",,"2012-07-07T00:00:00.000","2012-07-07T00:00:00.000",,,,,,,,,,,,,,,,,,,,,"A",,,,,,,"https://opendata.rdw.nl/resource/3huj-srit.json","https://opendata.rdw.nl/resource/8ys7-d773.json","https://opendata.rdw.nl/resource/vezc-m2t6.json","https://opendata.rdw.nl/resource/jhie-znh9.json","https://opendata.rdw.nl/resource/kmfi-hrps.json"
"01ZDDN","Personenauto","RENAULT","LAGUNA","20250307","20240308","8955","hatchback","5","ZWART","Niet geregistreerd","4","1998","1442","2017","1542","650","1300","20080306","20080306","Geen verstrekking in Open Data",,"Ja",,,,,,,"4","4","0","0",,"470","0","M1",,,"r. tegen schutbord onder motorkap","2017","T",,"e2*2001/116*0363*04","BT1H","BT1H0E","0","0.08","276","Ja","Nee",,"Nee","3317","0",,"2024","Logisch","00","Nee","2025-03-07T00:00:00.000","2024-03-08T00:00:00.000","2008-03-06T00:00:00.000","2008-03-06T00:00:00.000",,,,,,,,,,,,,,,,,,,,,"D",,,,,,,"https://opendata.rdw.nl/resource/3huj-srit.json","https://opendata.rdw.nl/resource/8ys7-d773.json","https://opendata.rdw.nl/resource/vezc-m2t6.json","https://opendata.rdw.nl/resource/jhie-znh9.json","https://opendata.rdw.nl/resource/kmfi-hrps.json"
"01ZRR9","Personenauto","RENAULT","LAGUNA","20240121",,"5357","stationwagen","5","ZWART","Niet geregistreerd","4","1461","1295","1957","1395","650","1500","20130114","20130114","Geen verstrekking in Open Data","33075","Nee",,,,,,,"4","4","0","0",,"480","0","M1",,,"r. tegen schutbord onder motorkap","1957","T",,"e2*2001/116*0363*34","KT1R","KT1RG6","0","0.06","276","Ja","Nee",,"Nee","3457","0","0.00","2023","Logisch","00","Nee","2024-01-21T00:00:00.000",,"2013-01-14T00:00:00.000","2013-01-14T00:00:00.000",,,,,,,,,,,,,,,,,,,,,"A",,,,,,,"https://opendata.rdw.nl/resource/3huj-srit.json","https://opendata.rdw.nl/resource/8ys7-d773.json","https://opendata.rdw.nl/resource/vezc-m2t6.json","https://opendata.rdw.nl/resource/jhie-znh9.json","https://opendata.rdw.nl/resource/kmfi-hrps.json"
"01ZRV6","Personenauto","RENAULT","LAGUNA","20230309",,"5357","stationwagen","5","ZWART","Niet geregistreerd","4","1461","1295","1957","1395","650","1500","20130118","20130118","Geen verstrekking in Open Data","34365","Nee",,,,,,,"4","4","0","0",,"480","0","M1",,,"r. tegen schutbord onder motorkap","1957","T",,"e2*2001/116*0363*34","KT1R","KT1RG6","0","0.06","276","Ja","Nee",,"Nee","3457","0","0.00","2022","Logisch","00","Nee","2023-03-09T00:00:00.000",,"2013-01-18T00:00:00.000","2013-01-18T00:00:00.000",,,,,,,,,,,,,,,,,,,,,"A",,,,,,,"https://opendata.rdw.nl/resource/3huj-srit.json","https://opendata.rdw.nl/resource/8ys7-d773.json","https://opendata.rdw.nl/resource/vezc-m2t6.json","https://opendata.rdw.nl/resource/jhie-znh9.json","https://opendata.rdw.nl/resource/kmfi-hrps.json"
"02GSRG","Personenauto","RENAULT","LAGUNA","20230803",,"4674","hatchback","5","GROEN","Niet geregistreerd","4","1598","1298","1835","1398","650","1300","20010306","20010306","Geen verstrekking in Open Data",,"Nee",,,,,,,"4","4","0","0",,"458","0","M1",,,"r. tegen schutbord onder motorkap","1835",,"G3 gasinstallatie","e2*98/14*0206*04","BG0A","BG0A05","1","0.06","274","Ja","Nee",,"Nee","2800","0",,"2022","Geen oordeel","07","Nee","2023-08-03T00:00:00.000",,"2001-03-06T00:00:00.000","2001-03-06T00:00:00.000",,"0",,,,,,,,,,,,,,,,,,,"B",,,,,,,"https://opendata.rdw.nl/resource/3huj-srit.json","https://opendata.rdw.nl/resource/8ys7-d773.json","https://opendata.rdw.nl/resource/vezc-m2t6.json","https://opendata.rdw.nl/resource/jhie-znh9.json","https://opendata.rdw.nl/resource/kmfi-hrps.json"
"02JLTV","Personenauto","RENAULT","LAGUNA",,,"5698","stationwagen","5","GRIJS","Niet geregistreerd","4","1783","1334","1900","1434","650","1300","20020614","20020614","Geen verstrekking in Open Data",,"Nee",,,,,,,"4","4","0","0",,"470","0","M1",,,"r. tegen schutbord onder motorkap","1900",,"G3 gasinstallatie","e2*98/14*0206*07","KG0M","KG0M05","0","0.06","274","Ja","Nee",,"Nee","2850","0",,"2019","Logisch","00","Nee",,,"2002-06-14T00:00:00.000","2002-06-14T00:00:00.000",,"0",,,,,,,,,,,,,,,,,,,"B",,,,,,,"https://opendata.rdw.nl/resource/3huj-srit.json","https://opendata.rdw.nl/resource/8ys7-d773.json","https://opendata.rdw.nl/resource/vezc-m2t6.json","https://opendata.rdw.nl/resource/jhie-znh9.json","https://opendata.rdw.nl/resource/kmfi-hrps.json"
"02LHP4","Personenauto","RENAULT","LAGUNA","20230527",,"7872","stationwagen","5","GRIJS","Niet geregistreerd","4","1461","1382","1957","1482","650","1500","20100512","20100512","Geen verstrekking in Open Data","34045","Nee",,,,,,,"4","4","0","0",,"480","0","M1",,,"r. tegen schutbord onder motorkap","1957","T",,"e2*2001/116*0363*17","KT1R","KT1R06","0","0.05","276","Ja","Nee",,"Nee","3457","0",,"2023","Logisch","00","Nee","2023-05-27T00:00:00.000",,"2010-05-12T00:00:00.000","2010-05-12T00:00:00.000",,,,,,,,,,,,,,,,,,,,,"B",,,,,,,"https://opendata.rdw.nl/resource/3huj-srit.json","https://opendata.rdw.nl/resource/8ys7-d773.json","https://opendata.rdw.nl/resource/vezc-m2t6.json","https://opendata.rdw.nl/resource/jhie-znh9.json","https://opendata.rdw.nl/resource/kmfi-hrps.json"
"02NNK8","Personenauto","RENAULT","LAGUNA","20231013",,"7316","stationwagen","5","GRIJS","Niet geregistreerd","4","1461","1295","1957","1395","650","1500","20101013","20101013","Geen verstrekking in Open Data","31665","Nee",,,,,,,"4","4","0","0",,"480","0","M1",,,"r. tegen schutbord onder motorkap","1957","T",,"e2*2001/116*0363*21","KT1R","KT1R06","0","0.06","276","Ja","Nee",,"Nee","3457","0","0.00","2022","Onlogisch","04","Nee","2023-10-13T00:00:00.000",,"2010-10-13T00:00:00.000","2010-10-13T00:00:00.000",,,,,,,,,,,,,,,,,,,,,"A",,,,,,,"https://opendata.rdw.nl/resource/3huj-srit.json","https://opendata.rdw.nl/resource/8ys7-d773.json","https://opendata.rdw.nl/resource/vezc-m2t6.json","https://opendata.rdw.nl/resource/jhie-znh9.json","https://opendata.rdw.nl/resource/kmfi-hrps.json"
"02PXBR","Personenauto","RENAULT","LAGUNA","20230902",,"5460","stationwagen","5","GRIJS","Niet geregistreerd","4","1598","1322","1870","1422","650","1300","20050114","20050114","Geen verstrekking in Open Data",,"Nee",,,,,,,"4","4","0","0",,"470","0","M1",,,"r. tegen schutbord onder motorkap","1870",,"G3 gasinstallatie","e2*98/14*0206*28","KG0L","KG0L05","0","0.06","274","Ja","Nee",,"Nee","2850","0",,"2023","Geen oordeel","07","Nee","2023-09-02T00:00:00.000",,"2005-01-14T00:00:00.000","2005-01-14T00:00:00.000",,"0",,,,,,,,,,,,,,,,,,,"C",,,,,,,"https://opendata.rdw.nl/resource/3huj-srit.json","https://opendata.rdw.nl/resource/8ys7-d773.json","https://opendata.rdw.nl/resource/vezc-m2t6.json","https://opendata.rdw.nl/resource/jhie-znh9.json","https://opendata.rdw.nl/resource/kmfi-hrps.json"
"02RBJR","Personenauto","RENAULT","LAGUNA","20230401",,"7243","stationwagen","5","ZWART","Niet geregistreerd","4","1998","1290","1900","1390","650","1300","20050128","20050128","Geen verstrekking in Open Data",,"Nee",,,,,,,"4","4","0","0",,"470","0","M1",,,"r. tegen schutbord onder motorkap","1900",,,"e2*98/14*0206*28","KG0K","KG0K05","0","0.07","274","Ja","Nee",,"Nee","2850","0",,"2023","Logisch","00","Nee","2023-04-01T00:00:00.000",,"2005-01-28T00:00:00.000","2005-01-28T00:00:00.000",,,,,,,,,,,,,,,,,,,,,"C",,,,,,,"https://opendata.rdw.nl/resource/3huj-srit.json","https://opendata.rdw.nl/resource/8ys7-d773.json","https://opendata.rdw.nl/resource/vezc-m2t6.json","https://opendata.rdw.nl/resource/jhie-znh9.json","https://opendata.rdw.nl/resource/kmfi-hrps.json"