"kenteken","voertuigsoort","merk","handelsbenaming","vervaldatum_apk","datum_tenaamstelling","bruto_bpm","inrichting","aantal_zitplaatsen","eerste_kleur","tweede_kleur","aantal_cilinders","cilinderinhoud","massa_ledig_voertuig","toegestane_maximum_massa_voertuig","massa_rijklaar","maximum_massa_trekken_ongeremd","maximum_trekken_massa_geremd","datum_eerste_toelating","datum_eerste_tenaamstelling_in_nederland","wacht_op_keuren","catalogusprijs","wam_verzekerd","maximale_constructiesnelheid","laadvermogen","oplegger_geremd","aanhangwagen_autonoom_geremd","aanhangwagen_middenas_geremd","aantal_staanplaatsen","aantal_deuren","aantal_wielen","afstand_hart_koppeling_tot_achterzijde_voertuig","afstand_voorzijde_voertuig_tot_hart_koppeling","afwijkende_maximum_snelheid","lengte","breedte","europese_voertuigcategorie","europese_voertuigcategorie_toevoeging","europese_uitvoeringcategorie_toevoeging","plaats_chassisnummer","technische_max_massa_voertuig","type","type_gasinstallatie","typegoedkeuringsnummer","variant","uitvoering","volgnummer_wijziging_eu_typegoedkeuring","vermogen_massarijklaar","wielbasis","export_indicator","openstaande_terugroepactie_indicator","vervaldatum_tachograaf","taxi_indicator","maximum_massa_samenstelling","aantal_rolstoelplaatsen","maximum_ondersteunende_snelheid","jaar_laatste_registratie_tellerstand","tellerstandoordeel","code_toelichting_tellerstandoordeel","tenaamstellen_mogelijk","vervaldatum_apk_dt","datum_tenaamstelling_dt","datum_eerste_toelating_dt","datum_eerste_tenaamstelling_in_nederland_dt","vervaldatum_tachograaf_dt","maximum_last_onder_de_vooras_sen_tezamen_koppeling","type_remsysteem_voertuig_code","rupsonderstelconfiguratiecode","wielbasis_voertuig_minimum","wielbasis_voertuig_maximum","lengte_voertuig_minimum","lengte_voertuig_maximum","breedte_voertuig_minimum","breedte_voertuig_maximum","hoogte_voertuig","hoogte_voertuig_minimum","hoogte_voertuig_maximum","massa_bedrijfsklaar_minimaal","massa_bedrijfsklaar_maximaal","technisch_toelaatbaar_massa_koppelpunt","maximum_massa_technisch_maximaal","maximum_massa_technisch_minimaal","subcategorie_nederland","verticale_belasting_koppelpunt_getrokken_voertuig","zuinigheidsclassificatie","registratie_datum_goedkeuring_afschrijvingsmoment_bpm","registratie_datum_goedkeuring_afschrijvingsmoment_bpm_dt","gem_lading_wrde","aerodyn_voorz","massa_alt_aandr","verl_cab_ind","api_gekentekende_voertuigen_assen","api_gekentekende_voertuigen_brandstof","api_gekentekende_voertuigen_carrosserie","api_gekentekende_voertuigen_carrosserie_specifiek","api_gekentekende_voertuigen_voertuigklasse"
"TN960F","Personenauto","TESLA","MODEL S","20240915","20230922",,"hatchback","5","ZWART","Niet geregistreerd",,,"2190","2694","2290",,,"20180915","20180915","Geen verstrekking in Open Data","121350","Ja",,,,,,,"5","4","0","0",,"498","196","M1",,,,"2694","002",,"e4*2007/46*0667*20","100D","B19B5N","1","0.03","296","Ja","Nee",,"Nee","0","0","0.00","2024","Logisch","00","Nee","2024-09-15T00:00:00.000","2023-09-22T00:00:00.000","2018-09-15T00:00:00.000","2018-09-15T00:00:00.000",,,,,,,,,,,"145",,,,,,,,,,,,,,,,,"https://opendata.rdw.nl/resource/3huj-srit.json","https://opendata.rdw.nl/resource/8ys7-d773.json","https://opendata.rdw.nl/resource/vezc-m2t6.json","https://opendata.rdw.nl/resource/jhie-znh9.json","https://opendata.rdw.nl/resource/kmfi-hrps.json"
"L381JH","Personenauto","MG","MG ZS EV",,"20240322",,"hatchback","5","WIT","Niet geregistreerd",,,"1507","1966","1607",,,"20210629","20210629","Geen verstrekking in Open Data","31990","Ja","140",,,,,,"5","4","0","0",,"431","181","M1",,,,"1966","ZS1",,"e4*2007/46*1417*02","1EAB1EI","PA5LKE","0","0.04","258","Ja","Nee",,"Nee","0","0","0.00","2024","Logisch","00","Nee",,"2024-03-22T00:00:00.000","2021-06-29T00:00:00.000","2021-06-29T00:00:00.000",,,,,,,,,,,"164",,,,,,,,,,,,,,,,,"https://opendata.rdw.nl/resource/3huj-srit.json","https://opendata.rdw.nl/resource/8ys7-d773.json","https://opendata.rdw.nl/resource/vezc-m2t6.json","https://opendata.rdw.nl/resource/jhie-znh9.json","https://opendata.rdw.nl/resource/kmfi-hrps.json"
"TV851P","Personenauto","HYUNDAI","IONIQ","20241110","20240617",,"hatchback","5","GRIJS","Niet geregistreerd",,,"1395","1880","1495",,,"20181101","20181101","Geen verstrekking in Open Data","33912","Ja",,,,,,,"5","4","0","0",,"447","182","M1",,,,"1880","AE",,"e4*2007/46*1157*01","B5E11","E11CZ1","0","0.02","270","Ja","Nee",,"Nee","0","0","0.00","2024","Logisch","00","Nee","2024-11-10T00:00:00.000","2024-06-17T00:00:00.000","2018-11-01T00:00:00.000","2018-11-01T00:00:00.000",,,,,,,,,,,"145",,,,,,,,,,,,,,,,,"https://opendata.rdw.nl/resource/3huj-srit.json","https://opendata.rdw.nl/resource/8ys7-d773.json","https://opendata.rdw.nl/resource/vezc-m2t6.json","https://opendata.rdw.nl/resource/jhie-znh9.json","https://opendata.rdw.nl/resource/kmfi-hrps.json"
"TP716F","Personenauto","TESLA","MODEL S","20260207",,,"hatchback","5","GRIJS","Niet geregistreerd",,,"2083","2600","2183",,,"20180928","20180928","Geen verstrekking in Open Data","97550","Nee",,,,,,,"5","4","0","0",,"498","196","M1",,,,"2600","002",,"e4*2007/46*0667*20","75D","B19B5N","1","0.04","296","Ja","Nee",,"Nee","0","0","0.00","2024","Logisch","00","Nee","2026-02-07T00:00:00.000",,"2018-09-28T00:00:00.000","2018-09-28T00:00:00.000",,,,,,,,,,,"145",,,,,,,,,,,,,,,,,"https://opendata.rdw.nl/resource/3huj-srit.json","https://opendata.rdw.nl/resource/8ys7-d773.json","https://opendata.rdw.nl/resource/vezc-m2t6.json","https://opendata.rdw.nl/resource/jhie-znh9.json","https://opendata.rdw.nl/resource/kmfi-hrps.json"
"PG271H","Personenauto","TESLA MOTORS","MODEL S",,,,"hatchback","5","ROOD","Niet geregistreerd",,,"2083","2600","2183",,,"20170623","20170623","Geen verstrekking in Open Data","89700","Nee",,,,,,,"5","4","0","0",,"498","196","M1",,,"op r. balk","2600","002",,"e4*2007/46*0667*12","60D","B19B5N","0","0.04","296","Ja","Ja",,"Nee","0","0","0.00","2023","Logisch","00","Nee",,,"2017-06-23T00:00:00.000","2017-06-23T00:00:00.000",,,,,,,,,,,"145",,,,,,,,,,,,,,,,,"https://opendata.rdw.nl/resource/3huj-srit.json","https://opendata.rdw.nl/resource/8ys7-d773.json","https://opendata.rdw.nl/resource/vezc-m2t6.json","https://opendata.rdw.nl/resource/jhie-znh9.json","https://opendata.rdw.nl/resource/kmfi-hrps.json"
"PG368R","Personenauto","TESLA MOTORS","MODEL S",,,,"hatchback","5","ZWART","Niet geregistreerd",,,"2083","2600","2183",,,"20170630","20170630","Geen verstrekking in Open Data","107800","Nee",,,,,,,"5","4","0","0",,"498","196","M1",,,"op r. balk","2600","002",,"e4*2007/46*0667*14","60D","B21B5N","0","0.04","296","Ja","Nee",,"Nee","0","0","0.00","2023","Logisch","00","Nee",,,"2017-06-30T00:00:00.000","2017-06-30T00:00:00.000",,,,,,,,,,,"145",,,,,,,,,,,,,,,,,"https://opendata.rdw.nl/resource/3huj-srit.json","https://opendata.rdw.nl/resource/8ys7-d773.json","https://opendata.rdw.nl/resource/vezc-m2t6.json","https://opendata.rdw.nl/resource/jhie-znh9.json","https://opendata.rdw.nl/resource/kmfi-hrps.json"
"7STV62","Personenauto","TESLA MOTORS","MODEL S","20231222",,,"hatchback","5","BLAUW","Niet geregistreerd",,,"2075","2590","2175",,,"20131207","20131207","Geen verstrekking in Open Data","120200","Ja",,,,,,,"5","4","0","0",,"497","0","M1",,,"r. motorruimte","2590","002",,"e4*2007/46*0667*00","85","P21P","0","0.03","296","Ja","Nee",,"Nee","0","0","0.00","2024","Logisch","00","Nee","2023-12-22T00:00:00.000",,"2013-12-07T00:00:00.000","2013-12-07T00:00:00.000",,,,,,,,,,,,,,,,,,,,,,,,,,,,"https://opendata.rdw.nl/resource/3huj-srit.json","https://opendata.rdw.nl/resource/8ys7-d773.json","https://opendata.rdw.nl/resource/vezc-m2t6.json","https://opendata.rdw.nl/resource/jhie-znh9.json","https://opendata.rdw.nl/resource/kmfi-hrps.json"
"J041HF","Personenauto","MG","MG ZS EV","20251218","20240116",,"hatchback","5","ROOD","Niet geregistreerd",,,"1507","1966","1607",,,"20200806","20200806","Geen verstrekking in Open Data","32640","Ja","140",,,,,,"5","4","0","0",,"431","181","M1",,,,"1966","ZS1",,"e4*2007/46*1417*01","1EAB1EI","PA5LKE","0","0.04","258","Ja","Nee",,"Nee","0","0","0.00","2024","Logisch","00","Nee","2025-12-18T00:00:00.000","2024-01-16T00:00:00.000","2020-08-06T00:00:00.000","2020-08-06T00:00:00.000",,,,,,,,,,,"164",,,,,,,,,,,,,,,,,"https://opendata.rdw.nl/resource/3huj-srit.json","https://opendata.rdw.nl/resource/8ys7-d773.json","https://opendata.rdw.nl/resource/vezc-m2t6.json","https://opendata.rdw.nl/resource/jhie-znh9.json","https://opendata.rdw.nl/resource/kmfi-hrps.json"
"H040DD","Personenauto","MG","MG ZS EV","20251229",,,"hatchback","5","BLAUW","Niet geregistreerd",,,"1507","1966","1607",,,"20191229","20191229","Geen verstrekking in Open Data","32640","Ja","140",,,,,,"5","4","0","0",,"431","181","M1",,,,"1966","ZS1",,"e4*2007/46*1417*00","1EAB1EI","PA5LKE","0","0.04","258","Ja","Nee",,"Nee","0","0","0.00","2024","Onlogisch","04","Nee","2025-12-29T00:00:00.000",,"2019-12-29T00:00:00.000","2019-12-29T00:00:00.000",,,,,,,,,,,"164",,,,,,,,,,,,,,,,,"https://opendata.rdw.nl/resource/3huj-srit.json","https://opendata.rdw.nl/resource/8ys7-d773.json","https://opendata.rdw.nl/resource/vezc-m2t6.json","https://opendata.rdw.nl/resource/jhie-znh9.json","https://opendata.rdw.nl/resource/kmfi-hrps.json"
"K776HZ","Personenauto","SEAT","MII",,,,"hatchback","4","ZWART","Niet geregistreerd",,,"1135","1530","1235",,,"20201223","20201223","Geen verstrekking in Open Data","23235","Nee","130",,,,,,"5","4","0","0",,"356","165","M1",,,,"1530","AA",,"e13*2007/46*1168*22","ABEBMA","FA1FA1CZ0020GAVR0N1ESE1B14O","0","0.05","242","Ja","Nee",,"Nee","0","0","0.00","2024","Logisch","00","Nee",,,"2020-12-23T00:00:00.000","2020-12-23T00:00:00.000",,,,,,,,,,,"148",,,,,,,,,,,,,,,,,"https://opendata.rdw.nl/resource/3huj-srit.json","https://opendata.rdw.nl/resource/8ys7-d773.json","https://opendata.rdw.nl/resource/vezc-m2t6.json","https://opendata.rdw.nl/resource/jhie-znh9.json","https://opendata.rdw.nl/resource/kmfi-hrps.json"
"R726GJ","Personenauto","RENAULT","ZOE",,,,"hatchback","5","WIT","Niet geregistreerd",,,"1477","1988","1577",,,"20220905","20220905","Geen verstrekking in Open Data","35720","Nee","140",,,,,,"5","4","0","0",,"409","173","M1",,,,"1988","AG",,"e2*2007/46*0251*23","0V0Y","MCLEA0800000","0","0.03","259","Ja","Nee",,"Nee","0","0","0.00","2024","Logisch","00","Nee",,,"2022-09-05T00:00:00.000","2022-09-05T00:00:00.000",,,,,,,,,,,"156",,,,,,,,,,,"20220822","2022-08-22T00:00:00.000",,,,,"https://opendata.rdw.nl/resource/3huj-srit.json","https://opendata.rdw.nl/resource/8ys7-d773.json","https://opendata.rdw.nl/resource/vezc-m2t6.json","https://opendata.rdw.nl/resource/jhie-znh9.json","https://opendata.rdw.nl/resource/kmfi-hrps.json"
"1KLD28","Personenauto","RENAULT","ZOE","20230527",,,"hatchback","5","WIT","Niet geregistreerd",,,"1403","1943","1503",,,"20130527","20130527","Geen verstrekking in Open Data","27792","Nee",,,,,,,"4","4","0","0",,"409","0","M1",,,"r. kofferruimte","1943","AG",,"e2*2007/46*0251*00","AGV","AGVYA0","0","0.03","259","Ja","Nee",,"Nee","0","0",,"2022","Logisch","00","Nee","2023-05-27T00:00:00.000",,"2013-05-27T00:00:00.000","2013-05-27T00:00:00.000",,,,,,,,,,,,,,,,,,,,,,,,,,,,"https://opendata.rdw.nl/resource/3huj-srit.json","https://opendata.rdw.nl/resource/8ys7-d773.json","https://opendata.rdw.nl/resource/vezc-m2t6.json","https://opendata.rdw.nl/resource/jhie-znh9.json","https://opendata.rdw.nl/resource/kmfi-hrps.json"
"1KLD38","Personenauto","RENAULT","ZOE","20240530","20240327",,"hatchback","5","BLAUW","Niet geregistreerd",,,"1403","1943","1503",,,"20130530","20130530","Geen verstrekking in Open Data","28287","Ja",,,,,,,"4","4","0","0",,"409","0","M1",,,"r. kofferruimte","1943","AG",,"e2*2007/46*0251*00","AGV","AGVYA0","0","0.03","259","Ja","Nee",,"Nee","0","0",,"2024","Logisch","00","Nee","2024-05-30T00:00:00.000","2024-03-27T00:00:00.000","2013-05-30T00:00:00.000","2013-05-30T00:00:00.000",,,,,,,,,,,,,,,,,,,,,,,,,,,,"https://opendata.rdw.nl/resource/3huj-srit.json","https://opendata.rdw.nl/resource/8ys7-d773.json","https://opendata.rdw.nl/resource/vezc-m2t6.json","https://opendata.rdw.nl/resource/jhie-znh9.json","https://opendata.rdw.nl/resource/kmfi-hrps.json"
"1KLD39","Personenauto","RENAULT","ZOE","20240315",,,"hatchback","5","ZWART","Niet geregistreerd",,,"1403","1943","1503",,,"20130531","20130531","Geen verstrekking in Open Data","28782","Nee",,,,,,,"4","4","0","0",,"409","0","M1",,,"r. kofferruimte","1943","AG",,"e2*2007/46*0251*00","AGV","AGVYA1","0","0.03","259","Ja","Nee",,"Nee","0","0",,"2023","Logisch","00","Nee","2024-03-15T00:00:00.000",,"2013-05-31T00:00:00.000","2013-05-31T00:00:00.000",,,,,,,,,,,,,,,,,,,,,,,,,,,,"https://opendata.rdw.nl/resource/3huj-srit.json","https://opendata.rdw.nl/resource/8ys7-d773.json","https://opendata.rdw.nl/resource/vezc-m2t6.json","https://opendata.rdw.nl/resource/jhie-znh9.json","https://opendata.rdw.nl/resource/kmfi-hrps.json"
"RH623T","Personenauto","HYUNDAI","IONIQ","20260110",,,"hatchback","5","WIT","Niet geregistreerd",,,"1395","1880","1495",,,"20180110","20180110","Geen verstrekking in Open Data","32045","Ja",,,,,,,"5","4","0","0",,"447","182","M1",,,"onder r. voorzitting","1880","AE",,"e4*2007/46*1157*01","B5E11","E11CZ1","0","0.02","270","Ja","Nee",,"Nee","0","0","0.00","2024","Logisch","00","Nee","2026-01-10T00:00:00.000",,"2018-01-10T00:00:00.000","2018-01-10T00:00:00.000",,,,,,,,,,,"145",,,,,,,,,,,,,,,,,"https://opendata.rdw.nl/resource/3huj-srit.json","https://opendata.rdw.nl/resource/8ys7-d773.json","https://opendata.rdw.nl/resource/vezc-m2t6.json","https://opendata.rdw.nl/resource/jhie-znh9.json","https://opendata.rdw.nl/resource/kmfi-hrps.json"
"TN754N","Personenauto","HYUNDAI","IONIQ","20240914",,,"hatchback","5","ZWART","Niet geregistreerd",,,"1395","1880","1495",,,"20180914","20180914","Geen verstrekking in Open Data","33912","Ja",,,,,,,"5","4","0","0",,"447","182","M1",,,,"1880","AE",,"e4*2007/46*1157*01","B5E11","E11CZ1","0","0.02","270","Ja","Nee",,"Nee","0","0","0.00","2024","Logisch","00","Nee","2024-09-14T00:00:00.000",,"2018-09-14T00:00:00.000","2018-09-14T00:00:00.000",,,,,,,,,,,"145",,,,,,,,,,,,,,,,,"https://opendata.rdw.nl/resource/3huj-srit.json","https://opendata.rdw.nl/resource/8ys7-d773.json","https://opendata.rdw.nl/resource/vezc-m2t6.json","https://opendata.rdw.nl/resource/jhie-znh9.json","https://opendata.rdw.nl/resource/kmfi-hrps.json"
"TS516R","Personenauto","TESLA","MODEL S","20241210",,,"hatchback","5","GRIJS","Niet geregistreerd",,,"2083","2600","2183",,,"20181210","20181210","Geen verstrekking in Open Data","98050","Nee",,,,,,,"5","4","0","0",,"498","196","M1",,,,"2600","002",,"e4*2007/46*0667*20","75D","B19B5N","1","0.04","296","Ja","Nee",,"Nee","0","0","0.00","2024","Logisch","00","Nee","2024-12-10T00:00:00.000",,"2018-12-10T00:00:00.000","2018-12-10T00:00:00.000",,,,,,,,,,,"145",,,,,,,,,,,,,,,,,"https://opendata.rdw.nl/resource/3huj-srit.json","https://opendata.rdw.nl/resource/8ys7-d773.json","https://opendata.rdw.nl/resource/vezc-m2t6.json","https://opendata.rdw.nl/resource/jhie-znh9.json","https://opendata.rdw.nl/resource/kmfi-hrps.json"
"TZ773T","Personenauto","TESLA","MODEL S","20241123",,,"hatchback","5","GRIJS","Niet geregistreerd",,,"2190","2694","2290",,,"20181123","20181123","Geen verstrekking in Open Data","126650","Ja",,,,,,,"5","4","0","0",,"498","196","M1",,,,"2694","002",,"e4*2007/46*0667*20","100D","B19B5N","1","0.03","296","Ja","Ja",,"Nee","0","0","0.00","2024","Logisch","00","Nee","2024-11-23T00:00:00.000",,"2018-11-23T00:00:00.000","2018-11-23T00:00:00.000",,,,,,,,,,,"145",,,,,,,,,,,,,,,,,"https://opendata.rdw.nl/resource/3huj-srit.json","https://opendata.rdw.nl/resource/8ys7-d773.json","https://opendata.rdw.nl/resource/vezc-m2t6.json","https://opendata.rdw.nl/resource/jhie-znh9.json","https://opendata.rdw.nl/resource/kmfi-hrps.json"
"1SBD11","Personenauto","RENAULT","ZOE","20231214",,,"hatchback","5","WIT","Niet geregistreerd",,,"1403","1943","1503",,,"20130830","20130830","Geen verstrekking in Open Data","26287","Nee",,,,,,,"4","4","0","0",,"409","0","M1",,,"r. kofferruimte","1943","AG",,"e2*2007/46*0251*00","AGV","AGVYA0","0","0.03","259","Ja","Nee",,"Nee","0","0",,"2023","Logisch","00","Nee","2023-12-14T00:00:00.000",,"2013-08-30T00:00:00.000","2013-08-30T00:00:00.000",,,,,,,,,,,,,,,,,,,,,,,,,,,,"https://opendata.rdw.nl/resource/3huj-srit.json","https://opendata.rdw.nl/resource/8ys7-d773.json","https://opendata.rdw.nl/resource/vezc-m2t6.json","https://opendata.rdw.nl/resource/jhie-znh9.json","https://opendata.rdw.nl/resource/kmfi-hrps.json"
"1SND15","Personenauto","TESLA MOTORS","MODEL S","20221203",,,"hatchback","5","GRIJS","Niet geregistreerd",,,"2075","2590","2175",,,"20131113","20131113","Geen verstrekking in Open Data","106250","Nee",,,,,,,"5","4","0","0",,"497","0","M1",,,"r. motorruimte","2590","002",,"e4*2007/46*0667*00","85","P19","0","0.03","296","Ja","Nee",,"Nee","0","0","0.00","2022","Logisch","00","Nee","2022-12-03T00:00:00.000",,"2013-11-13T00:00:00.000","2013-11-13T00:00:00.000",,,,,,,,,,,,,,,,,,,,,,,,,,,,"https://opendata.rdw.nl/resource/3huj-srit.json","https://opendata.rdw.nl/resource/8ys7-d773.json","https://opendata.rdw.nl/resource/vezc-m2t6.json","https://opendata.rdw.nl/resource/jhie-znh9.json","https://opendata.rdw.nl/resource/kmfi-hrps.json"
"1SPK76","Personenauto","RENAULT","ZOE","20230602",,,"hatchback","5","ZWART","Niet geregistreerd",,,"1403","1943","1503",,,"20131128","20131128","Geen verstrekking in Open Data","28287","Nee",,,,,,,"4","4","0","0",,"409","0","M1",,,"r. kofferruimte","1943","AG",,"e2*2007/46*0251*00","AGV","AGVYA0","0","0.03","259","Ja","Nee",,"Nee","0","0",,"2023","Logisch","00","Nee","2023-06-02T00:00:00.000",,"2013-11-28T00:00:00.000","2013-11-28T00:00:00.000",,,,,,,,,,,,,,,,,,,,,,,,,,,,"https://opendata.rdw.nl/resource/3huj-srit.json","https://opendata.rdw.nl/resource/8ys7-d773.json","https://opendata.rdw.nl/resource/vezc-m2t6.json","https://opendata.rdw.nl/resource/jhie-znh9.json","https://opendata.rdw.nl/resource/kmfi-hrps.json"
"1SPN84","Personenauto","RENAULT","ZOE","20231123",,,"hatchback","5","GRIJS","Niet geregistreerd",,,"1403","1943","1503",,,"20131123","20131123","Geen verstrekking in Open Data","28287","Nee",,,,,,,"4","4","0","0",,"409","0","M1",,,"r. kofferruimte","1943","AG",,"e2*2007/46*0251*00","AGV","AGVYA0","0","0.03","259","Ja","Nee",,"Nee","0","0",,"2023","Logisch","03","Nee","2023-11-23T00:00:00.000",,"2013-11-23T00:00:00.000","2013-11-23T00:00:00.000",,,,,,,,,,,,,,,,,,,,,,,,,,,,"https://opendata.rdw.nl/resource/3huj-srit.json","https://opendata.rdw.nl/resource/8ys7-d773.json","https://opendata.rdw.nl/resource/vezc-m2t6.json","https://opendata.rdw.nl/resource/jhie-znh9.json","https://opendata.rdw.nl/resource/kmfi-hrps.json"
"1SPS62","Personenauto","TESLA MOTORS","MODEL S","20231127",,,"hatchback","5","GRIJS","Niet geregistreerd",,,"2075","2590","2175",,,"20131126","20131126","Geen verstrekking in Open Data","90350","Nee",,,,,,,"5","4","0","0",,"497","0","M1",,,"r. motorruimte","2590","002",,"e4*2007/46*0667*00","85","B19","0","0.03","296","Ja","Nee",,"Nee","0","0","0.00","2022","Logisch","00","Nee","2023-11-27T00:00:00.000",,"2013-11-26T00:00:00.000","2013-11-26T00:00:00.000",,,,,,,,,,,,,,,,,,,,,,,,,,,,"https://opendata.rdw.nl/resource/3huj-srit.json","https://opendata.rdw.nl/resource/8ys7-d773.json","https://opendata.rdw.nl/resource/vezc-m2t6.json","https://opendata.rdw.nl/resource/jhie-znh9.json","https://opendata.rdw.nl/resource/kmfi-hrps.json"
"1SRB59","Personenauto","TESLA MOTORS","MODEL S","20240514","20240503",,"hatchback","5","BLAUW","Niet geregistreerd",,,"2075","2590","2175",,,"20131204","20131204","Geen verstrekking in Open Data","107850","Ja",,,,,,,"5","4","0","0",,"497","0","M1",,,"r. motorruimte","2590","002",,"e4*2007/46*0667*00","85","P19","0","0.03","296","Ja","Nee",,"Nee","0","0","0.00","2024","Logisch","00","Nee","2024-05-14T00:00:00.000","2024-05-03T00:00:00.000","2013-12-04T00:00:00.000","2013-12-04T00:00:00.000",,,,,,,,,,,,,,,,,,,,,,,,,,,,"https://opendata.rdw.nl/resource/3huj-srit.json","https://opendata.rdw.nl/resource/8ys7-d773.json","https://opendata.rdw.nl/resource/vezc-m2t6.json","https://opendata.rdw.nl/resource/jhie-znh9.json","https://opendata.rdw.nl/resource/kmfi-hrps.json"
"1SRJ37","Personenauto","TESLA MOTORS","MODEL S","20240404","20240403",,"hatchback","5","ZWART","Niet geregistreerd",,,"2075","2590","2175",,,"20131128","20131128","Geen verstrekking in Open Data","120200","Ja",,,,,,,"5","4","0","0",,"497","0","M1",,,"r. motorruimte","2590","002",,"e4*2007/46*0667*00","85","P21P","0","0.03","296","Ja","Nee",,"Nee","0","0","0.00","2024","Logisch","00","Nee","2024-04-04T00:00:00.000","2024-04-03T00:00:00.000","2013-11-28T00:00:00.000","2013-11-28T00:00:00.000",,,,,,,,,,,,,,,,,,,,,,,,,,,,"https://opendata.rdw.nl/resource/3huj-srit.json","https://opendata.rdw.nl/resource/8ys7-d773.json","https://opendata.rdw.nl/resource/vezc-m2t6.json","https://opendata.rdw.nl/resource/jhie-znh9.json","https://opendata.rdw.nl/resource/kmfi-hrps.json"
"1SRJ39","Personenauto","TESLA MOTORS","MODEL S","20231205",,,"hatchback","5","ZWART","Niet geregistreerd",,,"2075","2590","2175",,,"20131205","20131205","Geen verstrekking in Open Data","90850","Nee",,,,,,,"5","4","0","0",,"497","0","M1",,,"r. motorruimte","2590","002",,"e4*2007/46*0667*00","85","B19","0","0.03","296","Ja","Nee",,"Nee","0","0","0.00","2023","Logisch","00","Nee","2023-12-05T00:00:00.000",,"2013-12-05T00:00:00.000","2013-12-05T00:00:00.000",,,,,,,,,,,,,,,,,,,,,,,,,,,,"https://opendata.rdw.nl/resource/3huj-srit.json","https://opendata.rdw.nl/resource/8ys7-d773.json","https://opendata.rdw.nl/resource/vezc-m2t6.json","https://opendata.rdw.nl/resource/jhie-znh9.json","https://opendata.rdw.nl/resource/kmfi-hrps.json"
"1SRJ41","Personenauto","TESLA MOTORS","MODEL S","20231206",,,"hatchback","5","BRUIN","Niet geregistreerd",,,"2075","2590","2175",,,"20131206","20131206","Geen verstrekking in Open Data","118700","Nee",,,,,,,"5","4","0","0",,"497","0","M1",,,"r. motorruimte","2590","002",,"e4*2007/46*0667*00","85","P21P","0","0.03","296","Ja","Nee",,"Nee","0","0","0.00","2023","Logisch","00","Nee","2023-12-06T00:00:00.000",,"2013-12-06T00:00:00.000","2013-12-06T00:00:00.000",,,,,,,,,,,,,,,,,,,,,,,,,,,,"https://opendata.rdw.nl/resource/3huj-srit.json","https://opendata.rdw.nl/resource/8ys7-d773.json","https://opendata.rdw.nl/resource/vezc-m2t6.json","https://opendata.rdw.nl/resource/jhie-znh9.json","https://opendata.rdw.nl/resource/kmfi-hrps.json"
"1STZ53","Personenauto","RENAULT","ZOE","20241211","20240516",,"hatchback","5","GRIJS","Niet geregistreerd",,,"1403","1943","1503",,,"20131211","20131211","Geen verstrekking in Open Data","28782","Ja",,,,,,,"4","4","0","0",,"409","0","M1",,,"r. kofferruimte","1943","AG",,"e2*2007/46*0251*00","AGV","AGVYA1","0","0.03","259","Ja","Nee",,"Nee","0","0",,"2024","Logisch","00","Nee","2024-12-11T00:00:00.000","2024-05-16T00:00:00.000","2013-12-11T00:00:00.000","2013-12-11T00:00:00.000",,,,,,,,,,,,,,,,,,,,,,,,,,,,"https://opendata.rdw.nl/resource/3huj-srit.json","https://opendata.rdw.nl/resource/8ys7-d773.json","https://opendata.rdw.nl/resource/vezc-m2t6.json","https://opendata.rdw.nl/resource/jhie-znh9.json","https://opendata.rdw.nl/resource/kmfi-hrps.json"