"kenteken","voertuigsoort","merk","handelsbenaming","vervaldatum_apk","datum_tenaamstelling","bruto_bpm","inrichting","aantal_zitplaatsen","eerste_kleur","tweede_kleur","aantal_cilinders","cilinderinhoud","massa_ledig_voertuig","toegestane_maximum_massa_voertuig","massa_rijklaar","maximum_massa_trekken_ongeremd","maximum_trekken_massa_geremd","datum_eerste_toelating","datum_eerste_tenaamstelling_in_nederland","wacht_op_keuren","catalogusprijs","wam_verzekerd","maximale_constructiesnelheid","laadvermogen","oplegger_geremd","aanhangwagen_autonoom_geremd","aanhangwagen_middenas_geremd","aantal_staanplaatsen","aantal_deuren","aantal_wielen","afstand_hart_koppeling_tot_achterzijde_voertuig","afstand_voorzijde_voertuig_tot_hart_koppeling","afwijkende_maximum_snelheid","lengte","breedte","europese_voertuigcategorie","europese_voertuigcategorie_toevoeging","europese_uitvoeringcategorie_toevoeging","plaats_chassisnummer","technische_max_massa_voertuig","type","type_gasinstallatie","typegoedkeuringsnummer","variant","uitvoering","volgnummer_wijziging_eu_typegoedkeuring","vermogen_massarijklaar","wielbasis","export_indicator","openstaande_terugroepactie_indicator","vervaldatum_tachograaf","taxi_indicator","maximum_massa_samenstelling","aantal_rolstoelplaatsen","maximum_ondersteunende_snelheid","jaar_laatste_registratie_tellerstand","tellerstandoordeel","code_toelichting_tellerstandoordeel","tenaamstellen_mogelijk","vervaldatum_apk_dt","datum_tenaamstelling_dt","datum_eerste_toelating_dt","datum_eerste_tenaamstelling_in_nederland_dt","vervaldatum_tachograaf_dt","maximum_last_onder_de_vooras_sen_tezamen_koppeling","type_remsysteem_voertuig_code","rupsonderstelconfiguratiecode","wielbasis_voertuig_minimum","wielbasis_voertuig_maximum","lengte_voertuig_minimum","lengte_voertuig_maximum","breedte_voertuig_minimum","breedte_voertuig_maximum","hoogte_voertuig","hoogte_voertuig_minimum","hoogte_voertuig_maximum","massa_bedrijfsklaar_minimaal","massa_bedrijfsklaar_maximaal","technisch_toelaatbaar_massa_koppelpunt","maximum_massa_technisch_maximaal","maximum_massa_technisch_minimaal","subcategorie_nederland","verticale_belasting_koppelpunt_getrokken_voertuig","zuinigheidsclassificatie","registratie_datum_goedkeuring_afschrijvingsmoment_bpm","registratie_datum_goedkeuring_afschrijvingsmoment_bpm_dt","gem_lading_wrde","aerodyn_voorz","massa_alt_aandr","verl_cab_ind","api_gekentekende_voertuigen_assen","api_gekentekende_voertuigen_brandstof","api_gekentekende_voertuigen_carrosserie","api_gekentekende_voertuigen_carrosserie_specifiek","api_gekentekende_voertuigen_voertuigklasse"
"0056ZZ","Oplegger","DOLL","S4H-0",,"20170307",,"open laadvloer",,"N.v.t.","N.v.t.",,,"14700","57000",,,,"20161222","20170227","Geen verstrekking in Open Data",,"N.v.t.","80","42300",,,,,,,"1445",,,"1590","255","O4",,,"r. dwarsbalk v. hart koppeling","61000","S4H-0",,,,,,,"1311","Nee","Nee",,"Nee",,,,,"Niet geregistreerd","NG","Ja",,"2017-03-07T00:00:00.000","2016-12-22T00:00:00.000","2017-02-27T00:00:00.000",,"21000",,,,,,,,,,,,,,,,,,,,,,,,,,"https://opendata.rdw.nl/resource/3huj-srit.json","https://opendata.rdw.nl/resource/8ys7-d773.json","https://opendata.rdw.nl/resource/vezc-m2t6.json","https://opendata.rdw.nl/resource/jhie-znh9.json","https://opendata.rdw.nl/resource/kmfi-hrps.json"
"OS57JT","Oplegger","DOLL","DOLL","20250713","20200929",,"open laadvloer",,"N.v.t.","N.v.t.",,,"16600","50000",,,,"20130827","20200714","Geen verstrekking in Open Data",,"N.v.t.","100","33400",,,,,,"8",,,,,"255","O4",,,"r. balk","66000",,,,,,,,,"Nee","Nee",,"Nee",,,,,"Niet geregistreerd","NG","Ja","2025-07-13T00:00:00.000","2020-09-29T00:00:00.000","2013-08-27T00:00:00.000","2020-07-14T00:00:00.000",,"18000",,,,,,,,,,,,,,,,,,,,,,,,,,"https://opendata.rdw.nl/resource/3huj-srit.json","https://opendata.rdw.nl/resource/8ys7-d773.json","https://opendata.rdw.nl/resource/vezc-m2t6.json","https://opendata.rdw.nl/resource/jhie-znh9.json","https://opendata.rdw.nl/resource/kmfi-hrps.json"
"ON06PY","Oplegger","DOLL","S4L","20250515","20150213",,"open laadvloer",,"N.v.t.","N.v.t.",,,"12100","54000",,,,"20150122","20150212","Geen verstrekking in Open Data",,"N.v.t.","100","41900",,,,,,,,,,,"255","O4",,,"r. dwarsbalk a. hart koppeling","58000",,,,,,,,,"Nee","Nee",,"Nee",,,,,"Niet geregistreerd","NG","Ja","2025-05-15T00:00:00.000","2015-02-13T00:00:00.000","2015-01-22T00:00:00.000","2015-02-12T00:00:00.000",,"18000",,,,,,,,,,,,,,,,,,,,,,,,,,"https://opendata.rdw.nl/resource/3huj-srit.json","https://opendata.rdw.nl/resource/8ys7-d773.json","https://opendata.rdw.nl/resource/vezc-m2t6.json","https://opendata.rdw.nl/resource/jhie-znh9.json","https://opendata.rdw.nl/resource/kmfi-hrps.json"
"ON07PY","Oplegger","DOLL","S4L","20250223","20150213",,"open laadvloer",,"N.v.t.","N.v.t.",,,"12100","54000",,,,"20150122","20150212","Geen verstrekking in Open Data",,"N.v.t.","100","41900",,,,,,,,,,,"255","O4",,,"r. dwarsbalk v. hart koppeling","58000",,,,,,,,,"Nee","Nee",,"Nee",,,,,"Niet geregistreerd","NG","Ja","2025-02-23T00:00:00.000","2015-02-13T00:00:00.000","2015-01-22T00:00:00.000","2015-02-12T00:00:00.000",,"18000",,,,,,,,,,,,,,,,,,,,,,,,,,"https://opendata.rdw.nl/resource/3huj-srit.json","https://opendata.rdw.nl/resource/8ys7-d773.json","https://opendata.rdw.nl/resource/vezc-m2t6.json","https://opendata.rdw.nl/resource/jhie-znh9.json","https://opendata.rdw.nl/resource/kmfi-hrps.json"
"ON48NF","Oplegger","DOLL","S2H","20240930","20141203",,"open laadvloer",,"N.v.t.","N.v.t.",,,"9850","38000",,,,"20071126","20141203","Geen verstrekking in Open Data",,"N.v.t.","100","28150",,,,,,,,,,,"255","O4",,,"tegen r. balk 190 cm a. hart koppeling","38000","S2H",,,,,,,,"Nee","Nee",,"Nee",,,,,"Niet geregistreerd","NG","Ja","2024-09-30T00:00:00.000","2014-12-03T00:00:00.000","2007-11-26T00:00:00.000","2014-12-03T00:00:00.000",,"18000",,,,,,,,,,,,,,,,,,,,,,,,,,"https://opendata.rdw.nl/resource/3huj-srit.json","https://opendata.rdw.nl/resource/8ys7-d773.json","https://opendata.rdw.nl/resource/vezc-m2t6.json","https://opendata.rdw.nl/resource/jhie-znh9.json","https://opendata.rdw.nl/resource/kmfi-hrps.json"
"ON63PB","Oplegger","DOLL","P3H","20250105","20200218",,"open laadvloer",,"N.v.t.","N.v.t.",,,"9600","45000",,,,"20070102","20150121","Geen verstrekking in Open Data",,"N.v.t.","100","35400",,,,,,,,,,,"247","O4",,,"r. dwarsbalk v. hart koppeling","45000",,,,,,,,,"Nee","Nee",,"Nee",,,,,"Niet geregistreerd","NG","Ja","2025-01-05T00:00:00.000","2020-02-18T00:00:00.000","2007-01-02T00:00:00.000","2015-01-21T00:00:00.000",,"18000",,,,,,,,,,,,,,,,,,,,,,,,,,"https://opendata.rdw.nl/resource/3huj-srit.json","https://opendata.rdw.nl/resource/8ys7-d773.json","https://opendata.rdw.nl/resource/vezc-m2t6.json","https://opendata.rdw.nl/resource/jhie-znh9.json","https://opendata.rdw.nl/resource/kmfi-hrps.json"
"ON89HL","Oplegger","DOLL","DOLL DA PLATFORM","20250512","20220103",,"open laadvloer",,"N.v.t.","N.v.t.",,,"9400","45000",,,,"20140508","20140508","Geen verstrekking in Open Data",,"N.v.t.","100","35600",,,,,,,,,,,"247","O4",,,"r. v. dwarsbalk","45000","P3H",,,,,,,,"Nee","Nee",,"Nee",,,,,"Niet geregistreerd","NG","Ja","2025-05-12T00:00:00.000","2022-01-03T00:00:00.000","2014-05-08T00:00:00.000","2014-05-08T00:00:00.000",,"18000",,,,,,,,,,,,,,,,,,,,,,,,,,"https://opendata.rdw.nl/resource/3huj-srit.json","https://opendata.rdw.nl/resource/8ys7-d773.json","https://opendata.rdw.nl/resource/vezc-m2t6.json","https://opendata.rdw.nl/resource/jhie-znh9.json","https://opendata.rdw.nl/resource/kmfi-hrps.json"
"OP03HN","Oplegger","DOLL","DOLL S3H/D330","20240928","20160617",,"open laadvloer",,"N.v.t.","N.v.t.",,,"11840","42000",,,,"20020305","20160617","Geen verstrekking in Open Data",,"N.v.t.","100","30160",,,,,,,,,,,"255","O4",,,"r. dwarsbalk v.","42000",,,,,,,,,"Nee","Nee",,"Nee",,,,,"Niet geregistreerd","NG","Ja","2024-09-28T00:00:00.000","2016-06-17T00:00:00.000","2002-03-05T00:00:00.000","2016-06-17T00:00:00.000",,"18000",,,,,,,,,,,,,,,,,,,,,,,,,,"https://opendata.rdw.nl/resource/3huj-srit.json","https://opendata.rdw.nl/resource/8ys7-d773.json","https://opendata.rdw.nl/resource/vezc-m2t6.json","https://opendata.rdw.nl/resource/jhie-znh9.json","https://opendata.rdw.nl/resource/kmfi-hrps.json"
"OP39BD","Oplegger","DOLL","S4E","20241221","20151204",,"open laadvloer",,"N.v.t.","N.v.t.",,,"14200","61000",,,,"20151022","20151204","Geen verstrekking in Open Data",,"N.v.t.","80","46800",,,,,,"8",,,,,"255","O4",,,"r. dwarsbalk v. hart koppeling","73000",,,,,,,,,"Nee","Nee",,"Nee",,,,,"Niet geregistreerd","NG","Ja","2024-12-21T00:00:00.000","2015-12-04T00:00:00.000","2015-10-22T00:00:00.000","2015-12-04T00:00:00.000",,"25000",,,,,,,,,,,,,,,,,,,,,,,,,,"https://opendata.rdw.nl/resource/3huj-srit.json","https://opendata.rdw.nl/resource/8ys7-d773.json","https://opendata.rdw.nl/resource/vezc-m2t6.json","https://opendata.rdw.nl/resource/jhie-znh9.json","https://opendata.rdw.nl/resource/kmfi-hrps.json"
"OP49DK","Oplegger","DOLL",,"20030503","20160304",,"open laadvloer",,"N.v.t.","N.v.t.",,,"7960","39500",,,,"20020503","20160304","Geen verstrekking in Open Data",,"N.v.t.","100","31540",,,,,,,"1200",,,"1395","255","O4",,,"r. balk v. hart koppeling","39500",,,,,,,,"890","Nee","Nee",,"Nee",,,,,"Niet geregistreerd","NG","Ja","2003-05-03T00:00:00.000","2016-03-04T00:00:00.000","2002-05-03T00:00:00.000","2016-03-04T00:00:00.000",,"12500",,,,,,,,,,,,,,,,,,,,,,,,,,"https://opendata.rdw.nl/resource/3huj-srit.json","https://opendata.rdw.nl/resource/8ys7-d773.json","https://opendata.rdw.nl/resource/vezc-m2t6.json","https://opendata.rdw.nl/resource/jhie-znh9.json","https://opendata.rdw.nl/resource/kmfi-hrps.json"
"OP51XV","Oplegger","DOLL","P3H-T","20240818","20170822",,"open laadvloer",,"N.v.t.","N.v.t.",,,"13400","55000",,,,"20170814","20170821","Geen verstrekking in Open Data",,"N.v.t.","80","41600",,,,,,,,,,,"254","O4",,,"r. dwarsbalk v. hart koppeling","59800","P3H-T",,,,,,,,"Nee","Nee",,"Nee",,,,,"Niet geregistreerd","NG","Ja","2024-08-18T00:00:00.000","2017-08-22T00:00:00.000","2017-08-14T00:00:00.000","2017-08-21T00:00:00.000",,"25000",,,,,,,,,,,,,,,,,,,,,,,,,,"https://opendata.rdw.nl/resource/3huj-srit.json","https://opendata.rdw.nl/resource/8ys7-d773.json","https://opendata.rdw.nl/resource/vezc-m2t6.json","https://opendata.rdw.nl/resource/jhie-znh9.json","https://opendata.rdw.nl/resource/kmfi-hrps.json"
"OP72JL","Oplegger","DOLL","S3H","20250117","20170328",,"open laadvloer",,"N.v.t.","N.v.t.",,,"12800","45000",,,,"20070524","20170328","Geen verstrekking in Open Data",,"N.v.t.","80","32200",,,,,,,,,,,"255","O4",,,"r. balk a. hart koppeling","48000","S3H",,,,,,,,"Nee","Nee",,"Nee",,,,,"Niet geregistreerd","NG","Ja","2025-01-17T00:00:00.000","2017-03-28T00:00:00.000","2007-05-24T00:00:00.000","2017-03-28T00:00:00.000",,"18000",,,,,,,,,,,,,,,,,,,,,,,,,,"https://opendata.rdw.nl/resource/3huj-srit.json","https://opendata.rdw.nl/resource/8ys7-d773.json","https://opendata.rdw.nl/resource/vezc-m2t6.json","https://opendata.rdw.nl/resource/jhie-znh9.json","https://opendata.rdw.nl/resource/kmfi-hrps.json"
"OR50LV","Oplegger","DOLL","S4L-N","20240907","20180910",,"open laadvloer",,"N.v.t.","N.v.t.",,,"10850","50000",,,,"20180905","20180905","Geen verstrekking in Open Data",,"N.v.t.","100","39150",,,,,,,"1170",,,,"255","O4",,,,"50000",,,,,,,,,"Nee","Nee",,"Nee",,,,,"Niet geregistreerd","NG","Ja","2024-09-07T00:00:00.000","2018-09-10T00:00:00.000","2018-09-05T00:00:00.000","2018-09-05T00:00:00.000",,"18000",,,,,,,,,,,,,,,,,,,,,,,,,,"https://opendata.rdw.nl/resource/3huj-srit.json","https://opendata.rdw.nl/resource/8ys7-d773.json","https://opendata.rdw.nl/resource/vezc-m2t6.json","https://opendata.rdw.nl/resource/jhie-znh9.json","https://opendata.rdw.nl/resource/kmfi-hrps.json"
"OS23SF","Oplegger","DOLL","P3H","20250511","20210429",,"open laadvloer",,"N.v.t.","N.v.t.",,,"9420","45000",,,,"20130806","20210409","Geen verstrekking in Open Data",,"N.v.t.","100","35580",,,,,,"6",,,,,"255","O4",,,"r. v. dwarsbalk","45000","PH3",,,,,,,,"Nee","Nee",,"Nee",,,,,"Niet geregistreerd","NG","Ja","2025-05-11T00:00:00.000","2021-04-29T00:00:00.000","2013-08-06T00:00:00.000","2021-04-09T00:00:00.000",,"18000",,,"1030","1800","1360","2130",,,"380",,,,,,,,,,,,,,,,,"https://opendata.rdw.nl/resource/3huj-srit.json","https://opendata.rdw.nl/resource/8ys7-d773.json","https://opendata.rdw.nl/resource/vezc-m2t6.json","https://opendata.rdw.nl/resource/jhie-znh9.json","https://opendata.rdw.nl/resource/kmfi-hrps.json"
"OS24YT","Oplegger","DOLL","VARIO P2H","20241122","20211025",,"open laadvloer",,"N.v.t.","N.v.t.",,,"7500","38000",,,,"20120608","20211025","Geen verstrekking in Open Data",,"N.v.t.","100","30500",,,,,,"8",,,,,"255","O4",,,,"38000",,,,,,,,,"Nee","Nee",,"Nee",,,,,"Niet geregistreerd","NG","Ja","2024-11-22T00:00:00.000","2021-10-25T00:00:00.000","2012-06-08T00:00:00.000","2021-10-25T00:00:00.000",,"18000",,,"673","1083","940","1350",,,,,,,,,,,,,,"20211014","2021-10-14T00:00:00.000",,,,,"https://opendata.rdw.nl/resource/3huj-srit.json","https://opendata.rdw.nl/resource/8ys7-d773.json","https://opendata.rdw.nl/resource/vezc-m2t6.json","https://opendata.rdw.nl/resource/jhie-znh9.json","https://opendata.rdw.nl/resource/kmfi-hrps.json"
"OS30ZJ","Oplegger","DOLL","VARIO P2H","20241117","20211117",,"open laadvloer",,"N.v.t.","N.v.t.",,,"7900","38000",,,,"20100806","20211117","Geen verstrekking in Open Data",,"N.v.t.","100","30100",,,,,,"8",,,,,"255","O4",,,"r. dwarsbalk v. hart koppeling","41200",,,,,,,,,"Nee","Nee",,"Nee",,,,,"Niet geregistreerd","NG","Ja","2024-11-17T00:00:00.000","2021-11-17T00:00:00.000","2010-08-06T00:00:00.000","2021-11-17T00:00:00.000",,"18000",,,"673","1083","940","1350",,,,,,,,,,,,,,"20211104","2021-11-04T00:00:00.000",,,,,"https://opendata.rdw.nl/resource/3huj-srit.json","https://opendata.rdw.nl/resource/8ys7-d773.json","https://opendata.rdw.nl/resource/vezc-m2t6.json","https://opendata.rdw.nl/resource/jhie-znh9.json","https://opendata.rdw.nl/resource/kmfi-hrps.json"
"OS51KK","Oplegger","DOLL","T2E-A","20241031","20200827",,"open laadvloer",,"N.v.t.","N.v.t.",,,"14750","36000",,,,"20110927","20200827","Geen verstrekking in Open Data",,"N.v.t.","80","21250",,,,,,"4",,,,,"255","O4",,,,"42000","T2E-A",,,,,,,,"Nee","Nee",,"Nee",,,,,"Niet geregistreerd","NG","Ja","2024-10-31T00:00:00.000","2020-08-27T00:00:00.000","2011-09-27T00:00:00.000","2020-08-27T00:00:00.000",,"18000",,,"1065","1465","1295","1695",,,,,,,,,,,,,,,,,,,,"https://opendata.rdw.nl/resource/3huj-srit.json","https://opendata.rdw.nl/resource/8ys7-d773.json","https://opendata.rdw.nl/resource/vezc-m2t6.json","https://opendata.rdw.nl/resource/jhie-znh9.json","https://opendata.rdw.nl/resource/kmfi-hrps.json"
"OS54LX","Oplegger","DOLL","H3H-21","20250502","20201221",,"open laadvloer",,"N.v.t.","N.v.t.",,,"9440","48000",,,,"20201112","20201119","Geen verstrekking in Open Data",,"N.v.t.","100","38560",,,,,,"12",,,,,"255","O4",,,,"54000",,,,,,,,,"Nee","Nee",,"Nee",,,,,"Niet geregistreerd","NG","Ja","2025-05-02T00:00:00.000","2020-12-21T00:00:00.000","2020-11-12T00:00:00.000","2020-11-19T00:00:00.000",,"18000",,,"915","1365","1075","1525",,,,,,,,,,,,,,,,,,,,"https://opendata.rdw.nl/resource/3huj-srit.json","https://opendata.rdw.nl/resource/8ys7-d773.json","https://opendata.rdw.nl/resource/vezc-m2t6.json","https://opendata.rdw.nl/resource/jhie-znh9.json","https://opendata.rdw.nl/resource/kmfi-hrps.json"
"OS61ZL","Oplegger","DOLL","S2L-0","20241116","20211116",,"open laadvloer",,"N.v.t.","N.v.t.",,,"7300","38000",,,,"20070320","20211109","Geen verstrekking in Open Data",,"N.v.t.","100","30700",,,,,,"4","1100",,,"1250","255","O4",,,,"38000",,,,,,,,"960","Nee","Nee",,"Nee",,,,,"Niet geregistreerd","NG","Ja","2024-11-16T00:00:00.000","2021-11-16T00:00:00.000","2007-03-20T00:00:00.000","2021-11-09T00:00:00.000",,"18000",,,,,,,,,"200",,,,,,,,,,,"20211109","2021-11-09T00:00:00.000",,,,,"https://opendata.rdw.nl/resource/3huj-srit.json","https://opendata.rdw.nl/resource/8ys7-d773.json","https://opendata.rdw.nl/resource/vezc-m2t6.json","https://opendata.rdw.nl/resource/jhie-znh9.json","https://opendata.rdw.nl/resource/kmfi-hrps.json"
"OS62ZG","Oplegger","DOLL","VARIO P2H","20241121","20211110",,"open laadvloer",,"N.v.t.","N.v.t.",,,"7780","38000",,,,"20120606","20211110","Geen verstrekking in Open Data",,"N.v.t.","100","30220",,,,,,"8",,,,,"255","O4",,,,"41200","P2H",,,,,,,,"Nee","Nee",,"Nee",,,,,"Niet geregistreerd","NG","Ja","2024-11-21T00:00:00.000","2021-11-10T00:00:00.000","2012-06-06T00:00:00.000","2021-11-10T00:00:00.000",,"18000",,,"671","971","940","1240",,,,,,,,,,,,,,"20211101","2021-11-01T00:00:00.000",,,,,"https://opendata.rdw.nl/resource/3huj-srit.json","https://opendata.rdw.nl/resource/8ys7-d773.json","https://opendata.rdw.nl/resource/vezc-m2t6.json","https://opendata.rdw.nl/resource/jhie-znh9.json","https://opendata.rdw.nl/resource/kmfi-hrps.json"
"OS73YT","Oplegger","DOLL","VARIO P2H","20241025","20211025",,"open laadvloer",,"N.v.t.","N.v.t.",,,"7900","43200",,,,"20110120","20211025","Geen verstrekking in Open Data",,"N.v.t.","100","35300",,,,,,"4",,,,,"255","O4",,,"r. dwarsbalk v.","43200",,,,,,,,,"Nee","Nee",,"Nee",,,,,"Niet geregistreerd","NG","Ja","2024-10-25T00:00:00.000","2021-10-25T00:00:00.000","2011-01-20T00:00:00.000","2021-10-25T00:00:00.000",,"23200",,,"670","1080","945","1355",,,,,,,,,,,,,,"20211015","2021-10-15T00:00:00.000",,,,,"https://opendata.rdw.nl/resource/3huj-srit.json","https://opendata.rdw.nl/resource/8ys7-d773.json","https://opendata.rdw.nl/resource/vezc-m2t6.json","https://opendata.rdw.nl/resource/jhie-znh9.json","https://opendata.rdw.nl/resource/kmfi-hrps.json"
"OS84FG","Oplegger","DOLL","S4L","20250123","20200130",,"open laadvloer",,"N.v.t.","N.v.t.",,,"12745","54000",,,,"20160404","20200130","Geen verstrekking in Open Data",,"N.v.t.","100","41255",,,,,,"8",,,,,"255","O4",,,,"58000","S4L",,,,,,,,"Nee","Nee",,"Nee",,,,,"Niet geregistreerd","NG","Ja","2025-01-23T00:00:00.000","2020-01-30T00:00:00.000","2016-04-04T00:00:00.000","2020-01-30T00:00:00.000",,"18000",,,"1055","1755","1370","2070",,,,,,,,,,,,,,,,,,,,"https://opendata.rdw.nl/resource/3huj-srit.json","https://opendata.rdw.nl/resource/8ys7-d773.json","https://opendata.rdw.nl/resource/vezc-m2t6.json","https://opendata.rdw.nl/resource/jhie-znh9.json","https://opendata.rdw.nl/resource/kmfi-hrps.json"
"OS93ZH","Oplegger","DOLL","DOLL P2H","20241109","20211117",,"open laadvloer",,"N.v.t.","N.v.t.",,,"7900","38000",,,,"20110120","20211117","Geen verstrekking in Open Data",,"N.v.t.","100","30100",,,,,,"8",,,,,"255","O4",,,,"41200",,,,,,,,,"Nee","Nee",,"Nee",,,,,"Niet geregistreerd","NG","Ja","2024-11-09T00:00:00.000","2021-11-17T00:00:00.000","2011-01-20T00:00:00.000","2021-11-17T00:00:00.000",,"18000",,,"673","1083","940","1350",,,,,,,,,,,,,,"20211103","2021-11-03T00:00:00.000",,,,,"https://opendata.rdw.nl/resource/3huj-srit.json","https://opendata.rdw.nl/resource/8ys7-d773.json","https://opendata.rdw.nl/resource/vezc-m2t6.json","https://opendata.rdw.nl/resource/jhie-znh9.json","https://opendata.rdw.nl/resource/kmfi-hrps.json"
"OT38BT","Oplegger","DOLL","VARIO P1H","20250111","20220113",,"open laadvloer",,"N.v.t.","N.v.t.",,,"5600","28000",,,,"20120601","20220113","Geen verstrekking in Open Data",,"N.v.t.","100","22400",,,,,,"2",,,,,"255","O3",,,,"28000","VARIO P1H",,,,,,,,"Nee","Nee",,"Nee",,,,,"Niet geregistreerd","NG","Ja","2025-01-11T00:00:00.000","2022-01-13T00:00:00.000","2012-06-01T00:00:00.000","2022-01-13T00:00:00.000",,"18000",,,"490","720","760","990",,,,,,,,,,,,,,"20211229","2021-12-29T00:00:00.000",,,,,"https://opendata.rdw.nl/resource/3huj-srit.json","https://opendata.rdw.nl/resource/8ys7-d773.json","https://opendata.rdw.nl/resource/vezc-m2t6.json","https://opendata.rdw.nl/resource/jhie-znh9.json","https://opendata.rdw.nl/resource/kmfi-hrps.json"
"OT39BK","Oplegger","DOLL","VARIO P1H","20240902","20211224",,"open laadvloer",,"N.v.t.","N.v.t.",,,"5600","28000",,,,"20120620","20211224","Geen verstrekking in Open Data",,"N.v.t.","100","22400",,,,,,"2",,,,,"255","O3",,,"r. dwarsbalk v. hart koppeling","28000","VARIO P1H",,,,,,,,"Nee","Nee",,"Nee",,,,,"Niet geregistreerd","NG","Ja","2024-09-02T00:00:00.000","2021-12-24T00:00:00.000","2012-06-20T00:00:00.000","2021-12-24T00:00:00.000",,"18000",,,"490","720","760","990",,,,,,,,,,,,,,"20211213","2021-12-13T00:00:00.000",,,,,"https://opendata.rdw.nl/resource/3huj-srit.json","https://opendata.rdw.nl/resource/8ys7-d773.json","https://opendata.rdw.nl/resource/vezc-m2t6.json","https://opendata.rdw.nl/resource/jhie-znh9.json","https://opendata.rdw.nl/resource/kmfi-hrps.json"
"OT75JR","Oplegger","DOLL","DOLL S3HT","20240831","20220614",,"open laadvloer",,"N.v.t.","N.v.t.",,,"15120","48000",,,,"20060807","20220614","Geen verstrekking in Open Data",,"N.v.t.","100","32880",,,,,,"6",,,,,"255","O4",,,,"53100",,,,,,,,,"Nee","Nee",,"Nee",,,,,"Niet geregistreerd","NG","Ja","2024-08-31T00:00:00.000","2022-06-14T00:00:00.000","2006-08-07T00:00:00.000","2022-06-14T00:00:00.000",,"21000",,,"1020","2010","1260","2250",,,,,,,,,,,,,,"20220613","2022-06-13T00:00:00.000",,,,,"https://opendata.rdw.nl/resource/3huj-srit.json","https://opendata.rdw.nl/resource/8ys7-d773.json","https://opendata.rdw.nl/resource/vezc-m2t6.json","https://opendata.rdw.nl/resource/jhie-znh9.json","https://opendata.rdw.nl/resource/kmfi-hrps.json"
"OT86BG","Oplegger","DOLL","DOLL VARIO  P2H","20241221","20221229",,"open laadvloer",,"N.v.t.","N.v.t.",,,"7750","38000",,,,"20080404","20221229","Geen verstrekking in Open Data",,"N.v.t.","100","30250",,,,,,"8",,,,,"255","O4",,,"r. dwarsbalk v. hart koppeling","41200",,,,,,,,,"Nee","Nee",,"Nee",,,,,"Niet geregistreerd","NG","Ja","2024-12-21T00:00:00.000","2022-12-29T00:00:00.000","2008-04-04T00:00:00.000","2022-12-29T00:00:00.000",,"18000",,,"673","1083","940","1350",,,,,,,,,,,,,,"20211206","2021-12-06T00:00:00.000",,,,,"https://opendata.rdw.nl/resource/3huj-srit.json","https://opendata.rdw.nl/resource/8ys7-d773.json","https://opendata.rdw.nl/resource/vezc-m2t6.json","https://opendata.rdw.nl/resource/jhie-znh9.json","https://opendata.rdw.nl/resource/kmfi-hrps.json"
"OV35BS","Oplegger","DOLL","P2H","20241113","20230928",,"open laadvloer",,"N.v.t.","N.v.t.",,,"7660","38000",,,,"20130110","20230928","Geen verstrekking in Open Data",,"N.v.t.","80","30340",,,,,,"8",,,,,"255","O4",,,,"41200","P2H",,,,,,,,"Nee","Nee",,"Nee",,,,,"Niet geregistreerd","NG","Ja","2024-11-13T00:00:00.000","2023-09-28T00:00:00.000","2013-01-10T00:00:00.000","2023-09-28T00:00:00.000",,"18000",,,"670","970","950","1250",,,,,,,,,,,,,,"20230927","2023-09-27T00:00:00.000",,,,,"https://opendata.rdw.nl/resource/3huj-srit.json","https://opendata.rdw.nl/resource/8ys7-d773.json","https://opendata.rdw.nl/resource/vezc-m2t6.json","https://opendata.rdw.nl/resource/jhie-znh9.json","https://opendata.rdw.nl/resource/kmfi-hrps.json"
"OV88DK","Oplegger","DOLL","VARIO S2H","20241115","20231115",,"open laadvloer",,"N.v.t.","N.v.t.",,,"10450","38000",,,,"20060504","20231115","Geen verstrekking in Open Data",,"N.v.t.","100","27550",,,,,,"8",,,,,"255","O4",,,"r. dwarsbalk","38000",,,,,,,,,"Nee","Nee",,"Nee",,,,,"Niet geregistreerd","NG","Ja","2024-11-15T00:00:00.000","2023-11-15T00:00:00.000","2006-05-04T00:00:00.000","2023-11-15T00:00:00.000",,"18000",,,"956","1526","1152","1722",,,,,,,,,,,,,,"20231113","2023-11-13T00:00:00.000",,,,,"https://opendata.rdw.nl/resource/3huj-srit.json","https://opendata.rdw.nl/resource/8ys7-d773.json","https://opendata.rdw.nl/resource/vezc-m2t6.json","https://opendata.rdw.nl/resource/jhie-znh9.json","https://opendata.rdw.nl/resource/kmfi-hrps.json"