"kenteken","voertuigsoort","merk","handelsbenaming","vervaldatum_apk","datum_tenaamstelling","bruto_bpm","inrichting","aantal_zitplaatsen","eerste_kleur","tweede_kleur","aantal_cilinders","cilinderinhoud","massa_ledig_voertuig","toegestane_maximum_massa_voertuig","massa_rijklaar","maximum_massa_trekken_ongeremd","maximum_trekken_massa_geremd","datum_eerste_toelating","datum_eerste_tenaamstelling_in_nederland","wacht_op_keuren","catalogusprijs","wam_verzekerd","maximale_constructiesnelheid","laadvermogen","oplegger_geremd","aanhangwagen_autonoom_geremd","aanhangwagen_middenas_geremd","aantal_staanplaatsen","aantal_deuren","aantal_wielen","afstand_hart_koppeling_tot_achterzijde_voertuig","afstand_voorzijde_voertuig_tot_hart_koppeling","afwijkende_maximum_snelheid","lengte","breedte","europese_voertuigcategorie","europese_voertuigcategorie_toevoeging","europese_uitvoeringcategorie_toevoeging","plaats_chassisnummer","technische_max_massa_voertuig","type","type_gasinstallatie","typegoedkeuringsnummer","variant","uitvoering","volgnummer_wijziging_eu_typegoedkeuring","vermogen_massarijklaar","wielbasis","export_indicator","openstaande_terugroepactie_indicator","vervaldatum_tachograaf","taxi_indicator","maximum_massa_samenstelling","aantal_rolstoelplaatsen","maximum_ondersteunende_snelheid","jaar_laatste_registratie_tellerstand","tellerstandoordeel","code_toelichting_tellerstandoordeel","tenaamstellen_mogelijk","vervaldatum_apk_dt","datum_tenaamstelling_dt","datum_eerste_toelating_dt","datum_eerste_tenaamstelling_in_nederland_dt","vervaldatum_tachograaf_dt","maximum_last_onder_de_vooras_sen_tezamen_koppeling","type_remsysteem_voertuig_code","rupsonderstelconfiguratiecode","wielbasis_voertuig_minimum","wielbasis_voertuig_maximum","lengte_voertuig_minimum","lengte_voertuig_maximum","breedte_voertuig_minimum","breedte_voertuig_maximum","hoogte_voertuig","hoogte_voertuig_minimum","hoogte_voertuig_maximum","massa_bedrijfsklaar_minimaal","massa_bedrijfsklaar_maximaal","technisch_toelaatbaar_massa_koppelpunt","maximum_massa_technisch_maximaal","maximum_massa_technisch_minimaal","subcategorie_nederland","verticale_belasting_koppelpunt_getrokken_voertuig","zuinigheidsclassificatie","registratie_datum_goedkeuring_afschrijvingsmoment_bpm","registratie_datum_goedkeuring_afschrijvingsmoment_bpm_dt","gem_lading_wrde","aerodyn_voorz","massa_alt_aandr","verl_cab_ind","api_gekentekende_voertuigen_assen","api_gekentekende_voertuigen_brandstof","api_gekentekende_voertuigen_carrosserie","api_gekentekende_voertuigen_carrosserie_specifiek","api_gekentekende_voertuigen_voertuigklasse"
"00WBB9","Middenasaanhangwagen","HAPERT","COBALT",,"20210726",,"kipper",,"N.v.t.","N.v.t.",,,"595","1350",,,,"20210726","20210726","Geen verstrekking in Open Data",,"N.v.t.","130","755",,,,,"0","2","409","0",,"412","166","O2",,,,"1350","EA",,"e4*2007/46*0124*12","C18F","201","0",,"266","Nee","Nee",,"Nee","0","0","0.00",,"Niet geregistreerd","NG","Ja",,"2021-07-26T00:00:00.000","2021-07-26T00:00:00.000","2021-07-26T00:00:00.000",,"75",,,,,,,,,"98",,,,,,,,,,,,,,,,,"https://opendata.rdw.nl/resource/3huj-srit.json","https://opendata.rdw.nl/resource/8ys7-d773.json","https://opendata.rdw.nl/resource/vezc-m2t6.json","https://opendata.rdw.nl/resource/jhie-znh9.json","https://opendata.rdw.nl/resource/kmfi-hrps.json"
"00WBD4","Middenasaanhangwagen","HAPERT","COBALT",,"20220228",,"kipper",,"N.v.t.","N.v.t.",,,"634","2000",,,,"20220228","20220228","Geen verstrekking in Open Data",,"N.v.t.","130","1366",,,,,"0","4","409","0",,"412","166","O2",,,,"2000","TA",,"e4*2007/46*0139*12","C29F","201","0",,"307","Nee","Nee",,"Nee","0","0","0.00",,"Niet geregistreerd","NG","Ja",,"2022-02-28T00:00:00.000","2022-02-28T00:00:00.000","2022-02-28T00:00:00.000",,"100",,,,,,,,,"107",,,,,,,,,,,,,,,,,"https://opendata.rdw.nl/resource/3huj-srit.json","https://opendata.rdw.nl/resource/8ys7-d773.json","https://opendata.rdw.nl/resource/vezc-m2t6.json","https://opendata.rdw.nl/resource/jhie-znh9.json","https://opendata.rdw.nl/resource/kmfi-hrps.json"
"00WBD6","Middenasaanhangwagen","HAPERT","COBALT",,"20210724",,"kipper",,"N.v.t.","N.v.t.",,,"1106","3500",,,,"20210724","20210724","Geen verstrekking in Open Data",,"N.v.t.","130","2394",,,,,"0","4","468","0",,"471","186","O2",,,,"3500","TA",,"e4*2007/46*0139*12","C44F","302","0",,"350","Nee","Nee",,"Nee","0","0","0.00",,"Niet geregistreerd","NG","Ja",,"2021-07-24T00:00:00.000","2021-07-24T00:00:00.000","2021-07-24T00:00:00.000",,"150",,,,,,,,,"115",,,,,,,,,,,,,,,,,"https://opendata.rdw.nl/resource/3huj-srit.json","https://opendata.rdw.nl/resource/8ys7-d773.json","https://opendata.rdw.nl/resource/vezc-m2t6.json","https://opendata.rdw.nl/resource/jhie-znh9.json","https://opendata.rdw.nl/resource/kmfi-hrps.json"
"00WBG4","Middenasaanhangwagen","HAPERT","SAPPHIRE",,"20210806",,"gesloten opbouw",,"N.v.t.","N.v.t.",,,"457","1350",,,,"20210806","20210806","Geen verstrekking in Open Data",,"N.v.t.","130","893",,,,,"0","2","385","0",,"388","178","O2",,,,"1350","EA",,"e4*2007/46*0124*12","C18B","201","0",,"266","Nee","Nee",,"Nee","0","0","0.00",,"Niet geregistreerd","NG","Ja",,"2021-08-06T00:00:00.000","2021-08-06T00:00:00.000","2021-08-06T00:00:00.000",,"75",,,,,,,,,"205",,,,,,,,,,,,,,,,,"https://opendata.rdw.nl/resource/3huj-srit.json","https://opendata.rdw.nl/resource/8ys7-d773.json","https://opendata.rdw.nl/resource/vezc-m2t6.json","https://opendata.rdw.nl/resource/jhie-znh9.json","https://opendata.rdw.nl/resource/kmfi-hrps.json"
"00WBG8","Middenasaanhangwagen","HAPERT","AZURE",,"20210804",,"open laadvloer",,"N.v.t.","N.v.t.",,,"826","3500",,,,"20210804","20210804","Geen verstrekking in Open Data",,"N.v.t.","130","2674",,,,,"0","4","561","0",,"564","206","O2",,,,"3500","TA",,"e4*2007/46*0139*12","C44A","302","0",,"398","Nee","Nee",,"Nee","0","0","0.00",,"Niet geregistreerd","NG","Ja",,"2021-08-04T00:00:00.000","2021-08-04T00:00:00.000","2021-08-04T00:00:00.000",,"150",,,,,,,,,"95",,,,,,,,,,,,,,,,,"https://opendata.rdw.nl/resource/3huj-srit.json","https://opendata.rdw.nl/resource/8ys7-d773.json","https://opendata.rdw.nl/resource/vezc-m2t6.json","https://opendata.rdw.nl/resource/jhie-znh9.json","https://opendata.rdw.nl/resource/kmfi-hrps.json"
"00WBK5","Middenasaanhangwagen","HAPERT","AZURE",,,,"open laadvloer",,"N.v.t.","N.v.t.",,,"591","3000",,,,,,"Geen verstrekking in Open Data",,"N.v.t.","130","2409",,,,,"0","4","534","0",,"537","186","O2",,,,"3000","TA",,"e4*2007/46*0139*13","C39A","302","0",,"370","Nee","Nee",,"Nee","0","0","0.00",,"Niet geregistreerd","NG","Ja",,,,,,"150",,,,,,,,,"106",,,,,,,,,,,,,,,,,"https://opendata.rdw.nl/resource/3huj-srit.json","https://opendata.rdw.nl/resource/8ys7-d773.json","https://opendata.rdw.nl/resource/vezc-m2t6.json","https://opendata.rdw.nl/resource/jhie-znh9.json","https://opendata.rdw.nl/resource/kmfi-hrps.json"
"00WBP9","Middenasaanhangwagen","HAPERT","SAPPHIRE",,"20211106",,"gesloten opbouw",,"N.v.t.","N.v.t.",,,"501","1500",,,,"20211106","20211106","Geen verstrekking in Open Data",,"N.v.t.","130","999",,,,,"0","2","432","0",,"435","198","O2",,,,"1500","EA",,"e4*2007/46*0124*13","C21B","201","0",,"291","Nee","Nee",,"Nee","0","0","0.00",,"Niet geregistreerd","NG","Ja",,"2021-11-06T00:00:00.000","2021-11-06T00:00:00.000","2021-11-06T00:00:00.000",,"75",,,,,,,,,"205",,,,,,,,,,,"20211004","2021-10-04T00:00:00.000",,,,,"https://opendata.rdw.nl/resource/3huj-srit.json","https://opendata.rdw.nl/resource/8ys7-d773.json","https://opendata.rdw.nl/resource/vezc-m2t6.json","https://opendata.rdw.nl/resource/jhie-znh9.json","https://opendata.rdw.nl/resource/kmfi-hrps.json"
"00WBR8","Middenasaanhangwagen","HAPERT","SAPPHIRE",,"20211112",,"gesloten opbouw",,"N.v.t.","N.v.t.",,,"638","1395",,,,"20211112","20211112","Geen verstrekking in Open Data",,"N.v.t.","130","757",,,,,"0","4","431","0",,"434","199","O2",,,,"2000","TA",,"e4*2007/46*0139*13","C29B","201","0",,"311","Nee","Nee",,"Nee","0","0","0.00",,"Niet geregistreerd","NG","Ja",,"2021-11-12T00:00:00.000","2021-11-12T00:00:00.000","2021-11-12T00:00:00.000",,"100",,,,,,,,,"235",,,,,,,,,,,,,,,,,"https://opendata.rdw.nl/resource/3huj-srit.json","https://opendata.rdw.nl/resource/8ys7-d773.json","https://opendata.rdw.nl/resource/vezc-m2t6.json","https://opendata.rdw.nl/resource/jhie-znh9.json","https://opendata.rdw.nl/resource/kmfi-hrps.json"
"00WBS3","Middenasaanhangwagen","HAPERT","AZURE",,"20211214",,"open laadvloer",,"N.v.t.","N.v.t.",,,"217","1350",,,,"20211214","20211214","Geen verstrekking in Open Data",,"N.v.t.","130","1133",,,,,"0","2","326","0",,"329","158","O2",,,,"1350","EA",,"e4*2007/46*0124*13","C18A","101","0",,"224","Nee","Nee",,"Nee","0","0","0.00",,"Niet geregistreerd","NG","Ja",,"2021-12-14T00:00:00.000","2021-12-14T00:00:00.000","2021-12-14T00:00:00.000",,"75",,,,,,,,,"98",,,,,,,,,,,"20211014","2021-10-14T00:00:00.000",,,,,"https://opendata.rdw.nl/resource/3huj-srit.json","https://opendata.rdw.nl/resource/8ys7-d773.json","https://opendata.rdw.nl/resource/vezc-m2t6.json","https://opendata.rdw.nl/resource/jhie-znh9.json","https://opendata.rdw.nl/resource/kmfi-hrps.json"
"00WBT4","Middenasaanhangwagen","HAPERT","COBALT",,"20211229",,"kipper",,"N.v.t.","N.v.t.",,,"838","2700",,,,"20211229","20211229","Geen verstrekking in Open Data",,"N.v.t.","130","1862",,,,,"0","4","434","0",,"437","186","O2",,,,"2700","TA",,"e4*2007/46*0139*13","C36F","202","0",,"331","Nee","Nee",,"Nee","0","0","0.00",,"Niet geregistreerd","NG","Ja",,"2021-12-29T00:00:00.000","2021-12-29T00:00:00.000","2021-12-29T00:00:00.000",,"100",,,,,,,,,"98",,,,,,,,,,,"20211022","2021-10-22T00:00:00.000",,,,,"https://opendata.rdw.nl/resource/3huj-srit.json","https://opendata.rdw.nl/resource/8ys7-d773.json","https://opendata.rdw.nl/resource/vezc-m2t6.json","https://opendata.rdw.nl/resource/jhie-znh9.json","https://opendata.rdw.nl/resource/kmfi-hrps.json"
"00WBX1","Middenasaanhangwagen","HAPERT","AZURE",,"20220120",,"open laadvloer",,"N.v.t.","N.v.t.",,,"484","2000",,,,"20220120","20220120","Geen verstrekking in Open Data",,"N.v.t.","130","1516",,,,,"0","4","464","0",,"467","186","O2",,,,"2000","TA",,"e4*2007/46*0139*13","C29A","302","0",,"336","Nee","Nee",,"Nee","0","0","0.00",,"Niet geregistreerd","NG","Ja",,"2022-01-20T00:00:00.000","2022-01-20T00:00:00.000","2022-01-20T00:00:00.000",,"100",,,,,,,,,"103",,,,,,,,,,,"20211105","2021-11-05T00:00:00.000",,,,,"https://opendata.rdw.nl/resource/3huj-srit.json","https://opendata.rdw.nl/resource/8ys7-d773.json","https://opendata.rdw.nl/resource/vezc-m2t6.json","https://opendata.rdw.nl/resource/jhie-znh9.json","https://opendata.rdw.nl/resource/kmfi-hrps.json"
"00WBX5","Middenasaanhangwagen","HAPERT","COBALT",,"20211115",,"kipper",,"N.v.t.","N.v.t.",,,"824","2700",,,,"20211115","20211115","Geen verstrekking in Open Data",,"N.v.t.","130","1876",,,,,"0","4","434","0",,"437","186","O2",,,,"2700","TA",,"e4*2007/46*0139*13","C36F","202","0",,"331","Nee","Nee",,"Nee","0","0","0.00",,"Niet geregistreerd","NG","Ja",,"2021-11-15T00:00:00.000","2021-11-15T00:00:00.000","2021-11-15T00:00:00.000",,"100",,,,,,,,,"98",,,,,,,,,,,"20211110","2021-11-10T00:00:00.000",,,,,"https://opendata.rdw.nl/resource/3huj-srit.json","https://opendata.rdw.nl/resource/8ys7-d773.json","https://opendata.rdw.nl/resource/vezc-m2t6.json","https://opendata.rdw.nl/resource/jhie-znh9.json","https://opendata.rdw.nl/resource/kmfi-hrps.json"
"00WBX8","Middenasaanhangwagen","HAPERT","AZURE",,"20220902",,"open laadvloer",,"N.v.t.","N.v.t.",,,"458","2700",,,,"20220902","20220902","Geen verstrekking in Open Data",,"N.v.t.","130","2242",,,,,"0","4","409","0",,"412","166","O2",,,,"2700","TA",,"e4*2007/46*0139*13","C36A","201","0",,"309","Nee","Nee",,"Nee","0","0","0.00",,"Niet geregistreerd","NG","Ja",,"2022-09-02T00:00:00.000","2022-09-02T00:00:00.000","2022-09-02T00:00:00.000",,"100",,,,,,,,,"94",,,,,,,,,,,"20211112","2021-11-12T00:00:00.000",,,,,"https://opendata.rdw.nl/resource/3huj-srit.json","https://opendata.rdw.nl/resource/8ys7-d773.json","https://opendata.rdw.nl/resource/vezc-m2t6.json","https://opendata.rdw.nl/resource/jhie-znh9.json","https://opendata.rdw.nl/resource/kmfi-hrps.json"
"00WDB3","Middenasaanhangwagen","HAPERT","INDIGO",,"20230414",,"open laadvloer",,"N.v.t.","N.v.t.",,,"1187","3500",,,,"20211203","20211203","Geen verstrekking in Open Data",,"N.v.t.","130","2313",,,,,"0","6","664","0",,"667","210","O2",,,,"3500","MA",,"e4*2007/46*0140*10","C45A","402","0",,"477","Nee","Nee",,"Nee","0","0","0.00",,"Niet geregistreerd","NG","Ja",,"2023-04-14T00:00:00.000","2021-12-03T00:00:00.000","2021-12-03T00:00:00.000",,"150",,,,,,,,,"158",,,,,,,,,,,"20211126","2021-11-26T00:00:00.000",,,,,"https://opendata.rdw.nl/resource/3huj-srit.json","https://opendata.rdw.nl/resource/8ys7-d773.json","https://opendata.rdw.nl/resource/vezc-m2t6.json","https://opendata.rdw.nl/resource/jhie-znh9.json","https://opendata.rdw.nl/resource/kmfi-hrps.json"
"00WDF2","Middenasaanhangwagen","HAPERT","AZURE",,"20220114",,"open laadvloer",,"N.v.t.","N.v.t.",,,"490","2000",,,,"20220114","20220114","Geen verstrekking in Open Data",,"N.v.t.","130","1510",,,,,"0","4","464","0",,"467","186","O2",,,,"2000","TA",,"e4*2007/46*0139*13","C29A","302","0",,"336","Nee","Nee",,"Nee","0","0","0.00",,"Niet geregistreerd","NG","Ja",,"2022-01-14T00:00:00.000","2022-01-14T00:00:00.000","2022-01-14T00:00:00.000",,"100",,,,,,,,,"94",,,,,,,,,,,"20211214","2021-12-14T00:00:00.000",,,,,"https://opendata.rdw.nl/resource/3huj-srit.json","https://opendata.rdw.nl/resource/8ys7-d773.json","https://opendata.rdw.nl/resource/vezc-m2t6.json","https://opendata.rdw.nl/resource/jhie-znh9.json","https://opendata.rdw.nl/resource/kmfi-hrps.json"
"00WDF5","Middenasaanhangwagen","HAPERT","COBALT",,"20220126",,"kipper",,"N.v.t.","N.v.t.",,,"940","3000",,,,"20220126","20220126","Geen verstrekking in Open Data",,"N.v.t.","130","2060",,,,,"0","4","464","0",,"467","186","O2",,,,"3000","TA",,"e4*2007/46*0139*13","C39F","302","0",,"346","Nee","Nee",,"Nee","0","0","0.00",,"Niet geregistreerd","NG","Nee",,"2022-01-26T00:00:00.000","2022-01-26T00:00:00.000","2022-01-26T00:00:00.000",,"150",,,,,,,,,"98",,,,,,,,,,,"20211216","2021-12-16T00:00:00.000",,,,,"https://opendata.rdw.nl/resource/3huj-srit.json","https://opendata.rdw.nl/resource/8ys7-d773.json","https://opendata.rdw.nl/resource/vezc-m2t6.json","https://opendata.rdw.nl/resource/jhie-znh9.json","https://opendata.rdw.nl/resource/kmfi-hrps.json"
"00WDG8","Middenasaanhangwagen","HAPERT","AZURE",,"20220111",,"open laadvloer",,"N.v.t.","N.v.t.",,,"330","1350",,,,"20220111","20220111","Geen verstrekking in Open Data",,"N.v.t.","130","1020",,,,,"0","2","379","0",,"382","178","O2",,,,"1350","EA",,"e4*2007/46*0124*13","C18A","201","0",,"248","Nee","Nee",,"Nee","0","0","0.00",,"Niet geregistreerd","NG","Ja",,"2022-01-11T00:00:00.000","2022-01-11T00:00:00.000","2022-01-11T00:00:00.000",,"75",,,,,,,,,"92",,,,,,,,,,,"20220106","2022-01-06T00:00:00.000",,,,,"https://opendata.rdw.nl/resource/3huj-srit.json","https://opendata.rdw.nl/resource/8ys7-d773.json","https://opendata.rdw.nl/resource/vezc-m2t6.json","https://opendata.rdw.nl/resource/jhie-znh9.json","https://opendata.rdw.nl/resource/kmfi-hrps.json"
"00WDG9","Middenasaanhangwagen","HAPERT","AZURE",,"20220311",,"open laadvloer",,"N.v.t.","N.v.t.",,,"484","2000",,,,"20220311","20220311","Geen verstrekking in Open Data",,"N.v.t.","130","1516",,,,,"0","4","464","0",,"467","186","O2",,,,"2000","TA",,"e4*2007/46*0139*13","C29A","302","0",,"336","Nee","Nee",,"Nee","0","0","0.00",,"Niet geregistreerd","NG","Ja",,"2022-03-11T00:00:00.000","2022-03-11T00:00:00.000","2022-03-11T00:00:00.000",,"100",,,,,,,,,"103",,,,,,,,,,,"20220107","2022-01-07T00:00:00.000",,,,,"https://opendata.rdw.nl/resource/3huj-srit.json","https://opendata.rdw.nl/resource/8ys7-d773.json","https://opendata.rdw.nl/resource/vezc-m2t6.json","https://opendata.rdw.nl/resource/jhie-znh9.json","https://opendata.rdw.nl/resource/kmfi-hrps.json"
"00WDH1","Middenasaanhangwagen","HAPERT","AZURE",,"20220121",,"open laadvloer",,"N.v.t.","N.v.t.",,,"564","2700",,,,"20220121","20220121","Geen verstrekking in Open Data",,"N.v.t.","130","2136",,,,,"0","4","534","0",,"537","186","O2",,,,"2700","TA",,"e4*2007/46*0139*13","C36A","302","0",,"370","Nee","Nee",,"Nee","0","0","0.00",,"Niet geregistreerd","NG","Ja",,"2022-01-21T00:00:00.000","2022-01-21T00:00:00.000","2022-01-21T00:00:00.000",,"100",,,,,,,,,"94",,,,,,,,,,,"20220110","2022-01-10T00:00:00.000",,,,,"https://opendata.rdw.nl/resource/3huj-srit.json","https://opendata.rdw.nl/resource/8ys7-d773.json","https://opendata.rdw.nl/resource/vezc-m2t6.json","https://opendata.rdw.nl/resource/jhie-znh9.json","https://opendata.rdw.nl/resource/kmfi-hrps.json"
"00WDH5","Middenasaanhangwagen","HAPERT","AZURE",,"20220325",,"open laadvloer",,"N.v.t.","N.v.t.",,,"523","3000",,,,"20220325","20220325","Geen verstrekking in Open Data",,"N.v.t.","130","2477",,,,,"0","4","464","0",,"467","186","O2",,,,"3000","TA",,"e4*2007/46*0139*13","C39A","302","0",,"336","Nee","Nee",,"Nee","0","0","0.00",,"Niet geregistreerd","NG","Ja",,"2022-03-25T00:00:00.000","2022-03-25T00:00:00.000","2022-03-25T00:00:00.000",,"150",,,,,,,,,"94",,,,,,,,,,,"20220113","2022-01-13T00:00:00.000",,,,,"https://opendata.rdw.nl/resource/3huj-srit.json","https://opendata.rdw.nl/resource/8ys7-d773.json","https://opendata.rdw.nl/resource/vezc-m2t6.json","https://opendata.rdw.nl/resource/jhie-znh9.json","https://opendata.rdw.nl/resource/kmfi-hrps.json"
"00WDH6","Middenasaanhangwagen","HAPERT","AZURE",,"20220125",,"open laadvloer",,"N.v.t.","N.v.t.",,,"318","2000",,,,"20220125","20220125","Geen verstrekking in Open Data",,"N.v.t.","130","1682",,,,,"0","4","376","0",,"379","198","O2",,,,"2000","TA",,"e4*2007/46*0139*13","C29A","201","0",,"287","Nee","Nee",,"Nee","0","0","0.00",,"Niet geregistreerd","NG","Ja",,"2022-01-25T00:00:00.000","2022-01-25T00:00:00.000","2022-01-25T00:00:00.000",,"100",,,,,,,,,"98",,,,,,,,,,,"20220114","2022-01-14T00:00:00.000",,,,,"https://opendata.rdw.nl/resource/3huj-srit.json","https://opendata.rdw.nl/resource/8ys7-d773.json","https://opendata.rdw.nl/resource/vezc-m2t6.json","https://opendata.rdw.nl/resource/jhie-znh9.json","https://opendata.rdw.nl/resource/kmfi-hrps.json"
"00WDJ5","Middenasaanhangwagen","HAPERT","AZURE",,"20231006",,"open laadvloer",,"N.v.t.","N.v.t.",,,"624","3000",,,,"20220126","20220126","Geen verstrekking in Open Data",,"N.v.t.","130","2376",,,,,"0","4","558","0",,"561","206","O2",,,,"3000","TA",,"e4*2007/46*0139*13","C39A","302","0",,"395","Nee","Nee",,"Nee","0","0","0.00",,"Niet geregistreerd","NG","Ja",,"2023-10-06T00:00:00.000","2022-01-26T00:00:00.000","2022-01-26T00:00:00.000",,"150",,,,,,,,,"93",,,,,,,,,,,"20220124","2022-01-24T00:00:00.000",,,,,"https://opendata.rdw.nl/resource/3huj-srit.json","https://opendata.rdw.nl/resource/8ys7-d773.json","https://opendata.rdw.nl/resource/vezc-m2t6.json","https://opendata.rdw.nl/resource/jhie-znh9.json","https://opendata.rdw.nl/resource/kmfi-hrps.json"
"00WDJ8","Middenasaanhangwagen","HAPERT","INDIGO",,"20230125",,"open laadvloer",,"N.v.t.","N.v.t.",,,"820","3000",,,,"20230125","20230125","Geen verstrekking in Open Data",,"N.v.t.","130","2180",,,,,"0","4","538","0",,"541","227","O2",,,,"3000","TA",,"e4*2007/46*0139*13","C39A","302","0",,"389","Nee","Nee",,"Nee","0","0","0.00",,"Niet geregistreerd","NG","Ja",,"2023-01-25T00:00:00.000","2023-01-25T00:00:00.000","2023-01-25T00:00:00.000",,"150",,,,,,,,,"185",,,,,,,,,,,"20220126","2022-01-26T00:00:00.000",,,,,"https://opendata.rdw.nl/resource/3huj-srit.json","https://opendata.rdw.nl/resource/8ys7-d773.json","https://opendata.rdw.nl/resource/vezc-m2t6.json","https://opendata.rdw.nl/resource/jhie-znh9.json","https://opendata.rdw.nl/resource/kmfi-hrps.json"
"00WDK5","Middenasaanhangwagen","HAPERT","INDIGO",,"20220204",,"open laadvloer",,"N.v.t.","N.v.t.",,,"1125","3500",,,,"20220204","20220204","Geen verstrekking in Open Data",,"N.v.t.","130","2375",,,,,"0","6","592","0",,"595","237","O2",,,,"3500","MA",,"e4*2007/46*0140*10","C45A","402","0",,"437","Nee","Nee",,"Nee","0","0","0.00",,"Niet geregistreerd","NG","Ja",,"2022-02-04T00:00:00.000","2022-02-04T00:00:00.000","2022-02-04T00:00:00.000",,"150",,,,,,,,,"189",,,,,,,,,,,"20220201","2022-02-01T00:00:00.000",,,,,"https://opendata.rdw.nl/resource/3huj-srit.json","https://opendata.rdw.nl/resource/8ys7-d773.json","https://opendata.rdw.nl/resource/vezc-m2t6.json","https://opendata.rdw.nl/resource/jhie-znh9.json","https://opendata.rdw.nl/resource/kmfi-hrps.json"
"00WDL3","Middenasaanhangwagen","HAPERT","COBALT",,"20220224",,"kipper",,"N.v.t.","N.v.t.",,,"1144","3500",,,,"20220224","20220224","Geen verstrekking in Open Data",,"N.v.t.","130","2356",,,,,"0","4","508","0",,"511","186","O2",,,,"3500","TA",,"e4*2007/46*0139*13","C45F","302","0",,"370","Nee","Nee",,"Nee","0","0","0.00",,"Niet geregistreerd","NG","Ja",,"2022-02-24T00:00:00.000","2022-02-24T00:00:00.000","2022-02-24T00:00:00.000",,"150",,,,,,,,,"100",,,,,,,,,,,"20220207","2022-02-07T00:00:00.000",,,,,"https://opendata.rdw.nl/resource/3huj-srit.json","https://opendata.rdw.nl/resource/8ys7-d773.json","https://opendata.rdw.nl/resource/vezc-m2t6.json","https://opendata.rdw.nl/resource/jhie-znh9.json","https://opendata.rdw.nl/resource/kmfi-hrps.json"
"00WDL7","Middenasaanhangwagen","HAPERT","AZURE",,"20220216",,"open laadvloer",,"N.v.t.","N.v.t.",,,"452","2000",,,,"20220216","20220216","Geen verstrekking in Open Data",,"N.v.t.","130","1548",,,,,"0","4","433","0",,"437","166","O2",,,,"2000","TA",,"e4*2007/46*0139*13","C29A","201","0",,"321","Nee","Nee",,"Nee","0","0","0.00",,"Niet geregistreerd","NG","Ja",,"2022-02-16T00:00:00.000","2022-02-16T00:00:00.000","2022-02-16T00:00:00.000",,"100",,,,,,,,,"94",,,,,,,,,,,"20220209","2022-02-09T00:00:00.000",,,,,"https://opendata.rdw.nl/resource/3huj-srit.json","https://opendata.rdw.nl/resource/8ys7-d773.json","https://opendata.rdw.nl/resource/vezc-m2t6.json","https://opendata.rdw.nl/resource/jhie-znh9.json","https://opendata.rdw.nl/resource/kmfi-hrps.json"
"00WDL9","Middenasaanhangwagen","HAPERT","HAPA-2067",,"20220210",,"open laadvloer",,"N.v.t.","N.v.t.",,,"320","1000",,,,"19990630","20220210","Geen verstrekking in Open Data",,"N.v.t.","100","680",,,,,,"2","373",,,"376","179","O2",,,"r. balk","1000","R10 02",,,,,,,,"Nee","Nee",,"Nee",,,,,"Niet geregistreerd","NG","Ja",,"2022-02-10T00:00:00.000","1999-06-30T00:00:00.000","2022-02-10T00:00:00.000",,"75",,,,,,,,,,,,,,,,,,,,"20220210","2022-02-10T00:00:00.000",,,,,"https://opendata.rdw.nl/resource/3huj-srit.json","https://opendata.rdw.nl/resource/8ys7-d773.json","https://opendata.rdw.nl/resource/vezc-m2t6.json","https://opendata.rdw.nl/resource/jhie-znh9.json","https://opendata.rdw.nl/resource/kmfi-hrps.json"
"00WDN7","Middenasaanhangwagen","HAPERT","COBALT",,"20220310",,"kipper",,"N.v.t.","N.v.t.",,,"688","2700",,,,"20220310","20220310","Geen verstrekking in Open Data",,"N.v.t.","130","2012",,,,,"0","4","409","0",,"412","166","O2",,,,"2700","TA",,"e4*2007/46*0139*13","C36F","201","0",,"307","Nee","Nee",,"Nee","0","0","0.00",,"Niet geregistreerd","NG","Ja",,"2022-03-10T00:00:00.000","2022-03-10T00:00:00.000","2022-03-10T00:00:00.000",,"100",,,,,,,,,"98",,,,,,,,,,,"20220217","2022-02-17T00:00:00.000",,,,,"https://opendata.rdw.nl/resource/3huj-srit.json","https://opendata.rdw.nl/resource/8ys7-d773.json","https://opendata.rdw.nl/resource/vezc-m2t6.json","https://opendata.rdw.nl/resource/jhie-znh9.json","https://opendata.rdw.nl/resource/kmfi-hrps.json"