"kenteken","voertuigsoort","merk","handelsbenaming","vervaldatum_apk","datum_tenaamstelling","bruto_bpm","inrichting","aantal_zitplaatsen","eerste_kleur","tweede_kleur","aantal_cilinders","cilinderinhoud","massa_ledig_voertuig","toegestane_maximum_massa_voertuig","massa_rijklaar","maximum_massa_trekken_ongeremd","maximum_trekken_massa_geremd","datum_eerste_toelating","datum_eerste_tenaamstelling_in_nederland","wacht_op_keuren","catalogusprijs","wam_verzekerd","maximale_constructiesnelheid","laadvermogen","oplegger_geremd","aanhangwagen_autonoom_geremd","aanhangwagen_middenas_geremd","aantal_staanplaatsen","aantal_deuren","aantal_wielen","afstand_hart_koppeling_tot_achterzijde_voertuig","afstand_voorzijde_voertuig_tot_hart_koppeling","afwijkende_maximum_snelheid","lengte","breedte","europese_voertuigcategorie","europese_voertuigcategorie_toevoeging","europese_uitvoeringcategorie_toevoeging","plaats_chassisnummer","technische_max_massa_voertuig","type","type_gasinstallatie","typegoedkeuringsnummer","variant","uitvoering","volgnummer_wijziging_eu_typegoedkeuring","vermogen_massarijklaar","wielbasis","export_indicator","openstaande_terugroepactie_indicator","vervaldatum_tachograaf","taxi_indicator","maximum_massa_samenstelling","aantal_rolstoelplaatsen","maximum_ondersteunende_snelheid","jaar_laatste_registratie_tellerstand","tellerstandoordeel","code_toelichting_tellerstandoordeel","tenaamstellen_mogelijk","vervaldatum_apk_dt","datum_tenaamstelling_dt","datum_eerste_toelating_dt","datum_eerste_tenaamstelling_in_nederland_dt","vervaldatum_tachograaf_dt","maximum_last_onder_de_vooras_sen_tezamen_koppeling","type_remsysteem_voertuig_code","rupsonderstelconfiguratiecode","wielbasis_voertuig_minimum","wielbasis_voertuig_maximum","lengte_voertuig_minimum","lengte_voertuig_maximum","breedte_voertuig_minimum","breedte_voertuig_maximum","hoogte_voertuig","hoogte_voertuig_minimum","hoogte_voertuig_maximum","massa_bedrijfsklaar_minimaal","massa_bedrijfsklaar_maximaal","technisch_toelaatbaar_massa_koppelpunt","maximum_massa_technisch_maximaal","maximum_massa_technisch_minimaal","subcategorie_nederland","verticale_belasting_koppelpunt_getrokken_voertuig","zuinigheidsclassificatie","registratie_datum_goedkeuring_afschrijvingsmoment_bpm","registratie_datum_goedkeuring_afschrijvingsmoment_bpm_dt","gem_lading_wrde","aerodyn_voorz","massa_alt_aandr","verl_cab_ind","api_gekentekende_voertuigen_assen","api_gekentekende_voertuigen_brandstof","api_gekentekende_voertuigen_carrosserie","api_gekentekende_voertuigen_carrosserie_specifiek","api_gekentekende_voertuigen_voertuigklasse"
"00WBB9","Middenasaanhangwagen","HAPERT","COBALT",,"20210726",,"kipper",,"N.v.t.","N.v.t.",,,"595","1350",,,,"20210726","20210726","Geen verstrekking in Open Data",,"N.v.t.","130","755",,,,,"0","2","409","0",,"412","166","O2",,,,"1350","EA",,"e4*2007/46*0124*12","C18F","201","0",,"266","Nee","Nee",,"Nee","0","0","0.00",,"Niet geregistreerd","NG","Ja",,"2021-07-26T00:00:00.000","2021-07-26T00:00:00.000","2021-07-26T00:00:00.000",,"75",,,,,,,,,"98",,,,,,,,,,,,,,,,,"https://opendata.rdw.nl/resource/3huj-srit.json","https://opendata.rdw.nl/resource/8ys7-d773.json","https://opendata.rdw.nl/resource/vezc-m2t6.json","https://opendata.rdw.nl/resource/jhie-znh9.json","https://opendata.rdw.nl/resource/kmfi-hrps.json"
"00WBD4","Middenasaanhangwagen","HAPERT","COBALT",,"20220228",,"kipper",,"N.v.t.","N.v.t.",,,"634","2000",,,,"20220228","20220228","Geen verstrekking in Open Data",,"N.v.t.","130","1366",,,,,"0","4","409","0",,"412","166","O2",,,,"2000","TA",,"e4*2007/46*0139*12","C29F","201","0",,"307","Nee","Nee",,"Nee","0","0","0.00",,"Niet geregistreerd","NG","Ja",,"2022-02-28T00:00:00.000","2022-02-28T00:00:00.000","2022-02-28T00:00:00.000",,"100",,,,,,,,,"107",,,,,,,,,,,,,,,,,"https://opendata.rdw.nl/resource/3huj-srit.json","https://opendata.rdw.nl/resource/8ys7-d773.json","https://opendata.rdw.nl/resource/vezc-m2t6.json","https://opendata.rdw.nl/resource/jhie-znh9.json","https://opendata.rdw.nl/resource/kmfi-hrps.json"
"00WBD6","Middenasaanhangwagen","HAPERT","COBALT",,"20210724",,"kipper",,"N.v.t.","N.v.t.",,,"1106","3500",,,,"20210724","20210724","Geen verstrekking in Open Data",,"N.v.t.","130","2394",,,,,"0","4","468","0",,"471","186","O2",,,,"3500","TA",,"e4*2007/46*0139*12","C44F","302","0",,"350","Nee","Nee",,"Nee","0","0","0.00",,"Niet geregistreerd","NG","Ja",,"2021-07-24T00:00:00.000","2021-07-24T00:00:00.000","2021-07-24T00:00:00.000",,"150",,,,,,,,,"115",,,,,,,,,,,,,,,,,"https://opendata.rdw.nl/resource/3huj-srit.json","https://opendata.rdw.nl/resource/8ys7-d773.json","https://opendata.rdw.nl/resource/vezc-m2t6.json","https://opendata.rdw.nl/resource/jhie-znh9.json","https://opendata.rdw.nl/resource/kmfi-hrps.json"
"00WBD8","Middenasaanhangwagen","ANSSEMS","KSX 2500-305X178",,"20220204",,"kipper",,"N.v.t.","N.v.t.",,,"745","2500",,,,"20220204","20220204","Geen verstrekking in Open Data",,"N.v.t.","140","1755",,,,,"0","4","458","0",,"461","189","O2",,,,"2500","KSX2",,"e4*2007/46*0358*04","A1","2500","0",,"333","Nee","Nee",,"Nee","0","0","0.00",,"Niet geregistreerd","NG","Ja",,"2022-02-04T00:00:00.000","2022-02-04T00:00:00.000","2022-02-04T00:00:00.000",,"120",,,,,,,,,"98",,,,,,,,,,,,,,,,,"https://opendata.rdw.nl/resource/3huj-srit.json","https://opendata.rdw.nl/resource/8ys7-d773.json","https://opendata.rdw.nl/resource/vezc-m2t6.json","https://opendata.rdw.nl/resource/jhie-znh9.json","https://opendata.rdw.nl/resource/kmfi-hrps.json"
"00WBL3","Middenasaanhangwagen","SARIS","N/A",,"20231211",,"kipper",,"N.v.t.","N.v.t.",,,"1280","3500",,,,"20231130","20231204","Geen verstrekking in Open Data",,"N.v.t.","140","2220",,,,,,"4","563",,,"567","219","O2",,,,"3500","C2C",,,,,,,"388","Nee","Nee",,"Nee",,,,,"Niet geregistreerd","NG","Ja",,"2023-12-11T00:00:00.000","2023-11-30T00:00:00.000","2023-12-04T00:00:00.000",,"150",,,,,,,,,"212",,,,,,,,,,,"20231130","2023-11-30T00:00:00.000",,,,,"https://opendata.rdw.nl/resource/3huj-srit.json","https://opendata.rdw.nl/resource/8ys7-d773.json","https://opendata.rdw.nl/resource/vezc-m2t6.json","https://opendata.rdw.nl/resource/jhie-znh9.json","https://opendata.rdw.nl/resource/kmfi-hrps.json"
"00WBN6","Middenasaanhangwagen","CHEVAL LIBERTE","C500 PULLMAN V2",,"20210922",,"kipper",,"N.v.t.","N.v.t.",,,"670","2600",,,,"20210922","20210922","Geen verstrekking in Open Data",,"N.v.t.","140","1930",,,,,,"4","431",,,"435","192","O2",,,,"2600","CHEVAL LIBERTE",,"e1*2007/46*1008*02","AHH","RAB","0",,"328","Nee","Nee",,"Nee",,,,,"Niet geregistreerd","NG","Ja",,"2021-09-22T00:00:00.000","2021-09-22T00:00:00.000","2021-09-22T00:00:00.000",,"150",,,,,,,,,"166",,,,,,,,,,,,,,,,,"https://opendata.rdw.nl/resource/3huj-srit.json","https://opendata.rdw.nl/resource/8ys7-d773.json","https://opendata.rdw.nl/resource/vezc-m2t6.json","https://opendata.rdw.nl/resource/jhie-znh9.json","https://opendata.rdw.nl/resource/kmfi-hrps.json"
"00WBR3","Middenasaanhangwagen","HENRA AANHANGWAGENS BV","KP35",,"20211022",,"kipper",,"N.v.t.","N.v.t.",,,"1260","3500",,,,"20211022","20211022","Geen verstrekking in Open Data",,"N.v.t.","140","2240",,,,,"0","6","556","0",,"559","208","O2",,,,"3500","TR3",,"e4*2007/46*0521*09","KP35350","N/A","0",,"431","Nee","Nee",,"Nee","0","0","0.00",,"Niet geregistreerd","NG","Ja",,"2021-10-22T00:00:00.000","2021-10-22T00:00:00.000","2021-10-22T00:00:00.000",,"150",,,,,,,,,"108",,,,,,,,,,,"20211006","2021-10-06T00:00:00.000",,,,,"https://opendata.rdw.nl/resource/3huj-srit.json","https://opendata.rdw.nl/resource/8ys7-d773.json","https://opendata.rdw.nl/resource/vezc-m2t6.json","https://opendata.rdw.nl/resource/jhie-znh9.json","https://opendata.rdw.nl/resource/kmfi-hrps.json"
"00WBS2","Middenasaanhangwagen","SARIS","N/A",,"20211019",,"kipper",,"N.v.t.","N.v.t.",,,"510","1350",,,,"20211019","20211019","Geen verstrekking in Open Data",,"N.v.t.","140","840",,,,,"0","2","391","0",,"395","163","O2",,,,"1350","C1C",,"e4*2007/46*0273*07","AGKA","135","0",,"247","Nee","Nee",,"Nee","0","0","0.00",,"Niet geregistreerd","NG","Ja",,"2021-10-19T00:00:00.000","2021-10-19T00:00:00.000","2021-10-19T00:00:00.000",,"75",,,,,,,,,"104",,,,,,,,,,,"20211013","2021-10-13T00:00:00.000",,,,,"https://opendata.rdw.nl/resource/3huj-srit.json","https://opendata.rdw.nl/resource/8ys7-d773.json","https://opendata.rdw.nl/resource/vezc-m2t6.json","https://opendata.rdw.nl/resource/jhie-znh9.json","https://opendata.rdw.nl/resource/kmfi-hrps.json"
"00WBS4","Middenasaanhangwagen","SARIS","N/A",,"20231020",,"kipper",,"N.v.t.","N.v.t.",,,"761","2700",,,,"20211020","20211020","Geen verstrekking in Open Data",,"N.v.t.","140","1939",,,,,"0","4","475","0",,"479","197","O2",,,,"2700","C2C",,"e4*2007/46*0274*08","ANKA","270","0",,"351","Nee","Nee",,"Nee","0","0","0.00",,"Niet geregistreerd","NG","Ja",,"2023-10-20T00:00:00.000","2021-10-20T00:00:00.000","2021-10-20T00:00:00.000",,"100",,,,,,,,,"104",,,,,,,,,,,"20211014","2021-10-14T00:00:00.000",,,,,"https://opendata.rdw.nl/resource/3huj-srit.json","https://opendata.rdw.nl/resource/8ys7-d773.json","https://opendata.rdw.nl/resource/vezc-m2t6.json","https://opendata.rdw.nl/resource/jhie-znh9.json","https://opendata.rdw.nl/resource/kmfi-hrps.json"
"00WBT4","Middenasaanhangwagen","HAPERT","COBALT",,"20211229",,"kipper",,"N.v.t.","N.v.t.",,,"838","2700",,,,"20211229","20211229","Geen verstrekking in Open Data",,"N.v.t.","130","1862",,,,,"0","4","434","0",,"437","186","O2",,,,"2700","TA",,"e4*2007/46*0139*13","C36F","202","0",,"331","Nee","Nee",,"Nee","0","0","0.00",,"Niet geregistreerd","NG","Ja",,"2021-12-29T00:00:00.000","2021-12-29T00:00:00.000","2021-12-29T00:00:00.000",,"100",,,,,,,,,"98",,,,,,,,,,,"20211022","2021-10-22T00:00:00.000",,,,,"https://opendata.rdw.nl/resource/3huj-srit.json","https://opendata.rdw.nl/resource/8ys7-d773.json","https://opendata.rdw.nl/resource/vezc-m2t6.json","https://opendata.rdw.nl/resource/jhie-znh9.json","https://opendata.rdw.nl/resource/kmfi-hrps.json"
"00WBX5","Middenasaanhangwagen","HAPERT","COBALT",,"20211115",,"kipper",,"N.v.t.","N.v.t.",,,"824","2700",,,,"20211115","20211115","Geen verstrekking in Open Data",,"N.v.t.","130","1876",,,,,"0","4","434","0",,"437","186","O2",,,,"2700","TA",,"e4*2007/46*0139*13","C36F","202","0",,"331","Nee","Nee",,"Nee","0","0","0.00",,"Niet geregistreerd","NG","Ja",,"2021-11-15T00:00:00.000","2021-11-15T00:00:00.000","2021-11-15T00:00:00.000",,"100",,,,,,,,,"98",,,,,,,,,,,"20211110","2021-11-10T00:00:00.000",,,,,"https://opendata.rdw.nl/resource/3huj-srit.json","https://opendata.rdw.nl/resource/8ys7-d773.json","https://opendata.rdw.nl/resource/vezc-m2t6.json","https://opendata.rdw.nl/resource/jhie-znh9.json","https://opendata.rdw.nl/resource/kmfi-hrps.json"
"00WDF1","Middenasaanhangwagen","BRIAN JAMES TRAILERS","CARGO TIPPER",,"20240425",,"kipper",,"N.v.t.","N.v.t.",,,"1070","3500",,,,"20220219","20220219","Geen verstrekking in Open Data",,"N.v.t.","140","2430",,,,,"0","4","499","0",,"503","206","O2",,,,"3500","T-02-T",,"e4*2007/46*0493*11","35NCTP10","/350","0",,"366","Nee","Nee",,"Nee","0","0","0.00",,"Niet geregistreerd","NG","Ja",,"2024-04-25T00:00:00.000","2022-02-19T00:00:00.000","2022-02-19T00:00:00.000",,"150",,,,,,,,,"73",,,,,,,,,,,"20211213","2021-12-13T00:00:00.000",,,,,"https://opendata.rdw.nl/resource/3huj-srit.json","https://opendata.rdw.nl/resource/8ys7-d773.json","https://opendata.rdw.nl/resource/vezc-m2t6.json","https://opendata.rdw.nl/resource/jhie-znh9.json","https://opendata.rdw.nl/resource/kmfi-hrps.json"
"00WDF5","Middenasaanhangwagen","HAPERT","COBALT",,"20220126",,"kipper",,"N.v.t.","N.v.t.",,,"940","3000",,,,"20220126","20220126","Geen verstrekking in Open Data",,"N.v.t.","130","2060",,,,,"0","4","464","0",,"467","186","O2",,,,"3000","TA",,"e4*2007/46*0139*13","C39F","302","0",,"346","Nee","Nee",,"Nee","0","0","0.00",,"Niet geregistreerd","NG","Nee",,"2022-01-26T00:00:00.000","2022-01-26T00:00:00.000","2022-01-26T00:00:00.000",,"150",,,,,,,,,"98",,,,,,,,,,,"20211216","2021-12-16T00:00:00.000",,,,,"https://opendata.rdw.nl/resource/3huj-srit.json","https://opendata.rdw.nl/resource/8ys7-d773.json","https://opendata.rdw.nl/resource/vezc-m2t6.json","https://opendata.rdw.nl/resource/jhie-znh9.json","https://opendata.rdw.nl/resource/kmfi-hrps.json"
"00WDF7","Middenasaanhangwagen","EASYLINE","N/A",,"20211217",,"kipper",,"N.v.t.","N.v.t.",,,"455","1600",,,,"20211217","20211217","Geen verstrekking in Open Data",,"N.v.t.","130","1145",,,,,"0","2","384","0",,"387","162","O2",,,,"1600","P102",,"e4*2007/46*1183*03","KP","1500VEATS10","0",,"253","Nee","Nee",,"Nee","0","0","0.00",,"Niet geregistreerd","NG","Ja",,"2021-12-17T00:00:00.000","2021-12-17T00:00:00.000","2021-12-17T00:00:00.000",,"100",,,,,,,,,"153",,,,,,,,,,,"20211217","2021-12-17T00:00:00.000",,,,,"https://opendata.rdw.nl/resource/3huj-srit.json","https://opendata.rdw.nl/resource/8ys7-d773.json","https://opendata.rdw.nl/resource/vezc-m2t6.json","https://opendata.rdw.nl/resource/jhie-znh9.json","https://opendata.rdw.nl/resource/kmfi-hrps.json"
"00WDG5","Middenasaanhangwagen","SYMA","N/A",,"20220421",,"kipper",,"N.v.t.","N.v.t.",,,"700","2700",,,,"20220421","20220421","Geen verstrekking in Open Data",,"N.v.t.","140","2000",,,,,"0","4","451","0",,"455","192","O2",,,,"2700","SDAO2",,"e4*2007/46*0486*03","KP","2700","0",,"330","Nee","Nee",,"Nee","0","0","0.00",,"Niet geregistreerd","NG","Ja",,"2022-04-21T00:00:00.000","2022-04-21T00:00:00.000","2022-04-21T00:00:00.000",,"120",,,,,,,,,"168",,,,,,,,,,,"20220103","2022-01-03T00:00:00.000",,,,,"https://opendata.rdw.nl/resource/3huj-srit.json","https://opendata.rdw.nl/resource/8ys7-d773.json","https://opendata.rdw.nl/resource/vezc-m2t6.json","https://opendata.rdw.nl/resource/jhie-znh9.json","https://opendata.rdw.nl/resource/kmfi-hrps.json"
"00WDH7","Middenasaanhangwagen","HENRA AANHANGWAGENS BV","K1.27",,"20220118",,"kipper",,"N.v.t.","N.v.t.",,,"730","2700",,,,"20220118","20220118","Geen verstrekking in Open Data",,"N.v.t.","140","1970",,,,,"0","4","452","0",,"456","171","O2",,,,"2700","KP3",,"e4*2007/46*0522*04","K1270","N/A","0",,"331","Nee","Nee",,"Nee","0","0","0.00",,"Niet geregistreerd","NG","Ja",,"2022-01-18T00:00:00.000","2022-01-18T00:00:00.000","2022-01-18T00:00:00.000",,"100",,,,,,,,,"98",,,,,,,,,,,"20220117","2022-01-17T00:00:00.000",,,,,"https://opendata.rdw.nl/resource/3huj-srit.json","https://opendata.rdw.nl/resource/8ys7-d773.json","https://opendata.rdw.nl/resource/vezc-m2t6.json","https://opendata.rdw.nl/resource/jhie-znh9.json","https://opendata.rdw.nl/resource/kmfi-hrps.json"
"00WDL3","Middenasaanhangwagen","HAPERT","COBALT",,"20220224",,"kipper",,"N.v.t.","N.v.t.",,,"1144","3500",,,,"20220224","20220224","Geen verstrekking in Open Data",,"N.v.t.","130","2356",,,,,"0","4","508","0",,"511","186","O2",,,,"3500","TA",,"e4*2007/46*0139*13","C45F","302","0",,"370","Nee","Nee",,"Nee","0","0","0.00",,"Niet geregistreerd","NG","Ja",,"2022-02-24T00:00:00.000","2022-02-24T00:00:00.000","2022-02-24T00:00:00.000",,"150",,,,,,,,,"100",,,,,,,,,,,"20220207","2022-02-07T00:00:00.000",,,,,"https://opendata.rdw.nl/resource/3huj-srit.json","https://opendata.rdw.nl/resource/8ys7-d773.json","https://opendata.rdw.nl/resource/vezc-m2t6.json","https://opendata.rdw.nl/resource/jhie-znh9.json","https://opendata.rdw.nl/resource/kmfi-hrps.json"
"00WDN7","Middenasaanhangwagen","HAPERT","COBALT",,"20220310",,"kipper",,"N.v.t.","N.v.t.",,,"688","2700",,,,"20220310","20220310","Geen verstrekking in Open Data",,"N.v.t.","130","2012",,,,,"0","4","409","0",,"412","166","O2",,,,"2700","TA",,"e4*2007/46*0139*13","C36F","201","0",,"307","Nee","Nee",,"Nee","0","0","0.00",,"Niet geregistreerd","NG","Ja",,"2022-03-10T00:00:00.000","2022-03-10T00:00:00.000","2022-03-10T00:00:00.000",,"100",,,,,,,,,"98",,,,,,,,,,,"20220217","2022-02-17T00:00:00.000",,,,,"https://opendata.rdw.nl/resource/3huj-srit.json","https://opendata.rdw.nl/resource/8ys7-d773.json","https://opendata.rdw.nl/resource/vezc-m2t6.json","https://opendata.rdw.nl/resource/jhie-znh9.json","https://opendata.rdw.nl/resource/kmfi-hrps.json"
"00WDT6","Middenasaanhangwagen","HENRA AANHANGWAGENS BV","KP3Z.35",,"20230502",,"kipper",,"N.v.t.","N.v.t.",,,"1000","3500",,,,"20230502","20230502","Geen verstrekking in Open Data",,"N.v.t.","140","2500",,,,,"0","4","507","0",,"510","191","O2",,,,"3500","KP3",,"e4*2007/46*0522*04","KP350","N/A","0",,"362","Nee","Nee",,"Nee","0","0","0.00",,"Niet geregistreerd","NG","Ja",,"2023-05-02T00:00:00.000","2023-05-02T00:00:00.000","2023-05-02T00:00:00.000",,"100",,,,,,,,,"182",,,,,,,,,,,"20220318","2022-03-18T00:00:00.000",,,,,"https://opendata.rdw.nl/resource/3huj-srit.json","https://opendata.rdw.nl/resource/8ys7-d773.json","https://opendata.rdw.nl/resource/vezc-m2t6.json","https://opendata.rdw.nl/resource/jhie-znh9.json","https://opendata.rdw.nl/resource/kmfi-hrps.json"
"00WDT8","Middenasaanhangwagen","EDUARD","K4",,"20221229",,"kipper",,"N.v.t.","N.v.t.",,,"804","2700",,,,"20221229","20221229","Geen verstrekking in Open Data",,"N.v.t.","140","1896",,,,,"0","4","456","0",,"459","186","O2",,,,"2700","4",,"e4*2007/46*0296*11","3118-4-1EOB30-270-","63/270","0",,"334","Nee","Nee",,"Nee","0","0","0.00",,"Niet geregistreerd","NG","Ja",,"2022-12-29T00:00:00.000","2022-12-29T00:00:00.000","2022-12-29T00:00:00.000",,"120",,,,,,,,,"98",,,,,,,,,,,"20220321","2022-03-21T00:00:00.000",,"N",,,"https://opendata.rdw.nl/resource/3huj-srit.json","https://opendata.rdw.nl/resource/8ys7-d773.json","https://opendata.rdw.nl/resource/vezc-m2t6.json","https://opendata.rdw.nl/resource/jhie-znh9.json","https://opendata.rdw.nl/resource/kmfi-hrps.json"
"00WDV5","Middenasaanhangwagen","SARIS","N/A",,"20221027",,"kipper",,"N.v.t.","N.v.t.",,,"960","3500",,,,"20221027","20221027","Geen verstrekking in Open Data",,"N.v.t.","140","2540",,,,,"0","4","517","0",,"520","197","O2",,,,"3500","C2C",,"e4*2007/46*0274*08","ARKA","350","0",,"369","Nee","Nee",,"Nee","0","0","0.00",,"Niet geregistreerd","NG","Ja",,"2022-10-27T00:00:00.000","2022-10-27T00:00:00.000","2022-10-27T00:00:00.000",,"150",,,,,,,,,"110",,,,,,,,,,,"20220325","2022-03-25T00:00:00.000",,,,,"https://opendata.rdw.nl/resource/3huj-srit.json","https://opendata.rdw.nl/resource/8ys7-d773.json","https://opendata.rdw.nl/resource/vezc-m2t6.json","https://opendata.rdw.nl/resource/jhie-znh9.json","https://opendata.rdw.nl/resource/kmfi-hrps.json"
"00WDV9","Middenasaanhangwagen","HENRA AANHANGWAGENS BV","KP3Z.35",,"20220408",,"kipper",,"N.v.t.","N.v.t.",,,"960","3500",,,,"20220408","20220408","Geen verstrekking in Open Data",,"N.v.t.","140","2540",,,,,"0","4","456","0",,"460","191","O2",,,,"3500","KP3",,"e4*2007/46*0522*04","KP350","N/A","0",,"338","Nee","Nee",,"Nee","0","0","0.00",,"Niet geregistreerd","NG","Ja",,"2022-04-08T00:00:00.000","2022-04-08T00:00:00.000","2022-04-08T00:00:00.000",,"100",,,,,,,,,"190",,,,,,,,,,,"20220329","2022-03-29T00:00:00.000",,,,,"https://opendata.rdw.nl/resource/3huj-srit.json","https://opendata.rdw.nl/resource/8ys7-d773.json","https://opendata.rdw.nl/resource/vezc-m2t6.json","https://opendata.rdw.nl/resource/jhie-znh9.json","https://opendata.rdw.nl/resource/kmfi-hrps.json"
"00WDZ1","Middenasaanhangwagen","SARIS","N/A",,"20240328",,"kipper",,"N.v.t.","N.v.t.",,,"713","2700",,,,"20220607","20220607","Geen verstrekking in Open Data",,"N.v.t.","140","1987",,,,,"0","4","449","0",,"453","183","O2",,,,"2700","C2C",,"e4*2007/46*0274*08","ANKA","270","0",,"325","Nee","Nee",,"Nee","0","0","0.00",,"Niet geregistreerd","NG","Ja",,"2024-03-28T00:00:00.000","2022-06-07T00:00:00.000","2022-06-07T00:00:00.000",,"100",,,,,,,,,"104",,,,,,,,,,,"20220405","2022-04-05T00:00:00.000",,,,,"https://opendata.rdw.nl/resource/3huj-srit.json","https://opendata.rdw.nl/resource/8ys7-d773.json","https://opendata.rdw.nl/resource/vezc-m2t6.json","https://opendata.rdw.nl/resource/jhie-znh9.json","https://opendata.rdw.nl/resource/kmfi-hrps.json"
"00WFB2","Middenasaanhangwagen","HAPERT","COBALT",,"20220815",,"kipper",,"N.v.t.","N.v.t.",,,"636","2700",,,,"20220707","20220707","Geen verstrekking in Open Data",,"N.v.t.","130","2064",,,,,"0","4","434","0",,"437","166","O2",,,,"2700","TA",,"e4*2007/46*0139*13","C36F","201","0",,"320","Nee","Nee",,"Nee","0","0","0.00",,"Niet geregistreerd","NG","Ja",,"2022-08-15T00:00:00.000","2022-07-07T00:00:00.000","2022-07-07T00:00:00.000",,"100",,,,,,,,,"98",,,,,,,,,,,"20220413","2022-04-13T00:00:00.000",,,,,"https://opendata.rdw.nl/resource/3huj-srit.json","https://opendata.rdw.nl/resource/8ys7-d773.json","https://opendata.rdw.nl/resource/vezc-m2t6.json","https://opendata.rdw.nl/resource/jhie-znh9.json","https://opendata.rdw.nl/resource/kmfi-hrps.json"
"00WFG2","Middenasaanhangwagen","BW","BW",,"20220505",,"kipper",,"N.v.t.","N.v.t.",,,"930","2600",,,,"20070313","20220505","Geen verstrekking in Open Data",,"N.v.t.","100","1670",,,,,,"4","446",,,"449","194","O2",,,,"2600",,,,,,,,"79","Nee","Nee",,"Nee",,,,,"Niet geregistreerd","NG","Ja",,"2022-05-05T00:00:00.000","2007-03-13T00:00:00.000","2022-05-05T00:00:00.000",,"100",,,,,,,,,,,,,,,,,,,,"20220503","2022-05-03T00:00:00.000",,,,,"https://opendata.rdw.nl/resource/3huj-srit.json","https://opendata.rdw.nl/resource/8ys7-d773.json","https://opendata.rdw.nl/resource/vezc-m2t6.json","https://opendata.rdw.nl/resource/jhie-znh9.json","https://opendata.rdw.nl/resource/kmfi-hrps.json"
"00WFH9","Middenasaanhangwagen","HAPERT","COBALT",,"20220622",,"kipper",,"N.v.t.","N.v.t.",,,"1340","3500",,,,"20220622","20220622","Geen verstrekking in Open Data",,"N.v.t.","130","2160",,,,,"0","6","538","0",,"541","206","O2",,,,"3500","MA",,"e4*2007/46*0140*11","C45F","302","0",,"408","Nee","Nee",,"Nee","0","0","0.00",,"Niet geregistreerd","NG","Ja",,"2022-06-22T00:00:00.000","2022-06-22T00:00:00.000","2022-06-22T00:00:00.000",,"150",,,,,,,,,"110",,,,,,,,,"150",,"20220518","2022-05-18T00:00:00.000",,,,,"https://opendata.rdw.nl/resource/3huj-srit.json","https://opendata.rdw.nl/resource/8ys7-d773.json","https://opendata.rdw.nl/resource/vezc-m2t6.json","https://opendata.rdw.nl/resource/jhie-znh9.json","https://opendata.rdw.nl/resource/kmfi-hrps.json"
"00WFJ5","Middenasaanhangwagen","EDUARD","K4",,"20220524",,"kipper",,"N.v.t.","N.v.t.",,,"772","3000",,,,"20220524","20220524","Geen verstrekking in Open Data",,"N.v.t.","140","2228",,,,,"0","4","456","0",,"459","186","O2",,,,"3000","4",,"e4*2007/46*0296*12","3118-4-1EB30-300-","63/300","0",,"334","Nee","Nee",,"Nee","0","0","0.00",,"Niet geregistreerd","NG","Ja",,"2022-05-24T00:00:00.000","2022-05-24T00:00:00.000","2022-05-24T00:00:00.000",,"120",,,,,,,,,"98",,,,,,,,,"120",,"20220523","2022-05-23T00:00:00.000",,"N",,,"https://opendata.rdw.nl/resource/3huj-srit.json","https://opendata.rdw.nl/resource/8ys7-d773.json","https://opendata.rdw.nl/resource/vezc-m2t6.json","https://opendata.rdw.nl/resource/jhie-znh9.json","https://opendata.rdw.nl/resource/kmfi-hrps.json"
"00WFK7","Middenasaanhangwagen","EASYLINE","N/A",,"20231128",,"kipper",,"N.v.t.","N.v.t.",,,"690","2800",,,,"20220614","20220614","Geen verstrekking in Open Data",,"N.v.t.","130","2110",,,,,"0","4","439","0",,"442","190","O2",,,,"2800","P202",,"e4*2007/46*1184*03","KP","2700DEATS10","0",,"319","Nee","Nee",,"Nee","0","0","0.00",,"Niet geregistreerd","NG","Ja",,"2023-11-28T00:00:00.000","2022-06-14T00:00:00.000","2022-06-14T00:00:00.000",,"100",,,,,,,,,"170",,,,,,,,,"100",,"20220601","2022-06-01T00:00:00.000",,,,,"https://opendata.rdw.nl/resource/3huj-srit.json","https://opendata.rdw.nl/resource/8ys7-d773.json","https://opendata.rdw.nl/resource/vezc-m2t6.json","https://opendata.rdw.nl/resource/jhie-znh9.json","https://opendata.rdw.nl/resource/kmfi-hrps.json"