"kenteken","voertuigsoort","merk","handelsbenaming","vervaldatum_apk","datum_tenaamstelling","bruto_bpm","inrichting","aantal_zitplaatsen","eerste_kleur","tweede_kleur","aantal_cilinders","cilinderinhoud","massa_ledig_voertuig","toegestane_maximum_massa_voertuig","massa_rijklaar","maximum_massa_trekken_ongeremd","maximum_trekken_massa_geremd","datum_eerste_toelating","datum_eerste_tenaamstelling_in_nederland","wacht_op_keuren","catalogusprijs","wam_verzekerd","maximale_constructiesnelheid","laadvermogen","oplegger_geremd","aanhangwagen_autonoom_geremd","aanhangwagen_middenas_geremd","aantal_staanplaatsen","aantal_deuren","aantal_wielen","afstand_hart_koppeling_tot_achterzijde_voertuig","afstand_voorzijde_voertuig_tot_hart_koppeling","afwijkende_maximum_snelheid","lengte","breedte","europese_voertuigcategorie","europese_voertuigcategorie_toevoeging","europese_uitvoeringcategorie_toevoeging","plaats_chassisnummer","technische_max_massa_voertuig","type","type_gasinstallatie","typegoedkeuringsnummer","variant","uitvoering","volgnummer_wijziging_eu_typegoedkeuring","vermogen_massarijklaar","wielbasis","export_indicator","openstaande_terugroepactie_indicator","vervaldatum_tachograaf","taxi_indicator","maximum_massa_samenstelling","aantal_rolstoelplaatsen","maximum_ondersteunende_snelheid","jaar_laatste_registratie_tellerstand","tellerstandoordeel","code_toelichting_tellerstandoordeel","tenaamstellen_mogelijk","vervaldatum_apk_dt","datum_tenaamstelling_dt","datum_eerste_toelating_dt","datum_eerste_tenaamstelling_in_nederland_dt","vervaldatum_tachograaf_dt","maximum_last_onder_de_vooras_sen_tezamen_koppeling","type_remsysteem_voertuig_code","rupsonderstelconfiguratiecode","wielbasis_voertuig_minimum","wielbasis_voertuig_maximum","lengte_voertuig_minimum","lengte_voertuig_maximum","breedte_voertuig_minimum","breedte_voertuig_maximum","hoogte_voertuig","hoogte_voertuig_minimum","hoogte_voertuig_maximum","massa_bedrijfsklaar_minimaal","massa_bedrijfsklaar_maximaal","technisch_toelaatbaar_massa_koppelpunt","maximum_massa_technisch_maximaal","maximum_massa_technisch_minimaal","subcategorie_nederland","verticale_belasting_koppelpunt_getrokken_voertuig","zuinigheidsclassificatie","registratie_datum_goedkeuring_afschrijvingsmoment_bpm","registratie_datum_goedkeuring_afschrijvingsmoment_bpm_dt","gem_lading_wrde","aerodyn_voorz","massa_alt_aandr","verl_cab_ind","api_gekentekende_voertuigen_assen","api_gekentekende_voertuigen_brandstof","api_gekentekende_voertuigen_carrosserie","api_gekentekende_voertuigen_carrosserie_specifiek","api_gekentekende_voertuigen_voertuigklasse"
"01WFZ6","Middenasaanhangwagen","HUMBAUR","HK 254018-20P",,,,"gesloten opbouw",,"N.v.t.","N.v.t.",,,"930","2500",,,,,,"Geen verstrekking in Open Data",,"N.v.t.","100","1570",,,,,"0","4","540","0",,"543","232","O2",,,,"2500","KOFFER TA G VD RA-RI",,"e1*2007/46*0110*07","DMKAS","P1","0",,"370","Ja","Nee",,"Nee","0","0","0.00",,"Niet geregistreerd","NG","Nee",,,,,,"100",,,,,,,,,"264",,,,,,,,,"100",,"20220823","2022-08-23T00:00:00.000",,"N",,,"https://opendata.rdw.nl/resource/3huj-srit.json","https://opendata.rdw.nl/resource/8ys7-d773.json","https://opendata.rdw.nl/resource/vezc-m2t6.json","https://opendata.rdw.nl/resource/jhie-znh9.json","https://opendata.rdw.nl/resource/kmfi-hrps.json"
"03WBT3","Middenasaanhangwagen","HUMBAUR","XANTHOS",,,,"veewagen",,"N.v.t.","N.v.t.",,,"800","1800",,,,,,"Geen verstrekking in Open Data",,"N.v.t.","100","1000",,,,,"0","4","458","0",,"462","223","O2",,,,"2400","HP TA G VD",,"e1*2007/46*0068*14","1OS","M4A","0",,"362","Ja","Nee",,"Nee","0","0","0.00",,"Niet geregistreerd","NG","Nee",,,,,,"100",,,,,,,,,"288",,,,,,,,,,,"20211021","2021-10-21T00:00:00.000",,"N",,,"https://opendata.rdw.nl/resource/3huj-srit.json","https://opendata.rdw.nl/resource/8ys7-d773.json","https://opendata.rdw.nl/resource/vezc-m2t6.json","https://opendata.rdw.nl/resource/jhie-znh9.json","https://opendata.rdw.nl/resource/kmfi-hrps.json"
"04WJZF","Middenasaanhangwagen","HUMBAUR","SINGLE 1600 HG",,,,"veewagen",,"N.v.t.","N.v.t.",,,"623","1600",,,,"20140304","20140304","Geen verstrekking in Open Data",,"N.v.t.","100","977",,,,,"0","4","444","0",,"0","190","O2",,,"r. balk","1600","HP TA G VD",,"e1*2007/46*0068*01","B1AS","N/A","0",,"355","Ja","Nee",,"Nee","0","0",,,"Niet geregistreerd","NG","Nee",,,"2014-03-04T00:00:00.000","2014-03-04T00:00:00.000",,"100",,,,,,,,,,,,,,,,,,,,,,,,,,"https://opendata.rdw.nl/resource/3huj-srit.json","https://opendata.rdw.nl/resource/8ys7-d773.json","https://opendata.rdw.nl/resource/vezc-m2t6.json","https://opendata.rdw.nl/resource/jhie-znh9.json","https://opendata.rdw.nl/resource/kmfi-hrps.json"
"04WKXV","Middenasaanhangwagen","HUMBAUR","HKN 254020-20S",,,,"gesloten opbouw",,"N.v.t.","N.v.t.",,,"1216","2500",,,,"20141030","20141030","Geen verstrekking in Open Data",,"N.v.t.","100","1284",,,,,"0","4","541","0",,"0","212","O2",,,"r. balk","2500","KOFFER U TA G VD",,"e1*2007/46*0918*00","H2B2S","N/A","0",,"373","Ja","Nee",,"Nee","0","0",,,"Niet geregistreerd","NG","Nee",,,"2014-10-30T00:00:00.000","2014-10-30T00:00:00.000",,"100",,,,,,,,,,,,,,,,,,,,,,,,,,"https://opendata.rdw.nl/resource/3huj-srit.json","https://opendata.rdw.nl/resource/8ys7-d773.json","https://opendata.rdw.nl/resource/vezc-m2t6.json","https://opendata.rdw.nl/resource/jhie-znh9.json","https://opendata.rdw.nl/resource/kmfi-hrps.json"
"04WZGL","Middenasaanhangwagen","HUMBAUR","HTK 3000.31 2016",,,,"kipper",,"N.v.t.","N.v.t.",,,"870","3000",,,,,,"Geen verstrekking in Open Data",,"N.v.t.","100","2130",,,,,,"4","451",,,"455","192","O2",,,,"3000","HTK-GARANT TA G VD",,"e1*2007/46*0044*10","LF4S","W1","0",,"335","Ja","Nee",,"Nee",,,,,"Niet geregistreerd","NG","Nee",,,,,,"100",,,,,,,,,"124",,,,,,,,,,,,,,,,,"https://opendata.rdw.nl/resource/3huj-srit.json","https://opendata.rdw.nl/resource/8ys7-d773.json","https://opendata.rdw.nl/resource/vezc-m2t6.json","https://opendata.rdw.nl/resource/jhie-znh9.json","https://opendata.rdw.nl/resource/kmfi-hrps.json"
"06WJVJ","Middenasaanhangwagen","HUMBAUR","SINGLE 1600 HG",,"20240321",,"veewagen",,"N.v.t.","N.v.t.",,,"623","1600",,,,"20130309","20130309","Geen verstrekking in Open Data",,"N.v.t.","100","977",,,,,"0","4","444","0",,"0","190","O2",,,"r. balk","1600","HP TA G VD",,"e1*2007/46*0068*01","B1AS","N/A","0",,"355","Ja","Nee",,"Nee","0","0",,,"Niet geregistreerd","NG","Nee",,"2024-03-21T00:00:00.000","2013-03-09T00:00:00.000","2013-03-09T00:00:00.000",,"100",,,,,,,,,,,,,,,,,,,,,,,,,,"https://opendata.rdw.nl/resource/3huj-srit.json","https://opendata.rdw.nl/resource/8ys7-d773.json","https://opendata.rdw.nl/resource/vezc-m2t6.json","https://opendata.rdw.nl/resource/jhie-znh9.json","https://opendata.rdw.nl/resource/kmfi-hrps.json"
"06WXHK","Middenasaanhangwagen","HUMBAUR","FTK 2700",,"20240314",,"voor vervoer voertuigen",,"N.v.t.","N.v.t.",,,"630","2700",,,,"20210104","20210104","Geen verstrekking in Open Data",,"N.v.t.","100","2070",,,,,"0","4","527","0",,"531","200","O2",,,,"2700","KFZ-TRANSPORTER",,"e1*2007/46*0082*07","M1S","M2","0",,"346","Ja","Nee",,"Nee","0","0","0.00",,"Niet geregistreerd","NG","Nee",,"2024-03-14T00:00:00.000","2021-01-04T00:00:00.000","2021-01-04T00:00:00.000",,"100",,,,,,,,,"100",,,,,,,,,,,,,,,,,"https://opendata.rdw.nl/resource/3huj-srit.json","https://opendata.rdw.nl/resource/8ys7-d773.json","https://opendata.rdw.nl/resource/vezc-m2t6.json","https://opendata.rdw.nl/resource/jhie-znh9.json","https://opendata.rdw.nl/resource/kmfi-hrps.json"
"08WDK8","Middenasaanhangwagen","HUMBAUR","HKN 253218-20 PF30",,,,"gesloten opbouw",,"N.v.t.","N.v.t.",,,"650","2500",,,,"20220530","20220530","Geen verstrekking in Open Data",,"N.v.t.","100","1850",,,,,,"4","339",,,"463","210","O2",,,,"2500","KOFFER TA G VD PF HOCHL.",,"e1*2007/46*1836*02","BB1S","L1","0",,"343","Ja","Nee",,"Nee",,,,,"Niet geregistreerd","NG","Nee",,,"2022-05-30T00:00:00.000","2022-05-30T00:00:00.000",,"100",,,,,,,,,"260",,,,,,,,,,,"20220203","2022-02-03T00:00:00.000",,"N",,,"https://opendata.rdw.nl/resource/3huj-srit.json","https://opendata.rdw.nl/resource/8ys7-d773.json","https://opendata.rdw.nl/resource/vezc-m2t6.json","https://opendata.rdw.nl/resource/jhie-znh9.json","https://opendata.rdw.nl/resource/kmfi-hrps.json"
"08WFL2","Middenasaanhangwagen","HUMBAUR","HK 152513-15P",,,,"gesloten opbouw",,"N.v.t.","N.v.t.",,,"385","1500",,,,"20230504","20230504","Geen verstrekking in Open Data",,"N.v.t.","100","1115",,,,,"0","2","374","0",,"378","180","O2",,,,"1500","KOFFER EA G VD",,"e1*2007/46*0111*07","34BAS","F7","0",,"246","Ja","Nee",,"Nee","0","0","0.00",,"Niet geregistreerd","NG","Nee",,,"2023-05-04T00:00:00.000","2023-05-04T00:00:00.000",,"100",,,,,,,,,"210",,,,,,,,,"100",,"20220607","2022-06-07T00:00:00.000",,"N",,,"https://opendata.rdw.nl/resource/3huj-srit.json","https://opendata.rdw.nl/resource/8ys7-d773.json","https://opendata.rdw.nl/resource/vezc-m2t6.json","https://opendata.rdw.nl/resource/jhie-znh9.json","https://opendata.rdw.nl/resource/kmfi-hrps.json"
"08WKL3","Middenasaanhangwagen","HUMBAUR","HGK 253218-21 PF60",,,,"gecond. met temperatuurreg.",,"N.v.t.","N.v.t.",,,"800","2500",,,,,,"Geen verstrekking in Open Data",,"N.v.t.","100","1700",,,,,,"4","462",,,"466","228","O2",,,,"2500","KOFFER TA G VD PF",,"e1*2007/46*1847*03","FBS","L1","0",,"334","Ja","Nee",,"Nee",,,,,"Niet geregistreerd","NG","Nee",,,,,,"100",,,,,,,,,"266",,,,,,,,,"100",,"20240223","2024-02-23T00:00:00.000",,"N",,,"https://opendata.rdw.nl/resource/3huj-srit.json","https://opendata.rdw.nl/resource/8ys7-d773.json","https://opendata.rdw.nl/resource/vezc-m2t6.json","https://opendata.rdw.nl/resource/jhie-znh9.json","https://opendata.rdw.nl/resource/kmfi-hrps.json"
"08WNLN","Middenasaanhangwagen","HUMBAUR","XANTHOS",,,,"veewagen",,"N.v.t.","N.v.t.",,,"800","2000",,,,"20151128","20151128","Geen verstrekking in Open Data",,"N.v.t.","100","1200",,,,,"0","4","458","0",,"0","223","O2",,,"r. balk","2000","HP TA G VD",,"e1*2007/46*0068*04","1OS","I1","0",,"362","Ja","Nee",,"Nee","0","0","0.00",,"Niet geregistreerd","NG","Nee",,,"2015-11-28T00:00:00.000","2015-11-28T00:00:00.000",,"100",,,,,,,,,,,,,,,,,,,,,,,,,,"https://opendata.rdw.nl/resource/3huj-srit.json","https://opendata.rdw.nl/resource/8ys7-d773.json","https://opendata.rdw.nl/resource/vezc-m2t6.json","https://opendata.rdw.nl/resource/jhie-znh9.json","https://opendata.rdw.nl/resource/kmfi-hrps.json"
"10WDK8","Middenasaanhangwagen","HUMBAUR","HKN 253218-20 PF30",,,,"gesloten opbouw",,"N.v.t.","N.v.t.",,,"650","2500",,,,"20220530","20220530","Geen verstrekking in Open Data",,"N.v.t.","100","1850",,,,,,"4","460",,,"463","210","O2",,,,"2500","KOFFER TA G VD PF HOCHL.",,"e1*2007/46*1836*02","BB1S","L1","0",,"343","Ja","Nee",,"Nee",,,,,"Niet geregistreerd","NG","Nee",,,"2022-05-30T00:00:00.000","2022-05-30T00:00:00.000",,"100",,,,,,,,,"260",,,,,,,,,,,"20220203","2022-02-03T00:00:00.000",,"N",,,"https://opendata.rdw.nl/resource/3huj-srit.json","https://opendata.rdw.nl/resource/8ys7-d773.json","https://opendata.rdw.nl/resource/vezc-m2t6.json","https://opendata.rdw.nl/resource/jhie-znh9.json","https://opendata.rdw.nl/resource/kmfi-hrps.json"
"11WNRK","Middenasaanhangwagen","HUMBAUR","HA 102113",,,,"neerklapbare zijschotten",,"N.v.t.","N.v.t.",,,"203","1000",,,,"20160219","20160219","Geen verstrekking in Open Data",,"N.v.t.","100","797",,,,,"0","2","318","0",,"0","177","O2",,,"in bodemplaat r. v.","1000","HA EA G",,"e1*2007/46*0281*08","B2S","B1","0",,"216","Ja","Nee",,"Nee","0","0","0.00",,"Niet geregistreerd","NG","Nee",,,"2016-02-19T00:00:00.000","2016-02-19T00:00:00.000",,"75",,,,,,,,,"89",,,,,,,,,,,,,,,,,"https://opendata.rdw.nl/resource/3huj-srit.json","https://opendata.rdw.nl/resource/8ys7-d773.json","https://opendata.rdw.nl/resource/vezc-m2t6.json","https://opendata.rdw.nl/resource/jhie-znh9.json","https://opendata.rdw.nl/resource/kmfi-hrps.json"
"12WKBB","Middenasaanhangwagen","HUMBAUR","HS 253016",,,,"voor vervoer voertuigen",,"N.v.t.","N.v.t.",,,"680","2500",,,,"20130404","20130404","Geen verstrekking in Open Data",,"N.v.t.","100","1820",,,,,"0","4","485","0",,"0","214","O2",,,"r. balk","2500","HTK-GARANT TA G VD",,"e1*2007/46*0044*03","L1BS","N/A","0",,"336","Ja","Nee",,"Nee","0","0","0.00",,"Niet geregistreerd","NG","Nee",,,"2013-04-04T00:00:00.000","2013-04-04T00:00:00.000",,"100",,,,,,,,,,,,,,,,,,,,,,,,,,"https://opendata.rdw.nl/resource/3huj-srit.json","https://opendata.rdw.nl/resource/8ys7-d773.json","https://opendata.rdw.nl/resource/vezc-m2t6.json","https://opendata.rdw.nl/resource/jhie-znh9.json","https://opendata.rdw.nl/resource/kmfi-hrps.json"
"14WTJZ","Middenasaanhangwagen","HUMBAUR","HK 253015-18/20P",,,,"gesloten opbouw",,"N.v.t.","N.v.t.",,,"636","2500",,,,"20190214","20190214","Geen verstrekking in Open Data",,"N.v.t.","100","1864",,,,,"0","4","449","0",,"0","203","O2",,,,"2500","KOFFER TA G VD RA-RI",,"e1*2007/46*0110*04","DEEAS","P1","0",,"327","Ja","Nee",,"Nee","0","0","0.00",,"Niet geregistreerd","NG","Nee",,,"2019-02-14T00:00:00.000","2019-02-14T00:00:00.000",,"100",,,,,,,,,"181",,,,,,,,,,,,,,,,,"https://opendata.rdw.nl/resource/3huj-srit.json","https://opendata.rdw.nl/resource/8ys7-d773.json","https://opendata.rdw.nl/resource/vezc-m2t6.json","https://opendata.rdw.nl/resource/jhie-znh9.json","https://opendata.rdw.nl/resource/kmfi-hrps.json"
"14WZKN","Middenasaanhangwagen","HUMBAUR","HA 132513",,,,"neerklapbare zijschotten",,"N.v.t.","N.v.t.",,,"242","1300",,,,,,"Geen verstrekking in Open Data",,"N.v.t.","100","1058",,,,,,"2","376",,,"380","181","O2",,,,"1300","HA EA G",,"e1*2007/46*0281*15","C2S","K1","0",,"258","Ja","Nee",,"Nee",,,,,"Niet geregistreerd","NG","Nee",,,,,,"100",,,,,,,,,"90",,,,,,,,,,,,,,,,,"https://opendata.rdw.nl/resource/3huj-srit.json","https://opendata.rdw.nl/resource/8ys7-d773.json","https://opendata.rdw.nl/resource/vezc-m2t6.json","https://opendata.rdw.nl/resource/jhie-znh9.json","https://opendata.rdw.nl/resource/kmfi-hrps.json"
"15WFF2","Middenasaanhangwagen","HUMBAUR","XANTHOS AERO",,,,"veewagen",,"N.v.t.","N.v.t.",,,"800","2000",,,,"20220625","20220625","Geen verstrekking in Open Data",,"N.v.t.","100","1200",,,,,,"4","458",,,"462","223","O2",,,,"2000","HP TA G VD",,"e1*2007/46*0068*14","1PS","I4A","0",,"362","Ja","Nee",,"Nee",,,,,"Niet geregistreerd","NG","Nee",,,"2022-06-25T00:00:00.000","2022-06-25T00:00:00.000",,"100",,,,,,,,,"288",,,,,,,,,,,"20220428","2022-04-28T00:00:00.000",,"N",,,"https://opendata.rdw.nl/resource/3huj-srit.json","https://opendata.rdw.nl/resource/8ys7-d773.json","https://opendata.rdw.nl/resource/vezc-m2t6.json","https://opendata.rdw.nl/resource/jhie-znh9.json","https://opendata.rdw.nl/resource/kmfi-hrps.json"
"15WFL2","Middenasaanhangwagen","HUMBAUR","HTK 2700.27 2016",,,,"kipper",,"N.v.t.","N.v.t.",,,"675","2700",,,,,,"Geen verstrekking in Open Data",,"N.v.t.","100","2025",,,,,,"4","403",,,"407","167","O2",,,,"2700","HTK-GARANT TA G VD",,"e1*2007/46*0044*11","KF4S","T1","0",,"303","Ja","Nee",,"Nee",,,,,"Niet geregistreerd","NG","Nee",,,,,,"100",,,,,,,,,"123",,,,,,,,,"100",,"20220607","2022-06-07T00:00:00.000",,"N",,,"https://opendata.rdw.nl/resource/3huj-srit.json","https://opendata.rdw.nl/resource/8ys7-d773.json","https://opendata.rdw.nl/resource/vezc-m2t6.json","https://opendata.rdw.nl/resource/jhie-znh9.json","https://opendata.rdw.nl/resource/kmfi-hrps.json"
"15WHB3","Middenasaanhangwagen","HUMBAUR","XANTHOS",,,,"veewagen",,"N.v.t.","N.v.t.",,,"800","2400",,,,,,"Geen verstrekking in Open Data",,"N.v.t.","100","1600",,,,,"0","4","458","0",,"462","223","O2",,,,"2400","HP TA G VD",,"e1*2007/46*0068*14","1OS","M4A","0",,"362","Ja","Nee",,"Nee","0","0","0.00",,"Niet geregistreerd","NG","Nee",,,,,,"100",,,,,,,,,"288",,,,,,,,,"100",,"20230215","2023-02-15T00:00:00.000",,"N",,,"https://opendata.rdw.nl/resource/3huj-srit.json","https://opendata.rdw.nl/resource/8ys7-d773.json","https://opendata.rdw.nl/resource/vezc-m2t6.json","https://opendata.rdw.nl/resource/jhie-znh9.json","https://opendata.rdw.nl/resource/kmfi-hrps.json"
"16WXZJ","Middenasaanhangwagen","HUMBAUR","XANTHOS",,,,"veewagen",,"N.v.t.","N.v.t.",,,"800","2400",,,,"20201224","20201224","Geen verstrekking in Open Data",,"N.v.t.","100","1600",,,,,"0","4","458","0",,"462","223","O2",,,,"2400","HP TA G VD",,"e1*2007/46*0068*12","1OS","M4A","0",,"362","Ja","Nee",,"Nee","0","0","0.00",,"Niet geregistreerd","NG","Nee",,,"2020-12-24T00:00:00.000","2020-12-24T00:00:00.000",,"100",,,,,,,,,"289",,,,,,,,,,,,,,,,,"https://opendata.rdw.nl/resource/3huj-srit.json","https://opendata.rdw.nl/resource/8ys7-d773.json","https://opendata.rdw.nl/resource/vezc-m2t6.json","https://opendata.rdw.nl/resource/jhie-znh9.json","https://opendata.rdw.nl/resource/kmfi-hrps.json"
"18WVPK","Middenasaanhangwagen","HUMBAUR","HKT 183117 S KOFFER",,,,"gesloten opbouw",,"N.v.t.","N.v.t.",,,"655","1800",,,,,,"Geen verstrekking in Open Data",,"N.v.t.","100","1145",,,,,"0","2","456","0",,"460","246","O2",,,,"1800","HUK EA G VD",,"e1*2007/46*0142*09","P4DS","R6","0",,"276","Ja","Nee",,"Nee","0","0","0.00",,"Niet geregistreerd","NG","Nee",,,,,,"100",,,,,,,,,"238",,,,,,,,,,,,,,,,,"https://opendata.rdw.nl/resource/3huj-srit.json","https://opendata.rdw.nl/resource/8ys7-d773.json","https://opendata.rdw.nl/resource/vezc-m2t6.json","https://opendata.rdw.nl/resource/jhie-znh9.json","https://opendata.rdw.nl/resource/kmfi-hrps.json"
"18WZVZ","Middenasaanhangwagen","HUMBAUR","SINGLE 2015",,,,"veewagen",,"N.v.t.","N.v.t.",,,"690","1600",,,,,,"Geen verstrekking in Open Data",,"N.v.t.","100","910",,,,,"0","4","441","0",,"445","180","O2",,,,"1600","HP TA G VD",,"e1*2007/46*0068*13","9US","E5A","0",,"351","Ja","Nee",,"Nee","0","0","0.00",,"Niet geregistreerd","NG","Nee",,,,,,"100",,,,,,,,,"270",,,,,,,,,,,,,,,,,"https://opendata.rdw.nl/resource/3huj-srit.json","https://opendata.rdw.nl/resource/8ys7-d773.json","https://opendata.rdw.nl/resource/vezc-m2t6.json","https://opendata.rdw.nl/resource/jhie-znh9.json","https://opendata.rdw.nl/resource/kmfi-hrps.json"
"19WGL2","Middenasaanhangwagen","HUMBAUR","HM 102113",,,,"voor vervoer voertuigen",,"N.v.t.","N.v.t.",,,"211","1000",,,,,,"Geen verstrekking in Open Data",,"N.v.t.","100","789",,,,,,"2","316",,,"319","176","O2",,,,"1000","HA EA G",,"e1*2007/46*0281*15","X4S","E1","0",,"217","Ja","Nee",,"Nee",,,,,"Niet geregistreerd","NG","Nee",,,,,,"100",,,,,,,,,"99",,,,,,,,,"100",,"20221107","2022-11-07T00:00:00.000",,"N",,,"https://opendata.rdw.nl/resource/3huj-srit.json","https://opendata.rdw.nl/resource/8ys7-d773.json","https://opendata.rdw.nl/resource/vezc-m2t6.json","https://opendata.rdw.nl/resource/jhie-znh9.json","https://opendata.rdw.nl/resource/kmfi-hrps.json"
"19WKRF","Middenasaanhangwagen","HUMBAUR","XANTHOS MIT POLYBUG",,,,"veewagen",,"N.v.t.","N.v.t.",,,"804","2400",,,,"20150410","20150410","Geen verstrekking in Open Data",,"N.v.t.","100","1596",,,,,"0","4","458","0",,"0","223","O2",,,"r. balk","2400","HP TA G VD",,"e1*2007/46*0068*03","1PS","F1","0",,"362","Ja","Nee",,"Nee","0","0",,,"Niet geregistreerd","NG","Nee",,,"2015-04-10T00:00:00.000","2015-04-10T00:00:00.000",,"100",,,,,,,,,,,,,,,,,,,,,,,,,,"https://opendata.rdw.nl/resource/3huj-srit.json","https://opendata.rdw.nl/resource/8ys7-d773.json","https://opendata.rdw.nl/resource/vezc-m2t6.json","https://opendata.rdw.nl/resource/jhie-znh9.json","https://opendata.rdw.nl/resource/kmfi-hrps.json"
"20WZKN","Middenasaanhangwagen","HUMBAUR","HKPA 263217",,,,"voor vervoer voertuigen",,"N.v.t.","N.v.t.",,,"640","2600",,,,"20211103","20211103","Geen verstrekking in Open Data",,"N.v.t.","100","1960",,,,,,"4","451",,,"455","230","O2",,,,"2600","KFZ-TRANSPORTER",,"e1*2007/46*0082*08","W1S","L2","0",,"346","Ja","Nee",,"Nee",,,,,"Niet geregistreerd","NG","Nee",,,"2021-11-03T00:00:00.000","2021-11-03T00:00:00.000",,"100",,,,,,,,,"239",,,,,,,,,,,,,,,,,"https://opendata.rdw.nl/resource/3huj-srit.json","https://opendata.rdw.nl/resource/8ys7-d773.json","https://opendata.rdw.nl/resource/vezc-m2t6.json","https://opendata.rdw.nl/resource/jhie-znh9.json","https://opendata.rdw.nl/resource/kmfi-hrps.json"
"23WGD3","Middenasaanhangwagen","HUMBAUR","SINGLE 2015",,,,"veewagen",,"N.v.t.","N.v.t.",,,"690","1600",,,,,,"Geen verstrekking in Open Data",,"N.v.t.","100","910",,,,,"0","4","452","0",,"456","183","O2",,,,"1600","HP TA G VD",,"e1*2007/46*0068*14","9US","E5A","0",,"355","Ja","Nee",,"Nee","0","0","0.00",,"Niet geregistreerd","NG","Nee",,,,,,"100",,,,,,,,,"289",,,,,,,,,"100",,"20220909","2022-09-09T00:00:00.000",,"N",,,"https://opendata.rdw.nl/resource/3huj-srit.json","https://opendata.rdw.nl/resource/8ys7-d773.json","https://opendata.rdw.nl/resource/vezc-m2t6.json","https://opendata.rdw.nl/resource/jhie-znh9.json","https://opendata.rdw.nl/resource/kmfi-hrps.json"
"23WHN9","Middenasaanhangwagen","HUMBAUR","SINGLE 2015",,,,"veewagen",,"N.v.t.","N.v.t.",,,"690","1600",,,,,,"Geen verstrekking in Open Data",,"N.v.t.","100","910",,,,,"0","4","452","0",,"456","183","O2",,,,"1600","HP TA G VD",,"e1*2007/46*0068*14","9US","E5A","0",,"355","Ja","Nee",,"Nee","0","0","0.00",,"Niet geregistreerd","NG","Nee",,,,,,"100",,,,,,,,,"289",,,,,,,,,"100",,"20230501","2023-05-01T00:00:00.000",,"N",,,"https://opendata.rdw.nl/resource/3huj-srit.json","https://opendata.rdw.nl/resource/8ys7-d773.json","https://opendata.rdw.nl/resource/vezc-m2t6.json","https://opendata.rdw.nl/resource/jhie-znh9.json","https://opendata.rdw.nl/resource/kmfi-hrps.json"
"24WTFG","Middenasaanhangwagen","HUMBAUR","XANTHOS AERO",,,,"veewagen",,"N.v.t.","N.v.t.",,,"800","2000",,,,"20181211","20181211","Geen verstrekking in Open Data",,"N.v.t.","100","1200",,,,,"0","4","458","0",,"0","223","O2",,,,"2000","HP TA G VD",,"e1*2007/46*0068*12","1PS","I4A","0",,"362","Ja","Nee",,"Nee","0","0","0.00",,"Niet geregistreerd","NG","Nee",,,"2018-12-11T00:00:00.000","2018-12-11T00:00:00.000",,"100",,,,,,,,,,,,,,,,,,,,,,,,,,"https://opendata.rdw.nl/resource/3huj-srit.json","https://opendata.rdw.nl/resource/8ys7-d773.json","https://opendata.rdw.nl/resource/vezc-m2t6.json","https://opendata.rdw.nl/resource/jhie-znh9.json","https://opendata.rdw.nl/resource/kmfi-hrps.json"
"25WHR7","Middenasaanhangwagen","HUMBAUR","HA 132513",,,,"neerklapbare zijschotten",,"N.v.t.","N.v.t.",,,"242","1300",,,,"20230807","20230807","Geen verstrekking in Open Data",,"N.v.t.","100","1058",,,,,,"2","376",,,"380","181","O2",,,,"1300","HA EA G",,"e1*2007/46*0281*15","C2S","K1","0",,"258","Ja","Nee",,"Nee",,,,,"Niet geregistreerd","NG","Nee",,,"2023-08-07T00:00:00.000","2023-08-07T00:00:00.000",,"100",,,,,,,,,"90",,,,,,,,,"100",,"20230515","2023-05-15T00:00:00.000",,"N",,,"https://opendata.rdw.nl/resource/3huj-srit.json","https://opendata.rdw.nl/resource/8ys7-d773.json","https://opendata.rdw.nl/resource/vezc-m2t6.json","https://opendata.rdw.nl/resource/jhie-znh9.json","https://opendata.rdw.nl/resource/kmfi-hrps.json"
"26WDB7","Middenasaanhangwagen","HUMBAUR","HK 254018-20P",,,,"gesloten opbouw",,"N.v.t.","N.v.t.",,,"930","2500",,,,,,"Geen verstrekking in Open Data",,"N.v.t.","100","1570",,,,,"0","4","540","0",,"543","232","O2",,,,"2500","KOFFER TA G VD RA-RI",,"e1*2007/46*0110*07","DMKAS","P1","0",,"370","Ja","Nee",,"Nee","0","0","0.00",,"Niet geregistreerd","NG","Nee",,,,,,"100",,,,,,,,,"264",,,,,,,,,,,"20211201","2021-12-01T00:00:00.000",,"N",,,"https://opendata.rdw.nl/resource/3huj-srit.json","https://opendata.rdw.nl/resource/8ys7-d773.json","https://opendata.rdw.nl/resource/vezc-m2t6.json","https://opendata.rdw.nl/resource/jhie-znh9.json","https://opendata.rdw.nl/resource/kmfi-hrps.json"