"kenteken","voertuigsoort","merk","handelsbenaming","vervaldatum_apk","datum_tenaamstelling","bruto_bpm","inrichting","aantal_zitplaatsen","eerste_kleur","tweede_kleur","aantal_cilinders","cilinderinhoud","massa_ledig_voertuig","toegestane_maximum_massa_voertuig","massa_rijklaar","maximum_massa_trekken_ongeremd","maximum_trekken_massa_geremd","datum_eerste_toelating","datum_eerste_tenaamstelling_in_nederland","wacht_op_keuren","catalogusprijs","wam_verzekerd","maximale_constructiesnelheid","laadvermogen","oplegger_geremd","aanhangwagen_autonoom_geremd","aanhangwagen_middenas_geremd","aantal_staanplaatsen","aantal_deuren","aantal_wielen","afstand_hart_koppeling_tot_achterzijde_voertuig","afstand_voorzijde_voertuig_tot_hart_koppeling","afwijkende_maximum_snelheid","lengte","breedte","europese_voertuigcategorie","europese_voertuigcategorie_toevoeging","europese_uitvoeringcategorie_toevoeging","plaats_chassisnummer","technische_max_massa_voertuig","type","type_gasinstallatie","typegoedkeuringsnummer","variant","uitvoering","volgnummer_wijziging_eu_typegoedkeuring","vermogen_massarijklaar","wielbasis","export_indicator","openstaande_terugroepactie_indicator","vervaldatum_tachograaf","taxi_indicator","maximum_massa_samenstelling","aantal_rolstoelplaatsen","maximum_ondersteunende_snelheid","jaar_laatste_registratie_tellerstand","tellerstandoordeel","code_toelichting_tellerstandoordeel","tenaamstellen_mogelijk","vervaldatum_apk_dt","datum_tenaamstelling_dt","datum_eerste_toelating_dt","datum_eerste_tenaamstelling_in_nederland_dt","vervaldatum_tachograaf_dt","maximum_last_onder_de_vooras_sen_tezamen_koppeling","type_remsysteem_voertuig_code","rupsonderstelconfiguratiecode","wielbasis_voertuig_minimum","wielbasis_voertuig_maximum","lengte_voertuig_minimum","lengte_voertuig_maximum","breedte_voertuig_minimum","breedte_voertuig_maximum","hoogte_voertuig","hoogte_voertuig_minimum","hoogte_voertuig_maximum","massa_bedrijfsklaar_minimaal","massa_bedrijfsklaar_maximaal","technisch_toelaatbaar_massa_koppelpunt","maximum_massa_technisch_maximaal","maximum_massa_technisch_minimaal","subcategorie_nederland","verticale_belasting_koppelpunt_getrokken_voertuig","zuinigheidsclassificatie","registratie_datum_goedkeuring_afschrijvingsmoment_bpm","registratie_datum_goedkeuring_afschrijvingsmoment_bpm_dt","gem_lading_wrde","aerodyn_voorz","massa_alt_aandr","verl_cab_ind","api_gekentekende_voertuigen_assen","api_gekentekende_voertuigen_brandstof","api_gekentekende_voertuigen_carrosserie","api_gekentekende_voertuigen_carrosserie_specifiek","api_gekentekende_voertuigen_voertuigklasse"
"15BJL3","Bedrijfsauto","FUSO","CANTER",,,,"kipper","3","N.v.t.","N.v.t.","4","2998","4570","8550","4670","750",,"20170426","20170426","Geen verstrekking in Open Data",,"Ja",,"3980",,"3500","3500",,,"4",,"576",,"595","220","N2",,,"r. balk by vooras","8550","FE4P10TF1N2",,,,,,"0.03","340","Ja","Nee","20230309","Nee","12050",,,,"Niet geregistreerd","NG","Nee",,,"2017-04-26T00:00:00.000","2017-04-26T00:00:00.000","2023-03-09T00:00:00.000","0",,,,,,,,,,,,,,,,,,,,,,,,,,"https://opendata.rdw.nl/resource/3huj-srit.json","https://opendata.rdw.nl/resource/8ys7-d773.json","https://opendata.rdw.nl/resource/vezc-m2t6.json","https://opendata.rdw.nl/resource/jhie-znh9.json","https://opendata.rdw.nl/resource/kmfi-hrps.json"
"7VZZ56","Bedrijfsauto","FUSO","CANTER","20231215",,"8680","kipper","3","N.v.t.","N.v.t.","4","2998","2330","3500","2430","750",,"20121211","20121211","Geen verstrekking in Open Data","35663","Nee",,"1170",,"3500","3500",,,"4",,,,,"180","N1",,,"r. balk by vooras","3500","FE4P10-01",,,,,,"0.04","250","Ja","Ja",,"Nee","7000",,,"2023","Logisch","00","Nee","2023-12-15T00:00:00.000",,"2012-12-11T00:00:00.000","2012-12-11T00:00:00.000",,"0",,,,,,,,,,,,,,,,,,,,,,,,,,"https://opendata.rdw.nl/resource/3huj-srit.json","https://opendata.rdw.nl/resource/8ys7-d773.json","https://opendata.rdw.nl/resource/vezc-m2t6.json","https://opendata.rdw.nl/resource/jhie-znh9.json","https://opendata.rdw.nl/resource/kmfi-hrps.json"
"82BTP4","Bedrijfsauto","FUSO","CANTER","20231110",,,"kipper","3","N.v.t.","N.v.t.","4","2998","5873","7490","5973","750",,"20151211","20221112","Geen verstrekking in Open Data",,"Nee","130","1617",,"3500","3500",,,"6",,"615",,"635","220","N2",,,"r. balk by vooras","7490","FE4P10TF1N2",,,,,,"0.02","340","Ja","Ja","20241110","Nee","10990",,,,"Niet geregistreerd","NG","Nee","2023-11-10T00:00:00.000",,"2015-12-11T00:00:00.000","2022-11-12T00:00:00.000","2024-11-10T00:00:00.000",,,,,,,,,,"220",,,,,,,,,,,"20221104","2022-11-04T00:00:00.000",,,,,"https://opendata.rdw.nl/resource/3huj-srit.json","https://opendata.rdw.nl/resource/8ys7-d773.json","https://opendata.rdw.nl/resource/vezc-m2t6.json","https://opendata.rdw.nl/resource/jhie-znh9.json","https://opendata.rdw.nl/resource/kmfi-hrps.json"
"VB969K","Bedrijfsauto","FUSO","CANTER","20240214","20240419","9768","kipper","3","N.v.t.","N.v.t.","4","2998","2830","3500","2930","750",,"20130117","20130117","Geen verstrekking in Open Data","40242","Ja",,"670",,"3500","3500",,,"4",,,,,"176","N1",,,"r. balk by vooras","3500","FE4P10-01",,,,,,"0.04","250","Ja","Ja",,"Nee","7000",,,"2024","Logisch","00","Nee","2024-02-14T00:00:00.000","2024-04-19T00:00:00.000","2013-01-17T00:00:00.000","2013-01-17T00:00:00.000",,"0",,,,,,,,,,,,,,,,,,,,,,,,,,"https://opendata.rdw.nl/resource/3huj-srit.json","https://opendata.rdw.nl/resource/8ys7-d773.json","https://opendata.rdw.nl/resource/vezc-m2t6.json","https://opendata.rdw.nl/resource/jhie-znh9.json","https://opendata.rdw.nl/resource/kmfi-hrps.json"
"VF497Z","Bedrijfsauto","FUSO","CANTER","20230807",,"8395","kipper","3","N.v.t.","N.v.t.","4","2998","2435","3500","2535","750",,"20131014","20131014","Geen verstrekking in Open Data","35667","Nee",,"1065",,"3500","3500",,,"4",,,,,"178","N1",,,"r. balk by vooras","3500","FE4P10-01",,,,,,"0.04","250","Ja","Ja",,"Nee","7000",,,"2022","Logisch","00","Nee","2023-08-07T00:00:00.000",,"2013-10-14T00:00:00.000","2013-10-14T00:00:00.000",,"0",,,,,,,,,,,,,,,,,,,,,,,,,,"https://opendata.rdw.nl/resource/3huj-srit.json","https://opendata.rdw.nl/resource/8ys7-d773.json","https://opendata.rdw.nl/resource/vezc-m2t6.json","https://opendata.rdw.nl/resource/jhie-znh9.json","https://opendata.rdw.nl/resource/kmfi-hrps.json"
"VF502Z","Bedrijfsauto","FUSO","CANTER","20221014",,"8395","kipper","3","N.v.t.","N.v.t.","4","2998","2435","3500","2535","750",,"20131014","20131014","Geen verstrekking in Open Data","35667","Nee",,"1065",,"3500","3500",,,"4",,,,,"178","N1",,,"r. balk by vooras","3500","FE4P10-01",,,,,,"0.04","250","Ja","Ja",,"Nee","7000",,,"2022","Logisch","00","Nee","2022-10-14T00:00:00.000",,"2013-10-14T00:00:00.000","2013-10-14T00:00:00.000",,"0",,,,,,,,,,,,,,,,,,,,,,,,,,"https://opendata.rdw.nl/resource/3huj-srit.json","https://opendata.rdw.nl/resource/8ys7-d773.json","https://opendata.rdw.nl/resource/vezc-m2t6.json","https://opendata.rdw.nl/resource/jhie-znh9.json","https://opendata.rdw.nl/resource/kmfi-hrps.json"
"VF506Z","Bedrijfsauto","FUSO","CANTER","20221014",,"8395","kipper","3","N.v.t.","N.v.t.","4","2998","2435","3500","2535","750",,"20131014","20131014","Geen verstrekking in Open Data","35667","Nee",,"1065",,"3500","3500",,,"4",,,,,"178","N1",,,"r. balk by vooras","3500","FE4P10-01",,,,,,"0.04","250","Ja","Ja",,"Nee","7000",,,"2022","Logisch","00","Nee","2022-10-14T00:00:00.000",,"2013-10-14T00:00:00.000","2013-10-14T00:00:00.000",,"0",,,,,,,,,,,,,,,,,,,,,,,,,,"https://opendata.rdw.nl/resource/3huj-srit.json","https://opendata.rdw.nl/resource/8ys7-d773.json","https://opendata.rdw.nl/resource/vezc-m2t6.json","https://opendata.rdw.nl/resource/jhie-znh9.json","https://opendata.rdw.nl/resource/kmfi-hrps.json"
"VG353B","Bedrijfsauto","FUSO","CANTER","20230612",,"9654","kipper","3","N.v.t.","N.v.t.","4","2998","2280","3500","2380","750",,"20131017","20131017","Geen verstrekking in Open Data","39765","Nee",,"1220",,"3500","3500",,,"4",,,,,"180","N1",,,"r. balk by vooras","3500","FE4P10-01",,,,,,"0.04","250","Ja","Ja",,"Nee","7000",,,"2023","Logisch","00","Nee","2023-06-12T00:00:00.000",,"2013-10-17T00:00:00.000","2013-10-17T00:00:00.000",,"0",,,,,,,,,,,,,,,,,,,,,,,,,,"https://opendata.rdw.nl/resource/3huj-srit.json","https://opendata.rdw.nl/resource/8ys7-d773.json","https://opendata.rdw.nl/resource/vezc-m2t6.json","https://opendata.rdw.nl/resource/jhie-znh9.json","https://opendata.rdw.nl/resource/kmfi-hrps.json"
"VJ225N","Bedrijfsauto","FUSO","CANTER","20230627",,"10161","kipper","3","N.v.t.","N.v.t.","4","2998","2765","3500","2865","750",,"20140627","20140627","Geen verstrekking in Open Data","41898","Nee",,"735",,"3500","3500",,,"4",,,,,"187","N1",,,"r. balk by vooras","3500","FE4P10TF1N1",,,,,,"0.03","250","Ja","Nee",,"Nee","7000",,,"2023","Onlogisch","04","Nee","2023-06-27T00:00:00.000",,"2014-06-27T00:00:00.000","2014-06-27T00:00:00.000",,"0",,,,,,,,,,,,,,,,,,,,,,,,,,"https://opendata.rdw.nl/resource/3huj-srit.json","https://opendata.rdw.nl/resource/8ys7-d773.json","https://opendata.rdw.nl/resource/vezc-m2t6.json","https://opendata.rdw.nl/resource/jhie-znh9.json","https://opendata.rdw.nl/resource/kmfi-hrps.json"
"VK970V","Bedrijfsauto","FUSO","CANTER","20231106",,"9866","kipper","3","N.v.t.","N.v.t.","4","2998","2300","3500","2400","750",,"20141106","20141106","Geen verstrekking in Open Data","40655","Nee",,"1200",,"3500","3500",,,"4",,,,,"179","N1",,,"r. balk by vooras","3500","FE4P10TF1N1",,,,,,"0.04","250","Ja","Nee",,"Nee","7000",,,"2023","Logisch","00","Nee","2023-11-06T00:00:00.000",,"2014-11-06T00:00:00.000","2014-11-06T00:00:00.000",,"0",,,,,,,,,,,,,,,,,,,,,,,,,,"https://opendata.rdw.nl/resource/3huj-srit.json","https://opendata.rdw.nl/resource/8ys7-d773.json","https://opendata.rdw.nl/resource/vezc-m2t6.json","https://opendata.rdw.nl/resource/jhie-znh9.json","https://opendata.rdw.nl/resource/kmfi-hrps.json"
"VL991S","Bedrijfsauto","FUSO","CANTER","20250123","20240531","11656","kipper","3","N.v.t.","N.v.t.","4","2998","2695","3500","2795","750",,"20150123","20150123","Geen verstrekking in Open Data","36535","Nee",,"805",,"3500","3500",,,"4",,,,,"192","N1",,,"r. balk by vooras","3500","FE4P10TF1N1",,,,,,"0.03","250","Ja","Ja",,"Nee","7000",,,"2024","Logisch","00","Nee","2025-01-23T00:00:00.000","2024-05-31T00:00:00.000","2015-01-23T00:00:00.000","2015-01-23T00:00:00.000",,"0",,,,,,,,,,,,,,,,,,,,,,,,,,"https://opendata.rdw.nl/resource/3huj-srit.json","https://opendata.rdw.nl/resource/8ys7-d773.json","https://opendata.rdw.nl/resource/vezc-m2t6.json","https://opendata.rdw.nl/resource/jhie-znh9.json","https://opendata.rdw.nl/resource/kmfi-hrps.json"
"VN791L","Bedrijfsauto","FUSO","CANTER","20240406",,"9961","kipper","3","N.v.t.","N.v.t.","4","2998","2290","3500","2390","750",,"20150325","20150325","Geen verstrekking in Open Data","41055","Nee",,"1210",,"3500","3500",,,"4",,,,,"177","N1",,,"r. balk by vooras","3500","FE4P10TF1N1",,,,,,"0.04","250","Ja","Nee",,"Nee","7000",,,"2023","Logisch","00","Nee","2024-04-06T00:00:00.000",,"2015-03-25T00:00:00.000","2015-03-25T00:00:00.000",,"0",,,,,,,,,,,,,,,,,,,,,,,,,,"https://opendata.rdw.nl/resource/3huj-srit.json","https://opendata.rdw.nl/resource/8ys7-d773.json","https://opendata.rdw.nl/resource/vezc-m2t6.json","https://opendata.rdw.nl/resource/jhie-znh9.json","https://opendata.rdw.nl/resource/kmfi-hrps.json"
"VP938V","Bedrijfsauto","FUSO","CANTER","20230716",,"10413","kipper","3","N.v.t.","N.v.t.","4","2998","2375","3500","2475","750",,"20150716","20150716","Geen verstrekking in Open Data","42961","Nee",,"1125",,"3500","3500",,,"4",,,,,"182","N1",,,"r. balk by vooras","3500","FE4P10TF1N1",,,,,,"0.04","250","Ja","Nee",,"Nee","7000",,,"2023","Logisch","00","Nee","2023-07-16T00:00:00.000",,"2015-07-16T00:00:00.000","2015-07-16T00:00:00.000",,"0",,,,,,,,,,,,,,,,,,,,,,,,,,"https://opendata.rdw.nl/resource/3huj-srit.json","https://opendata.rdw.nl/resource/8ys7-d773.json","https://opendata.rdw.nl/resource/vezc-m2t6.json","https://opendata.rdw.nl/resource/jhie-znh9.json","https://opendata.rdw.nl/resource/kmfi-hrps.json"
"VR177D","Bedrijfsauto","FUSO","CANTER","20240315",,"10772","kipper","5","N.v.t.","N.v.t.","4","2998","2779","3500","2879","750",,"20110422","20160322","Geen verstrekking in Open Data","44471","Nee",,"721",,"3500","3500",,,"4",,,,,"204","N1",,,"r. balk a. vooras","3500",,,,,,,"0.03","337","Ja","Ja",,"Nee","7000",,,"2023","Geen oordeel","05","Nee","2024-03-15T00:00:00.000",,"2011-04-22T00:00:00.000","2016-03-22T00:00:00.000",,"0",,,,,,,,,,,,,,,,,,,,,,,,,,"https://opendata.rdw.nl/resource/3huj-srit.json","https://opendata.rdw.nl/resource/8ys7-d773.json","https://opendata.rdw.nl/resource/vezc-m2t6.json","https://opendata.rdw.nl/resource/jhie-znh9.json","https://opendata.rdw.nl/resource/kmfi-hrps.json"
"VT865R","Bedrijfsauto","FUSO","CANTER","20240402","20231129","11534","kipper","3","N.v.t.","N.v.t.","4","2998","3051","3500","3151","750",,"20160224","20160224","Geen verstrekking in Open Data","47679","Ja",,"449",,"3500","3500",,,"4",,,,,"206","N1",,,"r. balk by vooras","3500","FE4P10TF1N1",,,,,,"0.03","280","Ja","Nee",,"Nee","7000",,,"2024","Onlogisch","04","Nee","2024-04-02T00:00:00.000","2023-11-29T00:00:00.000","2016-02-24T00:00:00.000","2016-02-24T00:00:00.000",,"0",,,,,,,,,,,,,,,,,,,,,,,,,,"https://opendata.rdw.nl/resource/3huj-srit.json","https://opendata.rdw.nl/resource/8ys7-d773.json","https://opendata.rdw.nl/resource/vezc-m2t6.json","https://opendata.rdw.nl/resource/jhie-znh9.json","https://opendata.rdw.nl/resource/kmfi-hrps.json"
"VL975S","Bedrijfsauto","FUSO","CANTER","20250123","20240531","11656","kipper","3","N.v.t.","N.v.t.","4","2998","2695","3500","2795","750",,"20150123","20150123","Geen verstrekking in Open Data","36535","Nee",,"805",,"3500","3500",,,"4",,,,,"192","N1",,,"r. balk by vooras","3500","FE4P10TF1N1",,,,,,"0.03","250","Ja","Ja",,"Nee","7000",,,"2024","Logisch","00","Nee","2025-01-23T00:00:00.000","2024-05-31T00:00:00.000","2015-01-23T00:00:00.000","2015-01-23T00:00:00.000",,"0",,,,,,,,,,,,,,,,,,,,,,,,,,"https://opendata.rdw.nl/resource/3huj-srit.json","https://opendata.rdw.nl/resource/8ys7-d773.json","https://opendata.rdw.nl/resource/vezc-m2t6.json","https://opendata.rdw.nl/resource/jhie-znh9.json","https://opendata.rdw.nl/resource/kmfi-hrps.json"
"48BBS2","Bedrijfsauto","FUSO","CANTER","20240509","20240405",,"kipper","3","N.v.t.","N.v.t.","4","2998","3465","7500","3565","750",,"20120215","20130415","Geen verstrekking in Open Data",,"Ja",,"4035",,"3500","3500",,,"4",,"540",,"550","222","N2",,,"r. balk v. vooras","7500","FE4P10-02",,,,,,"0.03","280","Ja","Ja","20250615","Nee","11000",,,,"Niet geregistreerd","NG","Nee","2024-05-09T00:00:00.000","2024-04-05T00:00:00.000","2012-02-15T00:00:00.000","2013-04-15T00:00:00.000","2025-06-15T00:00:00.000","0",,,,,,,,,,,,,,,,,,,,,,,,,,"https://opendata.rdw.nl/resource/3huj-srit.json","https://opendata.rdw.nl/resource/8ys7-d773.json","https://opendata.rdw.nl/resource/vezc-m2t6.json","https://opendata.rdw.nl/resource/jhie-znh9.json","https://opendata.rdw.nl/resource/kmfi-hrps.json"
"VL976S","Bedrijfsauto","FUSO","CANTER","20250123","20240531","11656","kipper","3","N.v.t.","N.v.t.","4","2998","2695","3500","2795","750",,"20150123","20150123","Geen verstrekking in Open Data","48192","Nee",,"805",,"3500","3500",,,"4",,,,,"192","N1",,,"r. balk by vooras","3500","FE4P10TF1N1",,,,,,"0.03","250","Ja","Ja",,"Nee","7000",,,"2024","Logisch","00","Nee","2025-01-23T00:00:00.000","2024-05-31T00:00:00.000","2015-01-23T00:00:00.000","2015-01-23T00:00:00.000",,"0",,,,,,,,,,,,,,,,,,,,,,,,,,"https://opendata.rdw.nl/resource/3huj-srit.json","https://opendata.rdw.nl/resource/8ys7-d773.json","https://opendata.rdw.nl/resource/vezc-m2t6.json","https://opendata.rdw.nl/resource/jhie-znh9.json","https://opendata.rdw.nl/resource/kmfi-hrps.json"
