"kenteken","voertuigsoort","merk","handelsbenaming","vervaldatum_apk","datum_tenaamstelling","bruto_bpm","inrichting","aantal_zitplaatsen","eerste_kleur","tweede_kleur","aantal_cilinders","cilinderinhoud","massa_ledig_voertuig","toegestane_maximum_massa_voertuig","massa_rijklaar","maximum_massa_trekken_ongeremd","maximum_trekken_massa_geremd","datum_eerste_toelating","datum_eerste_tenaamstelling_in_nederland","wacht_op_keuren","catalogusprijs","wam_verzekerd","maximale_constructiesnelheid","laadvermogen","oplegger_geremd","aanhangwagen_autonoom_geremd","aanhangwagen_middenas_geremd","aantal_staanplaatsen","aantal_deuren","aantal_wielen","afstand_hart_koppeling_tot_achterzijde_voertuig","afstand_voorzijde_voertuig_tot_hart_koppeling","afwijkende_maximum_snelheid","lengte","breedte","europese_voertuigcategorie","europese_voertuigcategorie_toevoeging","europese_uitvoeringcategorie_toevoeging","plaats_chassisnummer","technische_max_massa_voertuig","type","type_gasinstallatie","typegoedkeuringsnummer","variant","uitvoering","volgnummer_wijziging_eu_typegoedkeuring","vermogen_massarijklaar","wielbasis","export_indicator","openstaande_terugroepactie_indicator","vervaldatum_tachograaf","taxi_indicator","maximum_massa_samenstelling","aantal_rolstoelplaatsen","maximum_ondersteunende_snelheid","jaar_laatste_registratie_tellerstand","tellerstandoordeel","code_toelichting_tellerstandoordeel","tenaamstellen_mogelijk","vervaldatum_apk_dt","datum_tenaamstelling_dt","datum_eerste_toelating_dt","datum_eerste_tenaamstelling_in_nederland_dt","vervaldatum_tachograaf_dt","maximum_last_onder_de_vooras_sen_tezamen_koppeling","type_remsysteem_voertuig_code","rupsonderstelconfiguratiecode","wielbasis_voertuig_minimum","wielbasis_voertuig_maximum","lengte_voertuig_minimum","lengte_voertuig_maximum","breedte_voertuig_minimum","breedte_voertuig_maximum","hoogte_voertuig","hoogte_voertuig_minimum","hoogte_voertuig_maximum","massa_bedrijfsklaar_minimaal","massa_bedrijfsklaar_maximaal","technisch_toelaatbaar_massa_koppelpunt","maximum_massa_technisch_maximaal","maximum_massa_technisch_minimaal","subcategorie_nederland","verticale_belasting_koppelpunt_getrokken_voertuig","zuinigheidsclassificatie","registratie_datum_goedkeuring_afschrijvingsmoment_bpm","registratie_datum_goedkeuring_afschrijvingsmoment_bpm_dt","gem_lading_wrde","aerodyn_voorz","massa_alt_aandr","verl_cab_ind","api_gekentekende_voertuigen_assen","api_gekentekende_voertuigen_brandstof","api_gekentekende_voertuigen_carrosserie","api_gekentekende_voertuigen_carrosserie_specifiek","api_gekentekende_voertuigen_voertuigklasse"
"1TLG11","Personenauto","CAPRON","T 447","20250512","20140410","11161","kampeerwagen","4","WIT","Niet geregistreerd","4","2287","2830","3495","2930","750","2000","20140410","20140410","Geen verstrekking in Open Data","63338","Ja",,,,,,,"3","4","0","0",,"743","0","M1",,,"r.","3495","EG/CF 002",,"e1*2001/116*0535*07","FTS8FE","M4GI0G04CAE017","0","0.03","404","Nee","Nee",,"Nee","5495","0","0.00","2024","Logisch","00","Ja","2025-05-12T00:00:00.000","2014-04-10T00:00:00.000","2014-04-10T00:00:00.000","2014-04-10T00:00:00.000",,,,,,,,,,,,,,,,,,,,,,,,,,,,"https://opendata.rdw.nl/resource/3huj-srit.json","https://opendata.rdw.nl/resource/8ys7-d773.json","https://opendata.rdw.nl/resource/vezc-m2t6.json","https://opendata.rdw.nl/resource/jhie-znh9.json","https://opendata.rdw.nl/resource/kmfi-hrps.json"
"3ZSX23","Personenauto","CAPRON","T 447","20241106","20171213","11872","kampeerwagen","4","WIT","Niet geregistreerd","4","2287","2830","3495","2930","750","2000","20150327","20150327","Geen verstrekking in Open Data","65328","Ja",,,,,,,"3","4","0","0",,"743","0","M1",,,"r.","3495","EG/CF 002",,"e1*2001/116*0535*08","FTS8FF","M4GI0004CAF017","0","0.03","404","Nee","Nee",,"Nee","5495","0","0.00","2023","Logisch","00","Ja","2024-11-06T00:00:00.000","2017-12-13T00:00:00.000","2015-03-27T00:00:00.000","2015-03-27T00:00:00.000",,,,,,,,,,,,,,,,,,,,,,,,,,,,"https://opendata.rdw.nl/resource/3huj-srit.json","https://opendata.rdw.nl/resource/8ys7-d773.json","https://opendata.rdw.nl/resource/vezc-m2t6.json","https://opendata.rdw.nl/resource/jhie-znh9.json","https://opendata.rdw.nl/resource/kmfi-hrps.json"
"5THT22","Personenauto","CAPRON","T 447","20250527","20140225","11048","kampeerwagen","4","WIT","Niet geregistreerd","4","2287","2830","3495","2930","750","2000","20140225","20140225","Geen verstrekking in Open Data","61306","Ja",,,,,,,"3","4","0","0",,"743","0","M1",,,"r.","3495","EG/CF 002",,"e1*2001/116*0535*06","FTS8FE","M4GI0G04CAE017","0","0.03","404","Nee","Nee",,"Nee","5495","0","0.00","2024","Logisch","00","Ja","2025-05-27T00:00:00.000","2014-02-25T00:00:00.000","2014-02-25T00:00:00.000","2014-02-25T00:00:00.000",,,,,,,,,,,,,,,,,,,,,,,,,,,,"https://opendata.rdw.nl/resource/3huj-srit.json","https://opendata.rdw.nl/resource/8ys7-d773.json","https://opendata.rdw.nl/resource/vezc-m2t6.json","https://opendata.rdw.nl/resource/jhie-znh9.json","https://opendata.rdw.nl/resource/kmfi-hrps.json"
"6ZNN73","Personenauto","CAPRON","T 447","20250331","20150221","11420","kampeerwagen","4","WIT","Niet geregistreerd","4","2287","2830","3495","2930","750","2000","20150221","20150221","Geen verstrekking in Open Data","63974","Ja",,,,,,,"3","4","0","0",,"743","0","M1",,,"r.","3495","EG/CF 002",,"e1*2001/116*0535*08","FTS8FE","M4GI0004CAF017","0","0.03","404","Nee","Nee",,"Nee","5495","0","0.00","2024","Logisch","00","Ja","2025-03-31T00:00:00.000","2015-02-21T00:00:00.000","2015-02-21T00:00:00.000","2015-02-21T00:00:00.000",,,,,,,,,,,,,,,,,,,,,,,,,,,,"https://opendata.rdw.nl/resource/3huj-srit.json","https://opendata.rdw.nl/resource/8ys7-d773.json","https://opendata.rdw.nl/resource/vezc-m2t6.json","https://opendata.rdw.nl/resource/jhie-znh9.json","https://opendata.rdw.nl/resource/kmfi-hrps.json"
"7TLR68","Personenauto","CAPRON","T 447","20250401","20200410","11331","kampeerwagen","4","WIT","Niet geregistreerd","4","2287","2830","3495","2930","750","2000","20140326","20140326","Geen verstrekking in Open Data","62868","Ja",,,,,,,"3","4","0","0",,"743","0","M1",,,"r.","3495","EG/CF 002",,"e1*2001/116*0535*06","FTS8FE","M4GI0G04CAE017","0","0.03","404","Nee","Nee",,"Nee","5495","0","0.00","2024","Logisch","00","Ja","2025-04-01T00:00:00.000","2020-04-10T00:00:00.000","2014-03-26T00:00:00.000","2014-03-26T00:00:00.000",,,,,,,,,,,,,,,,,,,,,,,,,,,,"https://opendata.rdw.nl/resource/3huj-srit.json","https://opendata.rdw.nl/resource/8ys7-d773.json","https://opendata.rdw.nl/resource/vezc-m2t6.json","https://opendata.rdw.nl/resource/jhie-znh9.json","https://opendata.rdw.nl/resource/kmfi-hrps.json"
"8SNB92","Personenauto","CAPRON","T 447","20241115","20131115","12613","kampeerwagen","4","WIT","Niet geregistreerd","4","2999","2770","3495","2870","750","2000","20131115","20131115","Geen verstrekking in Open Data","68685","Ja",,,,,,,"3","4","0","0",,"743","0","M1",,,"r.","3495","EG/CF 002",,"e1*2001/116*0535*04","FTM9FF","M4GI0G04CAD014","0","0.05","404","Nee","Nee",,"Nee","5495","0","0.00","2023","Logisch","00","Ja","2024-11-15T00:00:00.000","2013-11-15T00:00:00.000","2013-11-15T00:00:00.000","2013-11-15T00:00:00.000",,,,,,,,,,,,,,,,,,,,,,,,,,,,"https://opendata.rdw.nl/resource/3huj-srit.json","https://opendata.rdw.nl/resource/8ys7-d773.json","https://opendata.rdw.nl/resource/vezc-m2t6.json","https://opendata.rdw.nl/resource/jhie-znh9.json","https://opendata.rdw.nl/resource/kmfi-hrps.json"
"8TPF57","Personenauto","CAPRON","T 447","20211205","20181211","11161","kampeerwagen","4","WIT","Niet geregistreerd","4","2287","2830","3495","2930","750","2000","20140417","20140417","Geen verstrekking in Open Data","60688","Ja",,,,,,,"3","4","0","0",,"743","0","M1",,,"r.","3495","EG/CF 002",,"e1*2001/116*0535*06","FTS8FE","M4GI0G04CAE017","0","0.03","404","Nee","Nee",,"Nee","5495","0","0.00","2020","Logisch","00","Ja","2021-12-05T00:00:00.000","2018-12-11T00:00:00.000","2014-04-17T00:00:00.000","2014-04-17T00:00:00.000",,,,,,,,,,,,,,,,,,,,,,,,,,,,"https://opendata.rdw.nl/resource/3huj-srit.json","https://opendata.rdw.nl/resource/8ys7-d773.json","https://opendata.rdw.nl/resource/vezc-m2t6.json","https://opendata.rdw.nl/resource/jhie-znh9.json","https://opendata.rdw.nl/resource/kmfi-hrps.json"
"8ZPJ92","Personenauto","CAPRON","T 447","20250521","20150307","11927","kampeerwagen","4","WIT","Niet geregistreerd","4","2287","2830","3495","2930","750","2000","20150307","20150307","Geen verstrekking in Open Data","67675","Ja",,,,,,,"3","4","0","0",,"743","0","M1",,,"r.","3495","EG/CF 002",,"e1*2001/116*0535*08","FTS8FF","M4GI0004CAF017","0","0.03","404","Nee","Nee",,"Nee","5495","0","0.00","2024","Logisch","00","Ja","2025-05-21T00:00:00.000","2015-03-07T00:00:00.000","2015-03-07T00:00:00.000","2015-03-07T00:00:00.000",,,,,,,,,,,,,,,,,,,,,,,,,,,,"https://opendata.rdw.nl/resource/3huj-srit.json","https://opendata.rdw.nl/resource/8ys7-d773.json","https://opendata.rdw.nl/resource/vezc-m2t6.json","https://opendata.rdw.nl/resource/jhie-znh9.json","https://opendata.rdw.nl/resource/kmfi-hrps.json"
"9KFZ29","Personenauto","CAPRON","T 447","20250406","20180223","10879","kampeerwagen","4","WIT","Niet geregistreerd","4","2287","2770","3495","2870","750","2000","20130405","20130405","Geen verstrekking in Open Data","57964","Ja",,,,,,,"3","4","0","0",,"743","0","M1",,,"r.","3495","EG/CF 002",,"e1*2001/116*0535*04","FTF8FE","M4GI0G04CAD014","0","0.03","404","Nee","Nee",,"Nee","5495","0","0.00","2024","Logisch","00","Ja","2025-04-06T00:00:00.000","2018-02-23T00:00:00.000","2013-04-05T00:00:00.000","2013-04-05T00:00:00.000",,,,,,,,,,,,,,,,,,,,,,,,,,,,"https://opendata.rdw.nl/resource/3huj-srit.json","https://opendata.rdw.nl/resource/8ys7-d773.json","https://opendata.rdw.nl/resource/vezc-m2t6.json","https://opendata.rdw.nl/resource/jhie-znh9.json","https://opendata.rdw.nl/resource/kmfi-hrps.json"
"9SJZ98","Personenauto","CAPRON","T 447","20250524","20131014","10966","kampeerwagen","4","WIT","Niet geregistreerd","4","2287","2770","3495","2870","750","2000","20130321","20131014","Geen verstrekking in Open Data",,"Ja",,,,,,,"3","4","0","0",,"743","0","M1",,,"r.","3495","EG/CF 002",,"e1*2001/116*0535*04","FTF9FE","M4GI0G04CAD014","0","0.04","404","Nee","Nee",,"Nee","5495","0","0.00","2024","Geen oordeel","05","Ja","2025-05-24T00:00:00.000","2013-10-14T00:00:00.000","2013-03-21T00:00:00.000","2013-10-14T00:00:00.000",,"0",,,,,,,,,,,,,,,,,,,,,,,,,,"https://opendata.rdw.nl/resource/3huj-srit.json","https://opendata.rdw.nl/resource/8ys7-d773.json","https://opendata.rdw.nl/resource/vezc-m2t6.json","https://opendata.rdw.nl/resource/jhie-znh9.json","https://opendata.rdw.nl/resource/kmfi-hrps.json"
"G170FX","Personenauto","CAPRON","T 447","20250423","20200620","11210","kampeerwagen","5","WIT","Niet geregistreerd","4","2287","2860","3495","2960","750","2000","20140627","20190912","Geen verstrekking in Open Data","46327","Ja",,,,,,,"3","4",,,,"743","233","M1",,,"r.","3495","EG/CF 002",,,,,,"0.04","404","Nee","Nee",,"Nee","5495",,,"2024","Geen oordeel","05","Ja","2025-04-23T00:00:00.000","2020-06-20T00:00:00.000","2014-06-27T00:00:00.000","2019-09-12T00:00:00.000",,,,,,,,,,,"291",,,,,,,,,,,"20220317","2022-03-17T00:00:00.000",,,,,"https://opendata.rdw.nl/resource/3huj-srit.json","https://opendata.rdw.nl/resource/8ys7-d773.json","https://opendata.rdw.nl/resource/vezc-m2t6.json","https://opendata.rdw.nl/resource/jhie-znh9.json","https://opendata.rdw.nl/resource/kmfi-hrps.json"
"G682JH","Personenauto","CAPRON","T 447","20240719","20210810","10790","kampeerwagen","5","WIT","Niet geregistreerd","4","2287","2845","3495","2945","750","2000","20150430","20190930","Geen verstrekking in Open Data","44550","Ja","134",,,,,,"3","4","0","0",,"743","233","M1",,,"r.","3495","EG/CF 002",,"e1*2001/116*0535*08","FTS8FE","M4GI0005CAF017","0","0.03","404","Nee","Nee",,"Nee","5495","0","0.00","2023","Geen oordeel","05","Ja","2024-07-19T00:00:00.000","2021-08-10T00:00:00.000","2015-04-30T00:00:00.000","2019-09-30T00:00:00.000",,,,,,,,,,,"291",,,,,,,,,,,,,,,,,"https://opendata.rdw.nl/resource/3huj-srit.json","https://opendata.rdw.nl/resource/8ys7-d773.json","https://opendata.rdw.nl/resource/vezc-m2t6.json","https://opendata.rdw.nl/resource/jhie-znh9.json","https://opendata.rdw.nl/resource/kmfi-hrps.json"
"GB333G","Personenauto","CAPRON","T 447","20250528","20200812","12362","kampeerwagen","4","WIT","Niet geregistreerd","4","2287","2830","3495","2930","750","2000","20150504","20150504","Geen verstrekking in Open Data","67530","Ja",,,,,,,"3","4","0","0",,"743","0","M1",,,"r.","3495","EG/CF 002",,"e1*2001/116*0535*08","FTS9FF","M4GI0004CAF017","0","0.04","404","Nee","Nee",,"Nee","5495","0","0.00","2024","Logisch","00","Ja","2025-05-28T00:00:00.000","2020-08-12T00:00:00.000","2015-05-04T00:00:00.000","2015-05-04T00:00:00.000",,,,,,,,,,,,,,,,,,,,,,,,,,,,"https://opendata.rdw.nl/resource/3huj-srit.json","https://opendata.rdw.nl/resource/8ys7-d773.json","https://opendata.rdw.nl/resource/vezc-m2t6.json","https://opendata.rdw.nl/resource/jhie-znh9.json","https://opendata.rdw.nl/resource/kmfi-hrps.json"
"GD353D","Personenauto","CAPRON","T 68/T 447/T 742","20250517","20231103","5389","kampeerwagen","5","WIT","Niet geregistreerd","4","2287","2845","3495","2945","750","2000","20140801","20150413","Geen verstrekking in Open Data",,"Ja",,,,,,,"3","4",,,,,,"M1",,,"r. voorwielscherm by voorzitting","3495",,,,,,,"0.03","403","Nee","Nee",,"Nee","5495",,,"2024","Geen oordeel","05","Ja","2025-05-17T00:00:00.000","2023-11-03T00:00:00.000","2014-08-01T00:00:00.000","2015-04-13T00:00:00.000",,,,,,,,,,,,,,,,,,,,,,,,,,,,"https://opendata.rdw.nl/resource/3huj-srit.json","https://opendata.rdw.nl/resource/8ys7-d773.json","https://opendata.rdw.nl/resource/vezc-m2t6.json","https://opendata.rdw.nl/resource/jhie-znh9.json","https://opendata.rdw.nl/resource/kmfi-hrps.json"
"GF508V","Personenauto","CAPRON","T 447","20240714","20150508","11420","kampeerwagen","4","WIT","Niet geregistreerd","4","2287","2830","3495","2930","750","2000","20150508","20150508","Geen verstrekking in Open Data","62610","Ja",,,,,,,"3","4","0","0",,"743","0","M1",,,"r.","3495","EG/CF 002",,"e1*2001/116*0535*08","FTS8FE","M4GI0004CAF017","0","0.03","404","Nee","Nee",,"Nee","5495","0","0.00","2023","Logisch","00","Ja","2024-07-14T00:00:00.000","2015-05-08T00:00:00.000","2015-05-08T00:00:00.000","2015-05-08T00:00:00.000",,,,,,,,,,,,,,,,,,,,,,,,,,,,"https://opendata.rdw.nl/resource/3huj-srit.json","https://opendata.rdw.nl/resource/8ys7-d773.json","https://opendata.rdw.nl/resource/vezc-m2t6.json","https://opendata.rdw.nl/resource/jhie-znh9.json","https://opendata.rdw.nl/resource/kmfi-hrps.json"
"GF724K","Personenauto","CAPRON","T 447","20250205","20220128","11168","kampeerwagen","4","WIT","Niet geregistreerd","4","2287","2830","3850","2930","750","1900","20150205","20150428","Geen verstrekking in Open Data",,"Ja",,,,,,,"3","4",,,,,,"M1",,,"r.","3850",,,,,,,"0.03","404","Nee","Nee",,"Nee","5750",,,"2024","Geen oordeel","05","Ja","2025-02-05T00:00:00.000","2022-01-28T00:00:00.000","2015-02-05T00:00:00.000","2015-04-28T00:00:00.000",,,,,,,,,,,,,,,,,,,,,,,,,,,,"https://opendata.rdw.nl/resource/3huj-srit.json","https://opendata.rdw.nl/resource/8ys7-d773.json","https://opendata.rdw.nl/resource/vezc-m2t6.json","https://opendata.rdw.nl/resource/jhie-znh9.json","https://opendata.rdw.nl/resource/kmfi-hrps.json"
"GJ608R","Personenauto","CAPRON","T 447","20250605","20170601","10940","kampeerwagen","4","WIT","Niet geregistreerd","4","2287","2830","3495","2930","750","2000","20150605","20150605","Geen verstrekking in Open Data",,"Ja",,,,,,,"3","4","0","0",,"743","0","M1",,,"r.","3495","EG/CF 002",,"e1*2001/116*0535*08","FTS8FE","M4GI0004CAF017","0","0.03","404","Nee","Nee",,"Nee","5495","0","0.00","2024","Logisch","00","Ja","2025-06-05T00:00:00.000","2017-06-01T00:00:00.000","2015-06-05T00:00:00.000","2015-06-05T00:00:00.000",,,,,,,,,,,,,,,,,,,,,,,,,,,,"https://opendata.rdw.nl/resource/3huj-srit.json","https://opendata.rdw.nl/resource/8ys7-d773.json","https://opendata.rdw.nl/resource/vezc-m2t6.json","https://opendata.rdw.nl/resource/jhie-znh9.json","https://opendata.rdw.nl/resource/kmfi-hrps.json"
"GP606S","Personenauto","CAPRON","T 447","20241031","20231124","8510","kampeerwagen","4","WIT","Niet geregistreerd","4","1956","2770","3495","2870","750","2000","20130523","20150718","Geen verstrekking in Open Data",,"Ja",,,,,,,"3","4",,,,,,"M1",,,"r. voorwielscherm","3495",,,,,,,"0.03","404","Nee","Nee",,"Nee",,,,"2024","Onlogisch","04","Ja","2024-10-31T00:00:00.000","2023-11-24T00:00:00.000","2013-05-23T00:00:00.000","2015-07-18T00:00:00.000",,,,,,,,,,,,,,,,,,,,,,,,,,,,"https://opendata.rdw.nl/resource/3huj-srit.json","https://opendata.rdw.nl/resource/8ys7-d773.json","https://opendata.rdw.nl/resource/vezc-m2t6.json","https://opendata.rdw.nl/resource/jhie-znh9.json","https://opendata.rdw.nl/resource/kmfi-hrps.json"
"GP988G","Personenauto","CAPRON","T 447","20240519","20170422","10583","kampeerwagen","4","WIT","Niet geregistreerd","4","2287","2770","3495","2870","750","2000","20130502","20170422","Geen verstrekking in Open Data",,"Ja",,,,,,,"3","4","0","0",,"743","0","M1",,,"r. voorwielscherm by voorzitting","3495","EG/CF 002",,"e1*2001/116*0535*04","FTF9FE","M4GI0G04CAD014","0","0.04","404","Nee","Nee",,"Nee","5495","0","0.00","2023","Geen oordeel","05","Ja","2024-05-19T00:00:00.000","2017-04-22T00:00:00.000","2013-05-02T00:00:00.000","2017-04-22T00:00:00.000",,,,,,,,,,,,,,,,,,,,,,,,,,,,"https://opendata.rdw.nl/resource/3huj-srit.json","https://opendata.rdw.nl/resource/8ys7-d773.json","https://opendata.rdw.nl/resource/vezc-m2t6.json","https://opendata.rdw.nl/resource/jhie-znh9.json","https://opendata.rdw.nl/resource/kmfi-hrps.json"
"H235HN","Personenauto","CAPRON","T 447","20250403","20230408","12920","kampeerwagen","4","WIT","Niet geregistreerd","4","2287","2795","3495","2895","750","2000","20180711","20200207","Geen verstrekking in Open Data","53516","Ja","140",,,,,,"3","4","0","0",,"743","233","M1",,,"r.","3495","EG/CF 002",,"e1*2001/116*0535*14","FTN2FF","M4GI0I44CAJ017","0","0.04","404","Nee","Nee",,"Nee","5495","0","0.00","2024","Geen oordeel","05","Ja","2025-04-03T00:00:00.000","2023-04-08T00:00:00.000","2018-07-11T00:00:00.000","2020-02-07T00:00:00.000",,,,,,,,,,,,,,,,,,,,,,,,,,,,"https://opendata.rdw.nl/resource/3huj-srit.json","https://opendata.rdw.nl/resource/8ys7-d773.json","https://opendata.rdw.nl/resource/vezc-m2t6.json","https://opendata.rdw.nl/resource/jhie-znh9.json","https://opendata.rdw.nl/resource/kmfi-hrps.json"
"HZ886N","Personenauto","CAPRON","T 447","20240822","20170901","10206","kampeerwagen","4","WIT","Niet geregistreerd","4","2287","2830","3495","2930","750","2000","20140321","20170901","Geen verstrekking in Open Data",,"Ja",,,,,,,"3","4","0","0",,"743","0","M1",,,"r.","3495","EG/CF 002",,"e1*2001/116*0535*06","FTS8FE","M4GI0G04CAE017","0","0.03","404","Nee","Nee",,"Nee","5495","0","0.00","2023","Geen oordeel","05","Ja","2024-08-22T00:00:00.000","2017-09-01T00:00:00.000","2014-03-21T00:00:00.000","2017-09-01T00:00:00.000",,,,,,,,,,,,,,,,,,,,,,,,,,,,"https://opendata.rdw.nl/resource/3huj-srit.json","https://opendata.rdw.nl/resource/8ys7-d773.json","https://opendata.rdw.nl/resource/vezc-m2t6.json","https://opendata.rdw.nl/resource/jhie-znh9.json","https://opendata.rdw.nl/resource/kmfi-hrps.json"
"J642JH","Personenauto","CAPRON","T 447","20250228","20221228","9658","kampeerwagen","5","WIT","Niet geregistreerd","4","2287","3000","3495","3100","750","2000","20141002","20200814","Geen verstrekking in Open Data","39789","Ja","134",,,,,,"3","4",,,,,,"M1",,,,"3495","EG/CF002",,,,,,"0.03","404","Nee","Nee",,"Nee","5495",,,"2024","Geen oordeel","05","Ja","2025-02-28T00:00:00.000","2022-12-28T00:00:00.000","2014-10-02T00:00:00.000","2020-08-14T00:00:00.000",,,,,,,,,,,,,,,,,,,,,,,,,,,,"https://opendata.rdw.nl/resource/3huj-srit.json","https://opendata.rdw.nl/resource/8ys7-d773.json","https://opendata.rdw.nl/resource/vezc-m2t6.json","https://opendata.rdw.nl/resource/jhie-znh9.json","https://opendata.rdw.nl/resource/kmfi-hrps.json"
"J652DT","Personenauto","CAPRON","T 447","20250505","20211208","10902","kampeerwagen","4","WIT","Niet geregistreerd","4","2287","2845","3495","2945","750","2000","20150813","20200707","Geen verstrekking in Open Data","45017","Ja","134",,,,,,"3","4","0","0",,"743","233","M1",,,"r.","3495","EG/CF 002",,"e1*2001/116*0535*08","FTS8FE","M4GI0004CAF017","0","0.03","404","Nee","Nee",,"Nee","5495","0","0.00","2024","Geen oordeel","05","Ja","2025-05-05T00:00:00.000","2021-12-08T00:00:00.000","2015-08-13T00:00:00.000","2020-07-07T00:00:00.000",,,,,,,,,,,"291",,,,,,,,,,,,,,,,,"https://opendata.rdw.nl/resource/3huj-srit.json","https://opendata.rdw.nl/resource/8ys7-d773.json","https://opendata.rdw.nl/resource/vezc-m2t6.json","https://opendata.rdw.nl/resource/jhie-znh9.json","https://opendata.rdw.nl/resource/kmfi-hrps.json"
"J696BT","Personenauto","CAPRON","T 447","20250430","20200707","10582","kampeerwagen","4","WIT","Niet geregistreerd","4","2287","2845","3495","2945","750","2000","20150428","20200707","Geen verstrekking in Open Data","43669","Ja","134",,,,,,"3","4","0","0",,"743","233","M1",,,"r.","3495","EG/CF 002",,"e1*2001/116*0535*08","FTS8FE","M4GI0004CAF017","0","0.03","404","Nee","Nee",,"Nee","5495","0","0.00","2024","Onlogisch","04","Ja","2025-04-30T00:00:00.000","2020-07-07T00:00:00.000","2015-04-28T00:00:00.000","2020-07-07T00:00:00.000",,,,,,,,,,,"291",,,,,,,,,,,,,,,,,"https://opendata.rdw.nl/resource/3huj-srit.json","https://opendata.rdw.nl/resource/8ys7-d773.json","https://opendata.rdw.nl/resource/vezc-m2t6.json","https://opendata.rdw.nl/resource/jhie-znh9.json","https://opendata.rdw.nl/resource/kmfi-hrps.json"
"J759JT","Personenauto","CAPRON","T 447","20241003","20221005","11828","kampeerwagen","4","WIT","Niet geregistreerd","4","2287","2795","3500","2895","750","1900","20191205","20200825","Geen verstrekking in Open Data","48914","Ja",,,,,,,"3","4","0","0",,"743","233","M1",,,"r.","3850","EG/CF 002",,"e1*2001/116*0535*14","FTN1FE","M4LL0I44CAJ017","0","0.03","404","Nee","Nee",,"Nee","5750","0","0.00","2023","Geen oordeel","05","Ja","2024-10-03T00:00:00.000","2022-10-05T00:00:00.000","2019-12-05T00:00:00.000","2020-08-25T00:00:00.000",,,,,,,,,,,,,,,,,,,,,,,,,,,,"https://opendata.rdw.nl/resource/3huj-srit.json","https://opendata.rdw.nl/resource/8ys7-d773.json","https://opendata.rdw.nl/resource/vezc-m2t6.json","https://opendata.rdw.nl/resource/jhie-znh9.json","https://opendata.rdw.nl/resource/kmfi-hrps.json"
"JD707T","Personenauto","CAPRON","T 447","20240804","20160301","11363","kampeerwagen","4","GEEL","WIT","4","2287","2845","3495","2945","750","2000","20160301","20160301","Geen verstrekking in Open Data","62158","Ja",,,,,,,"3","4","0","0",,"743","233","M1",,,"op r. balk","3495","EG/CF002",,"e1*2001/116*0535*08","FTS8FE","M4GI0004CAF017","0","0.03","404","Nee","Nee",,"Nee","5495","0","0.00","2024","Logisch","00","Ja","2024-08-04T00:00:00.000","2016-03-01T00:00:00.000","2016-03-01T00:00:00.000","2016-03-01T00:00:00.000",,,,,,,,,,,"291",,,,,,,,,,,,,,,,,"https://opendata.rdw.nl/resource/3huj-srit.json","https://opendata.rdw.nl/resource/8ys7-d773.json","https://opendata.rdw.nl/resource/vezc-m2t6.json","https://opendata.rdw.nl/resource/jhie-znh9.json","https://opendata.rdw.nl/resource/kmfi-hrps.json"