"kenteken","voertuigsoort","merk","handelsbenaming","vervaldatum_apk","datum_tenaamstelling","bruto_bpm","inrichting","aantal_zitplaatsen","eerste_kleur","tweede_kleur","aantal_cilinders","cilinderinhoud","massa_ledig_voertuig","toegestane_maximum_massa_voertuig","massa_rijklaar","maximum_massa_trekken_ongeremd","maximum_trekken_massa_geremd","datum_eerste_toelating","datum_eerste_tenaamstelling_in_nederland","wacht_op_keuren","catalogusprijs","wam_verzekerd","maximale_constructiesnelheid","laadvermogen","oplegger_geremd","aanhangwagen_autonoom_geremd","aanhangwagen_middenas_geremd","aantal_staanplaatsen","aantal_deuren","aantal_wielen","afstand_hart_koppeling_tot_achterzijde_voertuig","afstand_voorzijde_voertuig_tot_hart_koppeling","afwijkende_maximum_snelheid","lengte","breedte","europese_voertuigcategorie","europese_voertuigcategorie_toevoeging","europese_uitvoeringcategorie_toevoeging","plaats_chassisnummer","technische_max_massa_voertuig","type","type_gasinstallatie","typegoedkeuringsnummer","variant","uitvoering","volgnummer_wijziging_eu_typegoedkeuring","vermogen_massarijklaar","wielbasis","export_indicator","openstaande_terugroepactie_indicator","vervaldatum_tachograaf","taxi_indicator","maximum_massa_samenstelling","aantal_rolstoelplaatsen","maximum_ondersteunende_snelheid","jaar_laatste_registratie_tellerstand","tellerstandoordeel","code_toelichting_tellerstandoordeel","tenaamstellen_mogelijk","vervaldatum_apk_dt","datum_tenaamstelling_dt","datum_eerste_toelating_dt","datum_eerste_tenaamstelling_in_nederland_dt","vervaldatum_tachograaf_dt","maximum_last_onder_de_vooras_sen_tezamen_koppeling","type_remsysteem_voertuig_code","rupsonderstelconfiguratiecode","wielbasis_voertuig_minimum","wielbasis_voertuig_maximum","lengte_voertuig_minimum","lengte_voertuig_maximum","breedte_voertuig_minimum","breedte_voertuig_maximum","hoogte_voertuig","hoogte_voertuig_minimum","hoogte_voertuig_maximum","massa_bedrijfsklaar_minimaal","massa_bedrijfsklaar_maximaal","technisch_toelaatbaar_massa_koppelpunt","maximum_massa_technisch_maximaal","maximum_massa_technisch_minimaal","subcategorie_nederland","verticale_belasting_koppelpunt_getrokken_voertuig","zuinigheidsclassificatie","registratie_datum_goedkeuring_afschrijvingsmoment_bpm","registratie_datum_goedkeuring_afschrijvingsmoment_bpm_dt","gem_lading_wrde","aerodyn_voorz","massa_alt_aandr","verl_cab_ind","api_gekentekende_voertuigen_assen","api_gekentekende_voertuigen_brandstof","api_gekentekende_voertuigen_carrosserie","api_gekentekende_voertuigen_carrosserie_specifiek","api_gekentekende_voertuigen_voertuigklasse"
"6VXP49","Bedrijfsauto","TOYOTA","TOYOTA LAND CRUISER (200 SERIES)","20250217","20181217","29286","opleggertrekker","2","N.v.t.","N.v.t.","8","4461","2613","3350","2713","750",,"20130123","20130123","Geen verstrekking in Open Data","120869","Ja",,,"2810","3500","3500",,,"4",,,,,"197","N1",,,"r. balk a. vooras","3350",,,,,,,"0.07","285","Nee","Nee",,"Nee","6800",,,"2024","Logisch","00","Ja","2025-02-17T00:00:00.000","2018-12-17T00:00:00.000","2013-01-23T00:00:00.000","2013-01-23T00:00:00.000",,"0",,,,,,,,,,,,,,,,,,,,,,,,,,"https://opendata.rdw.nl/resource/3huj-srit.json","https://opendata.rdw.nl/resource/8ys7-d773.json","https://opendata.rdw.nl/resource/vezc-m2t6.json","https://opendata.rdw.nl/resource/jhie-znh9.json","https://opendata.rdw.nl/resource/kmfi-hrps.json"
"V185TF","Bedrijfsauto","TOYOTA","TOYOTA LAND CRUISER (200 SERIES)","20250203","20190330","29569","opleggertrekker","2","N.v.t.","N.v.t.","8","4461","2615","3350","2715","750",,"20121213","20190330","Geen verstrekking in Open Data","123598","Ja",,,"2800","3500","3500",,,"4",,,,,"197","N1",,,"r. tegen balk a. vooras","3350","J20",,,,,,"0.07","285","Nee","Nee",,"Nee","6850",,,"2024","Geen oordeel","05","Ja","2025-02-03T00:00:00.000","2019-03-30T00:00:00.000","2012-12-13T00:00:00.000","2019-03-30T00:00:00.000",,"0",,,,,,,,,,,,,,,,,,,,,,,,,,"https://opendata.rdw.nl/resource/3huj-srit.json","https://opendata.rdw.nl/resource/8ys7-d773.json","https://opendata.rdw.nl/resource/vezc-m2t6.json","https://opendata.rdw.nl/resource/jhie-znh9.json","https://opendata.rdw.nl/resource/kmfi-hrps.json"
"V343GJ","Bedrijfsauto","TOYOTA","TOYOTA LAND CRUISER (200 SERIES)","20241012","20231120","29569","opleggertrekker","5","N.v.t.","N.v.t.","8","4461","2650","3350","2750","750",,"20160829","20170512","Geen verstrekking in Open Data","123598","Ja",,,"3500",,"3500",,,"4",,,,,"197","N1",,,"r. tegen balk a. vooras","3350","J20",,,,,,"0.07","285","Nee","Nee",,"Nee","6850",,,"2023","Geen oordeel","05","Ja","2024-10-12T00:00:00.000","2023-11-20T00:00:00.000","2016-08-29T00:00:00.000","2017-05-12T00:00:00.000",,"0",,,,,,,,,,,,,,,,,,,,,,,,,,"https://opendata.rdw.nl/resource/3huj-srit.json","https://opendata.rdw.nl/resource/8ys7-d773.json","https://opendata.rdw.nl/resource/vezc-m2t6.json","https://opendata.rdw.nl/resource/jhie-znh9.json","https://opendata.rdw.nl/resource/kmfi-hrps.json"
"V926GK","Bedrijfsauto","TOYOTA","TOYOTA LAND CRUISER (200 SERIES)","20240831","20230904","29569","opleggertrekker","5","N.v.t.","N.v.t.","8","4461","2560","3350","2660","750",,"20160831","20170630","Geen verstrekking in Open Data","123598","Ja",,,"2685","3500","3500",,,"4",,,,,"197","N1",,,"r. tegen balk a. vooras","3350","J20",,,,,,"0.08","285","Nee","Nee",,"Nee","6850",,,"2023","Geen oordeel","05","Ja","2024-08-31T00:00:00.000","2023-09-04T00:00:00.000","2016-08-31T00:00:00.000","2017-06-30T00:00:00.000",,"0",,,,,,,,,,,,,,,,,,,,,,,,,,"https://opendata.rdw.nl/resource/3huj-srit.json","https://opendata.rdw.nl/resource/8ys7-d773.json","https://opendata.rdw.nl/resource/vezc-m2t6.json","https://opendata.rdw.nl/resource/jhie-znh9.json","https://opendata.rdw.nl/resource/kmfi-hrps.json"
"VF046R","Bedrijfsauto","TOYOTA","TOYOTA LAND CRUISER (200 SERIES)","20240911","20221124","24894","opleggertrekker","5","N.v.t.","N.v.t.","8","4461","2680","3350","2780","750",,"20131026","20131026","Geen verstrekking in Open Data","103918","Ja",,,"4070","3500","3500",,,"4",,,,,"197","N1",,,"r. tegen balk a. vooras","3350","J20",,,,,,"0.07","278","Nee","Nee",,"Nee","6850",,,"2023","Geen oordeel","05","Ja","2024-09-11T00:00:00.000","2022-11-24T00:00:00.000","2013-10-26T00:00:00.000","2013-10-26T00:00:00.000",,"0",,,,,,,,,,,,,,,,,,,,,,,,,,"https://opendata.rdw.nl/resource/3huj-srit.json","https://opendata.rdw.nl/resource/8ys7-d773.json","https://opendata.rdw.nl/resource/vezc-m2t6.json","https://opendata.rdw.nl/resource/jhie-znh9.json","https://opendata.rdw.nl/resource/kmfi-hrps.json"
"VFV34S","Bedrijfsauto","TOYOTA","TOYOTA LAND CRUISER (200 SERIES)","20240623","20200509","29471","opleggertrekker","1","N.v.t.","N.v.t.","8","4461","2580","3350","2680","750",,"20140702","20200509","Geen verstrekking in Open Data","123185","Ja",,,"2325","3500","3500",,"4","4",,,,"495","197","N1",,,"r. tegen balk a. vooras","3350","J20",,,,,,"0.07","285","Nee","Nee",,"Nee","6850",,,"2023","Geen oordeel","05","Ja","2024-06-23T00:00:00.000","2020-05-09T00:00:00.000","2014-07-02T00:00:00.000","2020-05-09T00:00:00.000",,,,,,,,,,,"187",,,,,,,,,,,,,,,,,"https://opendata.rdw.nl/resource/3huj-srit.json","https://opendata.rdw.nl/resource/8ys7-d773.json","https://opendata.rdw.nl/resource/vezc-m2t6.json","https://opendata.rdw.nl/resource/jhie-znh9.json","https://opendata.rdw.nl/resource/kmfi-hrps.json"
"VJ079P","Bedrijfsauto","TOYOTA","TOYOTA LAND CRUISER (200 SERIES)","20220620","20211129","22516","opleggertrekker","5","N.v.t.","N.v.t.","8","4461","2565","3500","2665","750",,"20140620","20140620","Geen verstrekking in Open Data","93906","Ja",,,"4200","8490","5250",,,"4",,,,,"197","N1",,,"r. balk a. vooras","3500","J20",,,,,,"0.08","285","Nee","Nee",,"Nee","11900",,,"2021","Logisch","00","Ja","2022-06-20T00:00:00.000","2021-11-29T00:00:00.000","2014-06-20T00:00:00.000","2014-06-20T00:00:00.000",,"0",,,,,,,,,,,,,,,,,,,,,,,,,,"https://opendata.rdw.nl/resource/3huj-srit.json","https://opendata.rdw.nl/resource/8ys7-d773.json","https://opendata.rdw.nl/resource/vezc-m2t6.json","https://opendata.rdw.nl/resource/jhie-znh9.json","https://opendata.rdw.nl/resource/kmfi-hrps.json"
"VN273V","Bedrijfsauto","TOYOTA","TOYOTA LAND CRUISER (200 SERIES)","20250412","20240411","24404","opleggertrekker","5","N.v.t.","N.v.t.","8","4461","2530","3350","2630","750",,"20150523","20150523","Geen verstrekking in Open Data","101855","Ja",,,"2250",,"3500",,,"4",,,,,"197","N1",,,"r. tegen balk a. vooras","3350","J20",,,,,,"0.08","285","Nee","Nee",,"Nee","5150",,,"2024","Logisch","00","Ja","2025-04-12T00:00:00.000","2024-04-11T00:00:00.000","2015-05-23T00:00:00.000","2015-05-23T00:00:00.000",,"0",,,,,,,,,,,,,,,,,,,,,,,,,,"https://opendata.rdw.nl/resource/3huj-srit.json","https://opendata.rdw.nl/resource/8ys7-d773.json","https://opendata.rdw.nl/resource/vezc-m2t6.json","https://opendata.rdw.nl/resource/jhie-znh9.json","https://opendata.rdw.nl/resource/kmfi-hrps.json"
"VN937X","Bedrijfsauto","TOYOTA","TOYOTA LAND CRUISER (200 SERIES)","20241205","20150521","24404","opleggertrekker","5","N.v.t.","N.v.t.","8","4461","2530","3350","2630","750",,"20150521","20150521","Geen verstrekking in Open Data","101855","Ja",,,"2250",,,,,"4",,,,,"197","N1",,,"r. tegen balk a. vooras","3350","J20",,,,,,"0.08","285","Nee","Nee",,"Nee","5150",,,"2023","Logisch","00","Ja","2024-12-05T00:00:00.000","2015-05-21T00:00:00.000","2015-05-21T00:00:00.000","2015-05-21T00:00:00.000",,"0",,,,,,,,,,,,,,,,,,,,,,,,,,"https://opendata.rdw.nl/resource/3huj-srit.json","https://opendata.rdw.nl/resource/8ys7-d773.json","https://opendata.rdw.nl/resource/vezc-m2t6.json","https://opendata.rdw.nl/resource/jhie-znh9.json","https://opendata.rdw.nl/resource/kmfi-hrps.json"
"VP296Z","Bedrijfsauto","TOYOTA","TOYOTA LAND CRUISER (200 SERIES)","20250530","20230527","24404","opleggertrekker","5","N.v.t.","N.v.t.","8","4461","2740","3350","2840","750",,"20150801","20150801","Geen verstrekking in Open Data","101854","Ja",,,"2250","3500","3500",,,"4",,,,,"197","N1",,,"r. tegen balk a. vooras","3350","J20",,,,,,"0.07","285","Nee","Nee",,"Nee","6850",,,"2024","Logisch","00","Ja","2025-05-30T00:00:00.000","2023-05-27T00:00:00.000","2015-08-01T00:00:00.000","2015-08-01T00:00:00.000",,"0",,,,,,,,,,,,,,,,,,,,,,,,,,"https://opendata.rdw.nl/resource/3huj-srit.json","https://opendata.rdw.nl/resource/8ys7-d773.json","https://opendata.rdw.nl/resource/vezc-m2t6.json","https://opendata.rdw.nl/resource/jhie-znh9.json","https://opendata.rdw.nl/resource/kmfi-hrps.json"
"VP909X","Bedrijfsauto","TOYOTA","TOYOTA LAND CRUISER (200 SERIES)","20250116","20230801","24404","opleggertrekker","5","N.v.t.","N.v.t.","8","4461","2485","3350","2585",,,"20150730","20150730","Geen verstrekking in Open Data","100575","Ja",,,"3500",,,,,"4",,,,,"200","N1",,,"r. balk by vooras","3350",,,,,,,"0.08","285","Nee","Nee",,"Nee","6130",,,"2024","Logisch","00","Ja","2025-01-16T00:00:00.000","2023-08-01T00:00:00.000","2015-07-30T00:00:00.000","2015-07-30T00:00:00.000",,"0",,,,,,,,,,,,,,,,,,,,,,,,,,"https://opendata.rdw.nl/resource/3huj-srit.json","https://opendata.rdw.nl/resource/8ys7-d773.json","https://opendata.rdw.nl/resource/vezc-m2t6.json","https://opendata.rdw.nl/resource/jhie-znh9.json","https://opendata.rdw.nl/resource/kmfi-hrps.json"
"VR343H","Bedrijfsauto","TOYOTA","TOYOTA LAND CRUISER (200 SERIES)","20240726","20230320","24404","opleggertrekker","5","N.v.t.","N.v.t.","8","4461","2605","3350","2705","750",,"20150827","20150827","Geen verstrekking in Open Data","101855","Ja",,,"2250","3500","3500",,,"4",,,,,"197","N1",,,"r. tegen balk a. vooras","3350","J20",,,,,,"0.07","285","Nee","Nee",,"Nee","6850",,,"2023","Logisch","00","Ja","2024-07-26T00:00:00.000","2023-03-20T00:00:00.000","2015-08-27T00:00:00.000","2015-08-27T00:00:00.000",,,,,,,,,,,,,,,,,,,,,,,,,,,,"https://opendata.rdw.nl/resource/3huj-srit.json","https://opendata.rdw.nl/resource/8ys7-d773.json","https://opendata.rdw.nl/resource/vezc-m2t6.json","https://opendata.rdw.nl/resource/jhie-znh9.json","https://opendata.rdw.nl/resource/kmfi-hrps.json"
"VR359K","Bedrijfsauto","TOYOTA","TOYOTA LAND CRUISER (200 SERIES)","20241128","20180123","24384","opleggertrekker","5","N.v.t.","N.v.t.","8","4461","2605","3350","2705","750",,"20151127","20151127","Geen verstrekking in Open Data","101770","Ja",,,"2250","3500","3500",,,"4",,,,,"197","N1",,,"r. balk a. vooras","3350","J20",,,,,,"0.07","285","Nee","Nee",,"Nee","6850",,,"2023","Logisch","00","Ja","2024-11-28T00:00:00.000","2018-01-23T00:00:00.000","2015-11-27T00:00:00.000","2015-11-27T00:00:00.000",,"0",,,,,,,,,,,,,,,,,,,,,,,,,,"https://opendata.rdw.nl/resource/3huj-srit.json","https://opendata.rdw.nl/resource/8ys7-d773.json","https://opendata.rdw.nl/resource/vezc-m2t6.json","https://opendata.rdw.nl/resource/jhie-znh9.json","https://opendata.rdw.nl/resource/kmfi-hrps.json"
"VS284F","Bedrijfsauto","TOYOTA","TOYOTA LAND CRUISER (200 SERIES)","20241126","20230710","26184","opleggertrekker","5","N.v.t.","N.v.t.","8","4461","2685","3350","2785","750",,"20151126","20151126","Geen verstrekking in Open Data","109347","Ja",,,"2825","3500","3500",,,"4",,,,,"200","N1",,,"r. balk a. vooras","3350","J20(A)",,,,,,"0.07","285","Nee","Nee",,"Nee","6850",,,"2023","Logisch","00","Ja","2024-11-26T00:00:00.000","2023-07-10T00:00:00.000","2015-11-26T00:00:00.000","2015-11-26T00:00:00.000",,"0",,,,,,,,,,,,,,,,,,,,,,,,,,"https://opendata.rdw.nl/resource/3huj-srit.json","https://opendata.rdw.nl/resource/8ys7-d773.json","https://opendata.rdw.nl/resource/vezc-m2t6.json","https://opendata.rdw.nl/resource/jhie-znh9.json","https://opendata.rdw.nl/resource/kmfi-hrps.json"
"VS295F","Bedrijfsauto","TOYOTA","TOYOTA LAND CRUISER (200 SERIES)","20250115","20210115","26184","opleggertrekker","5","N.v.t.","N.v.t.","8","4461","2770","3350","2870","750",,"20151120","20151120","Geen verstrekking in Open Data","109347","Ja",,,"2850","3350","3350",,,"4",,,,,"200","N1",,,"r. balk a. vooras","3350","J20(A)",,,,,,"0.07","285","Nee","Nee",,"Nee","6850",,,"2024","Logisch","00","Ja","2025-01-15T00:00:00.000","2021-01-15T00:00:00.000","2015-11-20T00:00:00.000","2015-11-20T00:00:00.000",,"0",,,,,,,,,,,,,,,,,,,,,,,,,,"https://opendata.rdw.nl/resource/3huj-srit.json","https://opendata.rdw.nl/resource/8ys7-d773.json","https://opendata.rdw.nl/resource/vezc-m2t6.json","https://opendata.rdw.nl/resource/jhie-znh9.json","https://opendata.rdw.nl/resource/kmfi-hrps.json"
"VS483G","Bedrijfsauto","TOYOTA","TOYOTA LAND CRUISER (200 SERIES)","20250508","20151221","24404","opleggertrekker","5","N.v.t.","N.v.t.","8","4461","2580","3350","2680","750",,"20151221","20151221","Geen verstrekking in Open Data","101854","Ja",,,"2250",,"3500",,,"4",,,,,"197","N1",,,"r. tegen balk a. vooras","3350","J20",,,,,,"0.07","285","Nee","Nee",,"Nee","6850",,,"2024","Logisch","00","Ja","2025-05-08T00:00:00.000","2015-12-21T00:00:00.000","2015-12-21T00:00:00.000","2015-12-21T00:00:00.000",,"0",,,,,,,,,,,,,,,,,,,,,,,,,,"https://opendata.rdw.nl/resource/3huj-srit.json","https://opendata.rdw.nl/resource/8ys7-d773.json","https://opendata.rdw.nl/resource/vezc-m2t6.json","https://opendata.rdw.nl/resource/jhie-znh9.json","https://opendata.rdw.nl/resource/kmfi-hrps.json"
"VT473N","Bedrijfsauto","TOYOTA","TOYOTA LAND CRUISER (200 SERIES)","20241208","20170914","14710","opleggertrekker","5","N.v.t.","N.v.t.","8","4461","2673","3350","2773","750",,"20151208","20160318","Geen verstrekking in Open Data","61047","Ja",,,"4077",,"3500",,,"4",,,,,"197","N1",,,"r. tegen balk a. vooras","3350","J20",,,,,,"0.07","285","Nee","Nee",,"Nee","6850",,,"2024","Geen oordeel","05","Ja","2024-12-08T00:00:00.000","2017-09-14T00:00:00.000","2015-12-08T00:00:00.000","2016-03-18T00:00:00.000",,,,,,,,,,,,,,,,,,,,,,,,,,,,"https://opendata.rdw.nl/resource/3huj-srit.json","https://opendata.rdw.nl/resource/8ys7-d773.json","https://opendata.rdw.nl/resource/vezc-m2t6.json","https://opendata.rdw.nl/resource/jhie-znh9.json","https://opendata.rdw.nl/resource/kmfi-hrps.json"
"VT488N","Bedrijfsauto","TOYOTA","TOYOTA LAND CRUISER (200 SERIES)","20240701","20210918","14710","opleggertrekker","5","N.v.t.","N.v.t.","8","4461","2665","3350","2765","750",,"20151208","20160506","Geen verstrekking in Open Data","61047","Ja",,,"4085",,"3500",,,"4",,,,,"197","N1",,,"r. tegen balk a. vooras","3350","J20",,,,,,"0.07","285","Nee","Nee",,"Nee","6850",,,"2024","Geen oordeel","05","Ja","2024-07-01T00:00:00.000","2021-09-18T00:00:00.000","2015-12-08T00:00:00.000","2016-05-06T00:00:00.000",,,,,,,,,,,,,,,,,,,,,,,,,,,,"https://opendata.rdw.nl/resource/3huj-srit.json","https://opendata.rdw.nl/resource/8ys7-d773.json","https://opendata.rdw.nl/resource/vezc-m2t6.json","https://opendata.rdw.nl/resource/jhie-znh9.json","https://opendata.rdw.nl/resource/kmfi-hrps.json"
"VT509N","Bedrijfsauto","TOYOTA","TOYOTA LAND CRUISER (200 SERIES)","20240428","20200817","14710","opleggertrekker","5","N.v.t.","N.v.t.","8","4461","2640","3350","2740","750",,"20151208","20161003","Geen verstrekking in Open Data","61047","Nee",,,"4110",,"3500",,,"4",,,,,"197","N1",,,"r. balk a. vooras","3350","J20",,,,,,"0.07","285","Nee","Nee",,"Nee","6850",,,"2023","Geen oordeel","05","Ja","2024-04-28T00:00:00.000","2020-08-17T00:00:00.000","2015-12-08T00:00:00.000","2016-10-03T00:00:00.000",,,,,,,,,,,,,,,,,,,,,,,,,,,,"https://opendata.rdw.nl/resource/3huj-srit.json","https://opendata.rdw.nl/resource/8ys7-d773.json","https://opendata.rdw.nl/resource/vezc-m2t6.json","https://opendata.rdw.nl/resource/jhie-znh9.json","https://opendata.rdw.nl/resource/kmfi-hrps.json"
"VT690D","Bedrijfsauto","TOYOTA","TOYOTA LAND CRUISER (200 SERIES)","20241208","20221206","24384","opleggertrekker","5","N.v.t.","N.v.t.","8","4461","2690","3350","2790","750",,"20151208","20151218","Geen verstrekking in Open Data","101771","Ja",,,"4060","3500","3500",,,"4",,,,,"197","N1",,,"r. tegen balk a. vooras","3350","J20",,,,,,"0.07","285","Nee","Nee",,"Nee","6850",,,"2024","Logisch","00","Ja","2024-12-08T00:00:00.000","2022-12-06T00:00:00.000","2015-12-08T00:00:00.000","2015-12-18T00:00:00.000",,"0",,,,,,,,,,,,,,,,,,,,,,,,,,"https://opendata.rdw.nl/resource/3huj-srit.json","https://opendata.rdw.nl/resource/8ys7-d773.json","https://opendata.rdw.nl/resource/vezc-m2t6.json","https://opendata.rdw.nl/resource/jhie-znh9.json","https://opendata.rdw.nl/resource/kmfi-hrps.json"
"VT691D","Bedrijfsauto","TOYOTA","TOYOTA LAND CRUISER (200 SERIES)","20241208","20220627","24384","opleggertrekker","5","N.v.t.","N.v.t.","8","4461","2690","3350","2790","750",,"20151208","20151218","Geen verstrekking in Open Data","101771","Ja",,,"4060","3500","3500",,,"4",,,,,"197","N1",,,"r. balk a. vooras","3350","J20",,,,,,"0.07","285","Nee","Nee",,"Nee","6850",,,"2024","Logisch","00","Ja","2024-12-08T00:00:00.000","2022-06-27T00:00:00.000","2015-12-08T00:00:00.000","2015-12-18T00:00:00.000",,"0",,,,,,,,,,,,,,,,,,,,,,,,,,"https://opendata.rdw.nl/resource/3huj-srit.json","https://opendata.rdw.nl/resource/8ys7-d773.json","https://opendata.rdw.nl/resource/vezc-m2t6.json","https://opendata.rdw.nl/resource/jhie-znh9.json","https://opendata.rdw.nl/resource/kmfi-hrps.json"
"VT818K","Bedrijfsauto","TOYOTA","TOYOTA LAND CRUISER (200 SERIES)","20240924","20211110","24972","opleggertrekker","5","N.v.t.","N.v.t.","8","4461","2652","3350","2752","750",,"20151208","20160227","Geen verstrekking in Open Data","104246","Ja",,,"4098","3500","3350",,,"4",,,,,"200","N1",,,"r. balk a. vooras","3350","J20",,,,,,"0.07","285","Nee","Nee",,"Nee","6850",,,"2024","Geen oordeel","05","Ja","2024-09-24T00:00:00.000","2021-11-10T00:00:00.000","2015-12-08T00:00:00.000","2016-02-27T00:00:00.000",,"0",,,,,,,,,,,,,,,,,,,,,,,,,,"https://opendata.rdw.nl/resource/3huj-srit.json","https://opendata.rdw.nl/resource/8ys7-d773.json","https://opendata.rdw.nl/resource/vezc-m2t6.json","https://opendata.rdw.nl/resource/jhie-znh9.json","https://opendata.rdw.nl/resource/kmfi-hrps.json"
"VT859S","Bedrijfsauto","TOYOTA","TOYOTA LAND CRUISER (200 SERIES)","20240915","20210312","30285","opleggertrekker","5","N.v.t.","N.v.t.","8","4461","2551","3350","2651","750",,"20160319","20160319","Geen verstrekking in Open Data","126613","Ja",,,"4199","3500","3500",,,"4",,,,,"199","N1",,,"r. balk a. vooras","3350","J20",,,,,,"0.08","285","Nee","Nee",,"Nee","6850",,,"2023","Logisch","00","Ja","2024-09-15T00:00:00.000","2021-03-12T00:00:00.000","2016-03-19T00:00:00.000","2016-03-19T00:00:00.000",,"0",,,,,,,,,,,,,,,,,,,,,,,,,,"https://opendata.rdw.nl/resource/3huj-srit.json","https://opendata.rdw.nl/resource/8ys7-d773.json","https://opendata.rdw.nl/resource/vezc-m2t6.json","https://opendata.rdw.nl/resource/jhie-znh9.json","https://opendata.rdw.nl/resource/kmfi-hrps.json"
"VT869T","Bedrijfsauto","TOYOTA","TOYOTA LAND CRUISER (200 SERIES)","20250329","20230522","22654","opleggertrekker","5","N.v.t.","N.v.t.","8","4461","2551","3350","2651","750",,"20151208","20160504","Geen verstrekking in Open Data","94489","Ja",,,"2250",,"3500",,,"4",,,,,"199","N1",,,"r. balk a. vooras","3350","J20",,,,,,"0.08","285","Nee","Nee",,"Nee","6850",,,"2024","Geen oordeel","05","Ja","2025-03-29T00:00:00.000","2023-05-22T00:00:00.000","2015-12-08T00:00:00.000","2016-05-04T00:00:00.000",,"0",,,,,,,,,,,,,,,,,,,,,,,,,,"https://opendata.rdw.nl/resource/3huj-srit.json","https://opendata.rdw.nl/resource/8ys7-d773.json","https://opendata.rdw.nl/resource/vezc-m2t6.json","https://opendata.rdw.nl/resource/jhie-znh9.json","https://opendata.rdw.nl/resource/kmfi-hrps.json"
"VX377Z","Bedrijfsauto","TOYOTA","TOYOTA LAND CRUISER (200 SERIES)","20241229","20200103","22727","opleggertrekker","5","N.v.t.","N.v.t.","8","4461","2575","3350","2675","750",,"20151208","20160820","Geen verstrekking in Open Data","72070","Ja",,,"4125","3500","3500",,,"4",,,,,"197","N1",,,"r. tegen balk a. vooras","3350","J20",,,,,,"0.07","285","Nee","Nee",,"Nee","6800",,,"2023","Geen oordeel","05","Ja","2024-12-29T00:00:00.000","2020-01-03T00:00:00.000","2015-12-08T00:00:00.000","2016-08-20T00:00:00.000",,"0",,,,,,,,,,,,,,,,,,,,,,,,,,"https://opendata.rdw.nl/resource/3huj-srit.json","https://opendata.rdw.nl/resource/8ys7-d773.json","https://opendata.rdw.nl/resource/vezc-m2t6.json","https://opendata.rdw.nl/resource/jhie-znh9.json","https://opendata.rdw.nl/resource/kmfi-hrps.json"
"VX952L","Bedrijfsauto","TOYOTA","TOYOTA LAND CRUISER (200 SERIES)","20250221","20210805","28686","opleggertrekker","2","N.v.t.","N.v.t.","8","4461","2539","3350","2639","750",,"20160125","20160624","Geen verstrekking in Open Data","119881","Ja",,,"3500","3500","3500",,,"4",,,,,"197","N1",,,"r. balk a. vooras","3350","J20",,,,,,"0.08","285","Nee","Nee",,"Nee","6850",,,"2024","Geen oordeel","05","Ja","2025-02-21T00:00:00.000","2021-08-05T00:00:00.000","2016-01-25T00:00:00.000","2016-06-24T00:00:00.000",,"0",,,,,,,,,,,,,,,,,,,,,,,,,,"https://opendata.rdw.nl/resource/3huj-srit.json","https://opendata.rdw.nl/resource/8ys7-d773.json","https://opendata.rdw.nl/resource/vezc-m2t6.json","https://opendata.rdw.nl/resource/jhie-znh9.json","https://opendata.rdw.nl/resource/kmfi-hrps.json"
"VBV75P","Bedrijfsauto","TOYOTA","TOYOTA LAND CRUISER (200 SERIES)","20250614","20200120","29569","opleggertrekker","1","N.v.t.","N.v.t.","8","4461","2578","3350","2678","750",,"20150206","20200120","Geen verstrekking in Open Data","123598","Ja",,,"2250","3500","3500",,,"4",,,,,"197","N1",,,"r. tegen balk a. vooras","3350","J20",,,,,,"0.07","285","Nee","Ja",,"Nee","6850",,,"2024","Geen oordeel","05","Ja","2025-06-14T00:00:00.000","2020-01-20T00:00:00.000","2015-02-06T00:00:00.000","2020-01-20T00:00:00.000",,"0",,,,,,,,,,,,,,,,,,,,,,,,,,"https://opendata.rdw.nl/resource/3huj-srit.json","https://opendata.rdw.nl/resource/8ys7-d773.json","https://opendata.rdw.nl/resource/vezc-m2t6.json","https://opendata.rdw.nl/resource/jhie-znh9.json","https://opendata.rdw.nl/resource/kmfi-hrps.json"