"kenteken","voertuigsoort","merk","handelsbenaming","vervaldatum_apk","datum_tenaamstelling","bruto_bpm","inrichting","aantal_zitplaatsen","eerste_kleur","tweede_kleur","aantal_cilinders","cilinderinhoud","massa_ledig_voertuig","toegestane_maximum_massa_voertuig","massa_rijklaar","maximum_massa_trekken_ongeremd","maximum_trekken_massa_geremd","datum_eerste_toelating","datum_eerste_tenaamstelling_in_nederland","wacht_op_keuren","catalogusprijs","wam_verzekerd","maximale_constructiesnelheid","laadvermogen","oplegger_geremd","aanhangwagen_autonoom_geremd","aanhangwagen_middenas_geremd","aantal_staanplaatsen","aantal_deuren","aantal_wielen","afstand_hart_koppeling_tot_achterzijde_voertuig","afstand_voorzijde_voertuig_tot_hart_koppeling","afwijkende_maximum_snelheid","lengte","breedte","europese_voertuigcategorie","europese_voertuigcategorie_toevoeging","europese_uitvoeringcategorie_toevoeging","plaats_chassisnummer","technische_max_massa_voertuig","type","type_gasinstallatie","typegoedkeuringsnummer","variant","uitvoering","volgnummer_wijziging_eu_typegoedkeuring","vermogen_massarijklaar","wielbasis","export_indicator","openstaande_terugroepactie_indicator","vervaldatum_tachograaf","taxi_indicator","maximum_massa_samenstelling","aantal_rolstoelplaatsen","maximum_ondersteunende_snelheid","jaar_laatste_registratie_tellerstand","tellerstandoordeel","code_toelichting_tellerstandoordeel","tenaamstellen_mogelijk","vervaldatum_apk_dt","datum_tenaamstelling_dt","datum_eerste_toelating_dt","datum_eerste_tenaamstelling_in_nederland_dt","vervaldatum_tachograaf_dt","maximum_last_onder_de_vooras_sen_tezamen_koppeling","type_remsysteem_voertuig_code","rupsonderstelconfiguratiecode","wielbasis_voertuig_minimum","wielbasis_voertuig_maximum","lengte_voertuig_minimum","lengte_voertuig_maximum","breedte_voertuig_minimum","breedte_voertuig_maximum","hoogte_voertuig","hoogte_voertuig_minimum","hoogte_voertuig_maximum","massa_bedrijfsklaar_minimaal","massa_bedrijfsklaar_maximaal","technisch_toelaatbaar_massa_koppelpunt","maximum_massa_technisch_maximaal","maximum_massa_technisch_minimaal","subcategorie_nederland","verticale_belasting_koppelpunt_getrokken_voertuig","zuinigheidsclassificatie","registratie_datum_goedkeuring_afschrijvingsmoment_bpm","registratie_datum_goedkeuring_afschrijvingsmoment_bpm_dt","gem_lading_wrde","aerodyn_voorz","massa_alt_aandr","verl_cab_ind","api_gekentekende_voertuigen_assen","api_gekentekende_voertuigen_brandstof","api_gekentekende_voertuigen_carrosserie","api_gekentekende_voertuigen_carrosserie_specifiek","api_gekentekende_voertuigen_voertuigklasse"
"00XRS8","Personenauto","TOYOTA","TOYOTA PRIUS PLUG-IN HYBRID","20250125","20180907",,"hatchback","5","GRIJS","Niet geregistreerd","4","1798","1400","1840","1500",,,"20120711","20120711","Geen verstrekking in Open Data","41989","Ja",,,,,,,"4","4","0","0",,"448","0","M1",,,"r. voorzitting","1840","XW3P",,"e11*2007/46*0015*02","ZVW35(H)","ZVW35L-BHXEBW(1C)","0","0.01","270","Nee","Nee",,"Nee","0","0",,"2024","Logisch","00","Ja","2025-01-25T00:00:00.000","2018-09-07T00:00:00.000","2012-07-11T00:00:00.000","2012-07-11T00:00:00.000",,,,,,,,,,,,,,,,,,,,,"A",,,,,,,"https://opendata.rdw.nl/resource/3huj-srit.json","https://opendata.rdw.nl/resource/8ys7-d773.json","https://opendata.rdw.nl/resource/vezc-m2t6.json","https://opendata.rdw.nl/resource/jhie-znh9.json","https://opendata.rdw.nl/resource/kmfi-hrps.json"
"00XRV2","Personenauto","TOYOTA","TOYOTA PRIUS PLUG-IN HYBRID","20240715","20171230",,"hatchback","5","GRIJS","Niet geregistreerd","4","1798","1400","1840","1500",,,"20120719","20120719","Geen verstrekking in Open Data","45889","Ja",,,,,,,"4","4","0","0",,"448","0","M1",,,"r. voorzitting","1840","XW3P",,"e11*2007/46*0015*02","ZVW35(H)","ZVW35L-BHXEBW(1C)","0","0.01","270","Nee","Nee",,"Nee","0","0",,"2023","Logisch","00","Ja","2024-07-15T00:00:00.000","2017-12-30T00:00:00.000","2012-07-19T00:00:00.000","2012-07-19T00:00:00.000",,,,,,,,,,,,,,,,,,,,,"A",,,,,,,"https://opendata.rdw.nl/resource/3huj-srit.json","https://opendata.rdw.nl/resource/8ys7-d773.json","https://opendata.rdw.nl/resource/vezc-m2t6.json","https://opendata.rdw.nl/resource/jhie-znh9.json","https://opendata.rdw.nl/resource/kmfi-hrps.json"
"00XSK8","Personenauto","TOYOTA","TOYOTA PRIUS PLUG-IN HYBRID","20240726","20150919",,"hatchback","5","GRIJS","Niet geregistreerd","4","1798","1400","1840","1500",,,"20120727","20120727","Geen verstrekking in Open Data","45889","Ja",,,,,,,"4","4","0","0",,"448","0","M1",,,"r. voorzitting","1840","XW3P",,"e11*2007/46*0015*02","ZVW35(H)","ZVW35L-BHXEBW(1C)","0","0.01","270","Nee","Nee",,"Nee","0","0",,"2023","Logisch","00","Ja","2024-07-26T00:00:00.000","2015-09-19T00:00:00.000","2012-07-27T00:00:00.000","2012-07-27T00:00:00.000",,,,,,,,,,,,,,,,,,,,,"A",,,,,,,"https://opendata.rdw.nl/resource/3huj-srit.json","https://opendata.rdw.nl/resource/8ys7-d773.json","https://opendata.rdw.nl/resource/vezc-m2t6.json","https://opendata.rdw.nl/resource/jhie-znh9.json","https://opendata.rdw.nl/resource/kmfi-hrps.json"
"00XSR7","Personenauto","TOYOTA","TOYOTA PRIUS PLUG-IN HYBRID","20240804","20231016",,"hatchback","5","WIT","Niet geregistreerd","4","1798","1400","1840","1500",,,"20120803","20120803","Geen verstrekking in Open Data","46039","Ja",,,,,,,"4","4","0","0",,"448","0","M1",,,"r. voorzitting","1840","XW3P",,"e11*2007/46*0015*02","ZVW35(H)","ZVW35L-BHXEBW(1C)","0","0.01","270","Nee","Nee",,"Nee","0","0",,"2023","Logisch","00","Ja","2024-08-04T00:00:00.000","2023-10-16T00:00:00.000","2012-08-03T00:00:00.000","2012-08-03T00:00:00.000",,,,,,,,,,,,,,,,,,,,,"A",,,,,,,"https://opendata.rdw.nl/resource/3huj-srit.json","https://opendata.rdw.nl/resource/8ys7-d773.json","https://opendata.rdw.nl/resource/vezc-m2t6.json","https://opendata.rdw.nl/resource/jhie-znh9.json","https://opendata.rdw.nl/resource/kmfi-hrps.json"
"00XXP8","Personenauto","TOYOTA","TOYOTA PRIUS PLUG-IN HYBRID","20240921","20170102",,"hatchback","5","GRIJS","Niet geregistreerd","4","1798","1400","1840","1500",,,"20120920","20120920","Geen verstrekking in Open Data","39590","Ja",,,,,,,"4","4","0","0",,"448","0","M1",,,"r. voorzitting","1840","XW3P",,"e11*2007/46*0015*02","ZVW35(H)","ZVW35L-BHXEBW(1C)","0","0.01","270","Nee","Nee",,"Nee","0","0",,"2023","Logisch","00","Ja","2024-09-21T00:00:00.000","2017-01-02T00:00:00.000","2012-09-20T00:00:00.000","2012-09-20T00:00:00.000",,,,,,,,,,,,,,,,,,,,,"A",,,,,,,"https://opendata.rdw.nl/resource/3huj-srit.json","https://opendata.rdw.nl/resource/8ys7-d773.json","https://opendata.rdw.nl/resource/vezc-m2t6.json","https://opendata.rdw.nl/resource/jhie-znh9.json","https://opendata.rdw.nl/resource/kmfi-hrps.json"
"00XXV3","Personenauto","TOYOTA","TOYOTA PRIUS PLUG-IN HYBRID","20240712","20120914",,"hatchback","5","WIT","Niet geregistreerd","4","1798","1400","1840","1500",,,"20120914","20120914","Geen verstrekking in Open Data","42139","Ja",,,,,,,"4","4","0","0",,"448","0","M1",,,"r. voorzitting","1840","XW3P",,"e11*2007/46*0015*02","ZVW35(H)","ZVW35L-BHXEBW(1C)","0","0.01","270","Nee","Nee",,"Nee","0","0",,"2023","Logisch","00","Ja","2024-07-12T00:00:00.000","2012-09-14T00:00:00.000","2012-09-14T00:00:00.000","2012-09-14T00:00:00.000",,,,,,,,,,,,,,,,,,,,,"A",,,,,,,"https://opendata.rdw.nl/resource/3huj-srit.json","https://opendata.rdw.nl/resource/8ys7-d773.json","https://opendata.rdw.nl/resource/vezc-m2t6.json","https://opendata.rdw.nl/resource/jhie-znh9.json","https://opendata.rdw.nl/resource/kmfi-hrps.json"
"00XZJ9","Personenauto","TOYOTA","TOYOTA PRIUS PLUG-IN HYBRID","20240922","20120922",,"hatchback","5","WIT","Niet geregistreerd","4","1798","1400","1840","1500",,,"20120922","20120922","Geen verstrekking in Open Data","42139","Ja",,,,,,,"4","4","0","0",,"448","0","M1",,,"r. voorzitting","1840","XW3P",,"e11*2007/46*0015*02","ZVW35(H)","ZVW35L-BHXEBW(1C)","0","0.01","270","Nee","Nee",,"Nee","0","0",,"2023","Logisch","00","Ja","2024-09-22T00:00:00.000","2012-09-22T00:00:00.000","2012-09-22T00:00:00.000","2012-09-22T00:00:00.000",,,,,,,,,,,,,,,,,,,,,"A",,,,,,,"https://opendata.rdw.nl/resource/3huj-srit.json","https://opendata.rdw.nl/resource/8ys7-d773.json","https://opendata.rdw.nl/resource/vezc-m2t6.json","https://opendata.rdw.nl/resource/jhie-znh9.json","https://opendata.rdw.nl/resource/kmfi-hrps.json"
"00ZDR2","Personenauto","TOYOTA","TOYOTA PRIUS PLUG-IN HYBRID","20240930","20121012",,"hatchback","5","WIT","Niet geregistreerd","4","1798","1400","1840","1500",,,"20121012","20121012","Geen verstrekking in Open Data","40409","Ja",,,,,,,"4","4","0","0",,"448","0","M1",,,"r. voorzitting","1840","XW3P",,"e11*2007/46*0015*02","ZVW35(H)","ZVW35L-BHXEBW(1C)","0","0.00","270","Nee","Nee",,"Nee","0","0",,"2024","Logisch","00","Ja","2024-09-30T00:00:00.000","2012-10-12T00:00:00.000","2012-10-12T00:00:00.000","2012-10-12T00:00:00.000",,"0",,,,,,,,,,,,,,,,,,,"A",,,,,,,"https://opendata.rdw.nl/resource/3huj-srit.json","https://opendata.rdw.nl/resource/8ys7-d773.json","https://opendata.rdw.nl/resource/vezc-m2t6.json","https://opendata.rdw.nl/resource/jhie-znh9.json","https://opendata.rdw.nl/resource/kmfi-hrps.json"
"00ZDS4","Personenauto","TOYOTA","TOYOTA PRIUS PLUG-IN HYBRID","20241026","20180105",,"hatchback","5","BLAUW","Niet geregistreerd","4","1798","1400","1840","1500",,,"20121026","20121026","Geen verstrekking in Open Data","46660","Ja",,,,,,,"4","4","0","0",,"448","0","M1",,,"r. voorzitting","1840","XW3P",,"e11*2007/46*0015*02","ZVW35(H)","ZVW35L-BHXEBW(1C)","0","0.00","270","Nee","Nee",,"Nee","0","0",,"2023","Logisch","00","Ja","2024-10-26T00:00:00.000","2018-01-05T00:00:00.000","2012-10-26T00:00:00.000","2012-10-26T00:00:00.000",,"0",,,,,,,,,,,,,,,,,,,"A",,,,,,,"https://opendata.rdw.nl/resource/3huj-srit.json","https://opendata.rdw.nl/resource/8ys7-d773.json","https://opendata.rdw.nl/resource/vezc-m2t6.json","https://opendata.rdw.nl/resource/jhie-znh9.json","https://opendata.rdw.nl/resource/kmfi-hrps.json"
"00ZGG6","Personenauto","TOYOTA","TOYOTA PRIUS PLUG-IN HYBRID","20250501","20210707",,"hatchback","5","WIT","Niet geregistreerd","4","1798","1400","1840","1500",,,"20121112","20121112","Geen verstrekking in Open Data","46814","Ja",,,,,,,"4","4","0","0",,"448","0","M1",,,"r. voorzitting","1840","XW3P",,"e11*2007/46*0015*02","ZVW35(H)","ZVW35L-BHXEBW(1C)","0","0.00","270","Nee","Nee",,"Nee","0","0",,"2024","Geen oordeel","05","Ja","2025-05-01T00:00:00.000","2021-07-07T00:00:00.000","2012-11-12T00:00:00.000","2012-11-12T00:00:00.000",,,,,,,,,,,,,,,,,,,,,"A",,,,,,,"https://opendata.rdw.nl/resource/3huj-srit.json","https://opendata.rdw.nl/resource/8ys7-d773.json","https://opendata.rdw.nl/resource/vezc-m2t6.json","https://opendata.rdw.nl/resource/jhie-znh9.json","https://opendata.rdw.nl/resource/kmfi-hrps.json"
"00ZGG7","Personenauto","TOYOTA","TOYOTA PRIUS PLUG-IN HYBRID","20250327","20200423",,"hatchback","5","WIT","Niet geregistreerd","4","1798","1400","1840","1500",,,"20121109","20121109","Geen verstrekking in Open Data","46815","Ja",,,,,,,"4","4","0","0",,"448","0","M1",,,"r. voorzitting","1840","XW3P",,"e11*2007/46*0015*02","ZVW35(H)","ZVW35L-BHXEBW(1C)","0","0.00","270","Nee","Nee",,"Nee","0","0",,"2024","Logisch","00","Ja","2025-03-27T00:00:00.000","2020-04-23T00:00:00.000","2012-11-09T00:00:00.000","2012-11-09T00:00:00.000",,"0",,,,,,,,,,,,,,,,,,,"A",,,,,,,"https://opendata.rdw.nl/resource/3huj-srit.json","https://opendata.rdw.nl/resource/8ys7-d773.json","https://opendata.rdw.nl/resource/vezc-m2t6.json","https://opendata.rdw.nl/resource/jhie-znh9.json","https://opendata.rdw.nl/resource/kmfi-hrps.json"
"00ZKJ7","Personenauto","TOYOTA","TOYOTA PRIUS PLUG-IN HYBRID","20250126","20170506",,"hatchback","5","GRIJS","Niet geregistreerd","4","1798","1400","1840","1500",,,"20130102","20130102","Geen verstrekking in Open Data","46660","Ja",,,,,,,"4","4","0","0",,"448","0","M1",,,"r. voorzitting","1840","XW3P",,"e11*2007/46*0015*02","ZVW35(H)","ZVW35L-BHXEBW(1C)","0","0.01","270","Nee","Nee",,"Nee","0","0",,"2024","Logisch","00","Ja","2025-01-26T00:00:00.000","2017-05-06T00:00:00.000","2013-01-02T00:00:00.000","2013-01-02T00:00:00.000",,,,,,,,,,,,,,,,,,,,,"A",,,,,,,"https://opendata.rdw.nl/resource/3huj-srit.json","https://opendata.rdw.nl/resource/8ys7-d773.json","https://opendata.rdw.nl/resource/vezc-m2t6.json","https://opendata.rdw.nl/resource/jhie-znh9.json","https://opendata.rdw.nl/resource/kmfi-hrps.json"
"00ZKS9","Personenauto","TOYOTA","TOYOTA PRIUS PLUG-IN HYBRID","20250416","20200412",,"hatchback","5","WIT","Niet geregistreerd","4","1798","1400","1840","1500",,,"20130102","20130102","Geen verstrekking in Open Data","46815","Ja",,,,,,,"4","4","0","0",,"448","0","M1",,,"r. voorzitting","1840","XW3P",,"e11*2007/46*0015*02","ZVW35(H)","ZVW35L-BHXEBW(1C)","0","0.01","270","Nee","Nee",,"Nee","0","0",,"2024","Logisch","00","Ja","2025-04-16T00:00:00.000","2020-04-12T00:00:00.000","2013-01-02T00:00:00.000","2013-01-02T00:00:00.000",,,,,,,,,,,,,,,,,,,,,"A",,,,,,,"https://opendata.rdw.nl/resource/3huj-srit.json","https://opendata.rdw.nl/resource/8ys7-d773.json","https://opendata.rdw.nl/resource/vezc-m2t6.json","https://opendata.rdw.nl/resource/jhie-znh9.json","https://opendata.rdw.nl/resource/kmfi-hrps.json"
"01XSG9","Personenauto","TOYOTA","TOYOTA PRIUS PLUG-IN HYBRID","20250304","20180616",,"hatchback","5","GRIJS","Niet geregistreerd","4","1798","1400","1840","1500",,,"20120802","20120802","Geen verstrekking in Open Data","45889","Ja",,,,,,,"4","4","0","0",,"448","0","M1",,,"r. voorzitting","1840","XW3P",,"e11*2007/46*0015*02","ZVW35(H)","ZVW35L-BHXEBW(1C)","0","0.01","270","Nee","Nee",,"Nee","0","0",,"2024","Logisch","00","Ja","2025-03-04T00:00:00.000","2018-06-16T00:00:00.000","2012-08-02T00:00:00.000","2012-08-02T00:00:00.000",,,,,,,,,,,,,,,,,,,,,"A",,,,,,,"https://opendata.rdw.nl/resource/3huj-srit.json","https://opendata.rdw.nl/resource/8ys7-d773.json","https://opendata.rdw.nl/resource/vezc-m2t6.json","https://opendata.rdw.nl/resource/jhie-znh9.json","https://opendata.rdw.nl/resource/kmfi-hrps.json"
"01XTR2","Personenauto","TOYOTA","TOYOTA PRIUS PLUG-IN HYBRID","20240817","20201005",,"hatchback","5","WIT","Niet geregistreerd","4","1798","1400","1840","1500",,,"20120817","20120817","Geen verstrekking in Open Data","46039","Ja",,,,,,,"4","4","0","0",,"448","0","M1",,,"r. voorzitting","1840","XW3P",,"e11*2007/46*0015*02","ZVW35(H)","ZVW35L-BHXEBW(1C)","0","0.01","270","Nee","Nee",,"Nee","0","0",,"2023","Logisch","00","Ja","2024-08-17T00:00:00.000","2020-10-05T00:00:00.000","2012-08-17T00:00:00.000","2012-08-17T00:00:00.000",,,,,,,,,,,,,,,,,,,,,"A",,,,,,,"https://opendata.rdw.nl/resource/3huj-srit.json","https://opendata.rdw.nl/resource/8ys7-d773.json","https://opendata.rdw.nl/resource/vezc-m2t6.json","https://opendata.rdw.nl/resource/jhie-znh9.json","https://opendata.rdw.nl/resource/kmfi-hrps.json"
"01ZKV3","Personenauto","TOYOTA","TOYOTA PRIUS PLUG-IN HYBRID","20241118","20231023",,"hatchback","5","BLAUW","Niet geregistreerd","4","1798","1400","1840","1500",,,"20130102","20130102","Geen verstrekking in Open Data","42695","Ja",,,,,,,"4","4","0","0",,"448","0","M1",,,"r. voorzitting","1840","XW3P",,"e11*2007/46*0015*02","ZVW35(H)","ZVW35L-BHXEBW(1C)","0","0.01","270","Nee","Nee",,"Nee","0","0",,"2023","Logisch","00","Ja","2024-11-18T00:00:00.000","2023-10-23T00:00:00.000","2013-01-02T00:00:00.000","2013-01-02T00:00:00.000",,,,,,,,,,,,,,,,,,,,,"A",,,,,,,"https://opendata.rdw.nl/resource/3huj-srit.json","https://opendata.rdw.nl/resource/8ys7-d773.json","https://opendata.rdw.nl/resource/vezc-m2t6.json","https://opendata.rdw.nl/resource/jhie-znh9.json","https://opendata.rdw.nl/resource/kmfi-hrps.json"
"01ZLD5","Personenauto","TOYOTA","TOYOTA PRIUS PLUG-IN HYBRID","20241228","20121228",,"hatchback","5","GRIJS","Niet geregistreerd","4","1798","1400","1840","1500",,,"20121228","20121228","Geen verstrekking in Open Data","46660","Ja",,,,,,,"4","4","0","0",,"448","0","M1",,,"r. voorzitting","1840","XW3P",,"e11*2007/46*0015*02","ZVW35(H)","ZVW35L-BHXEBW(1C)","0","0.01","270","Nee","Nee",,"Nee","0","0",,"2023","Logisch","00","Ja","2024-12-28T00:00:00.000","2012-12-28T00:00:00.000","2012-12-28T00:00:00.000","2012-12-28T00:00:00.000",,,,,,,,,,,,,,,,,,,,,"A",,,,,,,"https://opendata.rdw.nl/resource/3huj-srit.json","https://opendata.rdw.nl/resource/8ys7-d773.json","https://opendata.rdw.nl/resource/vezc-m2t6.json","https://opendata.rdw.nl/resource/jhie-znh9.json","https://opendata.rdw.nl/resource/kmfi-hrps.json"
"01ZNH1","Personenauto","TOYOTA","TOYOTA PRIUS PLUG-IN HYBRID","20240901","20210909",,"hatchback","5","BLAUW","Niet geregistreerd","4","1798","1400","1840","1500",,,"20130114","20130114","Geen verstrekking in Open Data","42695","Ja",,,,,,,"4","4","0","0",,"448","0","M1",,,"r. voorzitting","1840","XW3P",,"e11*2007/46*0015*02","ZVW35(H)","ZVW35L-BHXEBW(1C)","0","0.01","270","Nee","Nee",,"Nee","0","0",,"2023","Logisch","00","Ja","2024-09-01T00:00:00.000","2021-09-09T00:00:00.000","2013-01-14T00:00:00.000","2013-01-14T00:00:00.000",,,,,,,,,,,,,,,,,,,,,"A",,,,,,,"https://opendata.rdw.nl/resource/3huj-srit.json","https://opendata.rdw.nl/resource/8ys7-d773.json","https://opendata.rdw.nl/resource/vezc-m2t6.json","https://opendata.rdw.nl/resource/jhie-znh9.json","https://opendata.rdw.nl/resource/kmfi-hrps.json"
"01ZPG6","Personenauto","TOYOTA","TOYOTA PRIUS PLUG-IN HYBRID","20250119","20130119",,"hatchback","5","GRIJS","Niet geregistreerd","4","1798","1400","1840","1500",,,"20130119","20130119","Geen verstrekking in Open Data","42695","Ja",,,,,,,"4","4","0","0",,"448","0","M1",,,"r. voorzitting","1840","XW3P",,"e11*2007/46*0015*02","ZVW35(H)","ZVW35L-BHXEBW(1C)","0","0.01","270","Nee","Nee",,"Nee","0","0",,"2024","Logisch","00","Ja","2025-01-19T00:00:00.000","2013-01-19T00:00:00.000","2013-01-19T00:00:00.000","2013-01-19T00:00:00.000",,,,,,,,,,,,,,,,,,,,,"A",,,,,,,"https://opendata.rdw.nl/resource/3huj-srit.json","https://opendata.rdw.nl/resource/8ys7-d773.json","https://opendata.rdw.nl/resource/vezc-m2t6.json","https://opendata.rdw.nl/resource/jhie-znh9.json","https://opendata.rdw.nl/resource/kmfi-hrps.json"
"02XRS8","Personenauto","TOYOTA","TOYOTA PRIUS PLUG-IN HYBRID","20241219","20180802",,"hatchback","5","GRIJS","Niet geregistreerd","4","1798","1400","1840","1500",,,"20120710","20120710","Geen verstrekking in Open Data","41989","Ja",,,,,,,"4","4","0","0",,"448","0","M1",,,"r. voorzitting","1840","XW3P",,"e11*2007/46*0015*02","ZVW35(H)","ZVW35L-BHXEBW(1C)","0","0.01","270","Nee","Nee",,"Nee","0","0",,"2023","Onlogisch","04","Ja","2024-12-19T00:00:00.000","2018-08-02T00:00:00.000","2012-07-10T00:00:00.000","2012-07-10T00:00:00.000",,,,,,,,,,,,,,,,,,,,,"A",,,,,,,"https://opendata.rdw.nl/resource/3huj-srit.json","https://opendata.rdw.nl/resource/8ys7-d773.json","https://opendata.rdw.nl/resource/vezc-m2t6.json","https://opendata.rdw.nl/resource/jhie-znh9.json","https://opendata.rdw.nl/resource/kmfi-hrps.json"
"02XRV2","Personenauto","TOYOTA","TOYOTA PRIUS PLUG-IN HYBRID","20240711","20170703",,"hatchback","5","GRIJS","Niet geregistreerd","4","1798","1400","1840","1500",,,"20120711","20120711","Geen verstrekking in Open Data","41989","Ja",,,,,,,"4","4","0","0",,"448","0","M1",,,"r. voorzitting","1840","XW3P",,"e11*2007/46*0015*02","ZVW35(H)","ZVW35L-BHXEBW(1C)","0","0.01","270","Nee","Nee",,"Nee","0","0",,"2023","Logisch","00","Ja","2024-07-11T00:00:00.000","2017-07-03T00:00:00.000","2012-07-11T00:00:00.000","2012-07-11T00:00:00.000",,,,,,,,,,,,,,,,,,,,,"A",,,,,,,"https://opendata.rdw.nl/resource/3huj-srit.json","https://opendata.rdw.nl/resource/8ys7-d773.json","https://opendata.rdw.nl/resource/vezc-m2t6.json","https://opendata.rdw.nl/resource/jhie-znh9.json","https://opendata.rdw.nl/resource/kmfi-hrps.json"
"02XSG9","Personenauto","TOYOTA","TOYOTA PRIUS PLUG-IN HYBRID","20250424","20240426",,"hatchback","5","WIT","Niet geregistreerd","4","1798","1400","1840","1500",,,"20120813","20120813","Geen verstrekking in Open Data","46039","Ja",,,,,,,"4","4","0","0",,"448","0","M1",,,"r. voorzitting","1840","XW3P",,"e11*2007/46*0015*02","ZVW35(H)","ZVW35L-BHXEBW(1C)","0","0.01","270","Nee","Nee",,"Nee","0","0",,"2024","Logisch","00","Ja","2025-04-24T00:00:00.000","2024-04-26T00:00:00.000","2012-08-13T00:00:00.000","2012-08-13T00:00:00.000",,,,,,,,,,,,,,,,,,,,,"A",,,,,,,"https://opendata.rdw.nl/resource/3huj-srit.json","https://opendata.rdw.nl/resource/8ys7-d773.json","https://opendata.rdw.nl/resource/vezc-m2t6.json","https://opendata.rdw.nl/resource/jhie-znh9.json","https://opendata.rdw.nl/resource/kmfi-hrps.json"
"02XVD4","Personenauto","TOYOTA","TOYOTA PRIUS PLUG-IN HYBRID","20250608","20191106",,"hatchback","5","GRIJS","Niet geregistreerd","4","1798","1400","1840","1500",,,"20120815","20120815","Geen verstrekking in Open Data","41989","Ja",,,,,,,"4","4","0","0",,"448","0","M1",,,"r. voorzitting","1840","XW3P",,"e11*2007/46*0015*02","ZVW35(H)","ZVW35L-BHXEBW(1C)","0","0.01","270","Nee","Nee",,"Nee","0","0",,"2024","Logisch","00","Ja","2025-06-08T00:00:00.000","2019-11-06T00:00:00.000","2012-08-15T00:00:00.000","2012-08-15T00:00:00.000",,,,,,,,,,,,,,,,,,,,,"A",,,,,,,"https://opendata.rdw.nl/resource/3huj-srit.json","https://opendata.rdw.nl/resource/8ys7-d773.json","https://opendata.rdw.nl/resource/vezc-m2t6.json","https://opendata.rdw.nl/resource/jhie-znh9.json","https://opendata.rdw.nl/resource/kmfi-hrps.json"
"02XZS7","Personenauto","TOYOTA","TOYOTA PRIUS PLUG-IN HYBRID","20250603","20160603",,"hatchback","5","GRIJS","Niet geregistreerd","4","1798","1400","1840","1500",,,"20121001","20121001","Geen verstrekking in Open Data","45889","Ja",,,,,,,"4","4","0","0",,"448","0","M1",,,"r. voorzitting","1840","XW3P",,"e11*2007/46*0015*02","ZVW35(H)","ZVW35L-BHXEBW(1C)","0","0.01","270","Nee","Nee",,"Nee","0","0",,"2024","Logisch","00","Ja","2025-06-03T00:00:00.000","2016-06-03T00:00:00.000","2012-10-01T00:00:00.000","2012-10-01T00:00:00.000",,,,,,,,,,,,,,,,,,,,,"A",,,,,,,"https://opendata.rdw.nl/resource/3huj-srit.json","https://opendata.rdw.nl/resource/8ys7-d773.json","https://opendata.rdw.nl/resource/vezc-m2t6.json","https://opendata.rdw.nl/resource/jhie-znh9.json","https://opendata.rdw.nl/resource/kmfi-hrps.json"
"02ZBH7","Personenauto","TOYOTA","TOYOTA PRIUS PLUG-IN HYBRID","20241025","20170930",,"hatchback","5","WIT","Niet geregistreerd","4","1798","1400","1840","1500",,,"20121006","20121006","Geen verstrekking in Open Data","45290","Ja",,,,,,,"4","4","0","0",,"448","0","M1",,,"r. voorzitting","1840","XW3P",,"e11*2007/46*0015*02","ZVW35(H)","ZVW35L-BHXEBW(1C)","0","0.01","270","Nee","Nee",,"Nee","0","0",,"2023","Logisch","00","Ja","2024-10-25T00:00:00.000","2017-09-30T00:00:00.000","2012-10-06T00:00:00.000","2012-10-06T00:00:00.000",,,,,,,,,,,,,,,,,,,,,"A",,,,,,,"https://opendata.rdw.nl/resource/3huj-srit.json","https://opendata.rdw.nl/resource/8ys7-d773.json","https://opendata.rdw.nl/resource/vezc-m2t6.json","https://opendata.rdw.nl/resource/jhie-znh9.json","https://opendata.rdw.nl/resource/kmfi-hrps.json"
"02ZHG6","Personenauto","TOYOTA","TOYOTA PRIUS PLUG-IN HYBRID","20240728","20121122",,"hatchback","5","WIT","Niet geregistreerd","4","1798","1400","1840","1500",,,"20121122","20121122","Geen verstrekking in Open Data","40409","Ja",,,,,,,"4","4","0","0",,"448","0","M1",,,"r. voorzitting","1840","XW3P",,"e11*2007/46*0015*02","ZVW35(H)","ZVW35L-BHXEBW(1C)","0","0.00","270","Nee","Nee",,"Nee","0","0",,"2023","Logisch","00","Ja","2024-07-28T00:00:00.000","2012-11-22T00:00:00.000","2012-11-22T00:00:00.000","2012-11-22T00:00:00.000",,"0",,,,,,,,,,,,,,,,,,,"A",,,,,,,"https://opendata.rdw.nl/resource/3huj-srit.json","https://opendata.rdw.nl/resource/8ys7-d773.json","https://opendata.rdw.nl/resource/vezc-m2t6.json","https://opendata.rdw.nl/resource/jhie-znh9.json","https://opendata.rdw.nl/resource/kmfi-hrps.json"