"kenteken","voertuigsoort","merk","handelsbenaming","vervaldatum_apk","datum_tenaamstelling","bruto_bpm","inrichting","aantal_zitplaatsen","eerste_kleur","tweede_kleur","aantal_cilinders","cilinderinhoud","massa_ledig_voertuig","toegestane_maximum_massa_voertuig","massa_rijklaar","maximum_massa_trekken_ongeremd","maximum_trekken_massa_geremd","datum_eerste_toelating","datum_eerste_tenaamstelling_in_nederland","wacht_op_keuren","catalogusprijs","wam_verzekerd","maximale_constructiesnelheid","laadvermogen","oplegger_geremd","aanhangwagen_autonoom_geremd","aanhangwagen_middenas_geremd","aantal_staanplaatsen","aantal_deuren","aantal_wielen","afstand_hart_koppeling_tot_achterzijde_voertuig","afstand_voorzijde_voertuig_tot_hart_koppeling","afwijkende_maximum_snelheid","lengte","breedte","europese_voertuigcategorie","europese_voertuigcategorie_toevoeging","europese_uitvoeringcategorie_toevoeging","plaats_chassisnummer","technische_max_massa_voertuig","type","type_gasinstallatie","typegoedkeuringsnummer","variant","uitvoering","volgnummer_wijziging_eu_typegoedkeuring","vermogen_massarijklaar","wielbasis","export_indicator","openstaande_terugroepactie_indicator","vervaldatum_tachograaf","taxi_indicator","maximum_massa_samenstelling","aantal_rolstoelplaatsen","maximum_ondersteunende_snelheid","jaar_laatste_registratie_tellerstand","tellerstandoordeel","code_toelichting_tellerstandoordeel","tenaamstellen_mogelijk","vervaldatum_apk_dt","datum_tenaamstelling_dt","datum_eerste_toelating_dt","datum_eerste_tenaamstelling_in_nederland_dt","vervaldatum_tachograaf_dt","maximum_last_onder_de_vooras_sen_tezamen_koppeling","type_remsysteem_voertuig_code","rupsonderstelconfiguratiecode","wielbasis_voertuig_minimum","wielbasis_voertuig_maximum","lengte_voertuig_minimum","lengte_voertuig_maximum","breedte_voertuig_minimum","breedte_voertuig_maximum","hoogte_voertuig","hoogte_voertuig_minimum","hoogte_voertuig_maximum","massa_bedrijfsklaar_minimaal","massa_bedrijfsklaar_maximaal","technisch_toelaatbaar_massa_koppelpunt","maximum_massa_technisch_maximaal","maximum_massa_technisch_minimaal","subcategorie_nederland","verticale_belasting_koppelpunt_getrokken_voertuig","zuinigheidsclassificatie","registratie_datum_goedkeuring_afschrijvingsmoment_bpm","registratie_datum_goedkeuring_afschrijvingsmoment_bpm_dt","gem_lading_wrde","aerodyn_voorz","massa_alt_aandr","verl_cab_ind","api_gekentekende_voertuigen_assen","api_gekentekende_voertuigen_brandstof","api_gekentekende_voertuigen_carrosserie","api_gekentekende_voertuigen_carrosserie_specifiek","api_gekentekende_voertuigen_voertuigklasse"
"18TPT2","Personenauto","TOYOTA","TOYOTA MR2,TOYOTA MR","20240709","20201003","6981","cabriolet","2","BLAUW","Niet geregistreerd","4","1794","950","1225","1050",,,"20000531","20120315","Geen verstrekking in Open Data",,"Ja",,,,,,,"2","4",,,,,,"M1",,,"v. by schutbord","1225",,,,,,,"0.10","246","Nee","Nee",,"Nee",,,,"2023","Geen oordeel","05","Ja","2024-07-09T00:00:00.000","2020-10-03T00:00:00.000","2000-05-31T00:00:00.000","2012-03-15T00:00:00.000",,"0",,,,,,,,,,,,,,,,,,,,,,,,,,"https://opendata.rdw.nl/resource/3huj-srit.json","https://opendata.rdw.nl/resource/8ys7-d773.json","https://opendata.rdw.nl/resource/vezc-m2t6.json","https://opendata.rdw.nl/resource/jhie-znh9.json","https://opendata.rdw.nl/resource/kmfi-hrps.json"
"37THR6","Personenauto","TOYOTA","TOYOTA MR2,TOYOTA MR","20250217","20210610","7106","cabriolet","2","GRIJS","Niet geregistreerd","4","1794","950","1225","1050",,,"20000518","20120209","Geen verstrekking in Open Data",,"Ja",,,,,,,"2","4",,,,,,"M1",,,"r. schutbord","1225",,,,,,,"0.10","245","Nee","Nee",,"Nee",,,,"2024","Geen oordeel","05","Ja","2025-02-17T00:00:00.000","2021-06-10T00:00:00.000","2000-05-18T00:00:00.000","2012-02-09T00:00:00.000",,"0",,,,,,,,,,,,,,,,,,,,,,,,,,"https://opendata.rdw.nl/resource/3huj-srit.json","https://opendata.rdw.nl/resource/8ys7-d773.json","https://opendata.rdw.nl/resource/vezc-m2t6.json","https://opendata.rdw.nl/resource/jhie-znh9.json","https://opendata.rdw.nl/resource/kmfi-hrps.json"
"4ZPF05","Personenauto","TOYOTA","TOYOTA MR2,TOYOTA MR","20250424","20181106","6685","cabriolet","2","GRIJS","Niet geregistreerd","4","1794","960","1235","1060",,,"20020919","20150212","Geen verstrekking in Open Data",,"Ja",,,,,,,"2","4",,,,,,"M1",,,"schutbord","1235",,,,,,,"0.10","245","Nee","Nee",,"Nee",,,,"2024","Geen oordeel","05","Ja","2025-04-24T00:00:00.000","2018-11-06T00:00:00.000","2002-09-19T00:00:00.000","2015-02-12T00:00:00.000",,,,,,,,,,,,,,,,,,,,,,,,,,,,"https://opendata.rdw.nl/resource/3huj-srit.json","https://opendata.rdw.nl/resource/8ys7-d773.json","https://opendata.rdw.nl/resource/vezc-m2t6.json","https://opendata.rdw.nl/resource/jhie-znh9.json","https://opendata.rdw.nl/resource/kmfi-hrps.json"
"5XVT49","Personenauto","TOYOTA","TOYOTA MR2,TOYOTA MR","20241120","20150508","6431","cabriolet","2","ZWART","Niet geregistreerd","4","1794","950","1225","1050",,,"20010831","20141111","Geen verstrekking in Open Data",,"Ja",,,,,,,"2","4",,,,,,"M1",,,"schutbord by kofferruimte","1225",,,,,,,"0.10","244","Nee","Nee",,"Nee",,,,"2023","Geen oordeel","05","Ja","2024-11-20T00:00:00.000","2015-05-08T00:00:00.000","2001-08-31T00:00:00.000","2014-11-11T00:00:00.000",,"0",,,,,,,,,,,,,,,,,,,,,,,,,,"https://opendata.rdw.nl/resource/3huj-srit.json","https://opendata.rdw.nl/resource/8ys7-d773.json","https://opendata.rdw.nl/resource/vezc-m2t6.json","https://opendata.rdw.nl/resource/jhie-znh9.json","https://opendata.rdw.nl/resource/kmfi-hrps.json"
"5ZBZ16","Personenauto","TOYOTA","TOYOTA MR2,TOYOTA MR","20240713","20220714","3353","cabriolet","2","GRIJS","Niet geregistreerd","4","1794","950","1225","1050",,,"20010706","20150124","Geen verstrekking in Open Data",,"Ja",,,,,,,"2","4",,,,,,"M1",,,"schutbord by kofferruimte","1225",,,,,,,"0.10","245","Nee","Nee",,"Nee",,,,"2023","Geen oordeel","05","Ja","2024-07-13T00:00:00.000","2022-07-14T00:00:00.000","2001-07-06T00:00:00.000","2015-01-24T00:00:00.000",,,,,,,,,,,,,,,,,,,,,,"20220713","2022-07-13T00:00:00.000",,,,,"https://opendata.rdw.nl/resource/3huj-srit.json","https://opendata.rdw.nl/resource/8ys7-d773.json","https://opendata.rdw.nl/resource/vezc-m2t6.json","https://opendata.rdw.nl/resource/jhie-znh9.json","https://opendata.rdw.nl/resource/kmfi-hrps.json"
"GK828F","Personenauto","TOYOTA","TOYOTA MR2,TOYOTA MR","20240725","20191006","6164","cabriolet","2","GRIJS","Niet geregistreerd","4","1794","950","1225","1050",,,"20010410","20150704","Geen verstrekking in Open Data",,"Ja",,,,,,,"2","4",,,,,,"M1",,,"midden tegen schutbord in kofferruimte","1225",,,,,,,"0.10","245","Nee","Nee",,"Nee",,,,"2023","Geen oordeel","05","Ja","2024-07-25T00:00:00.000","2019-10-06T00:00:00.000","2001-04-10T00:00:00.000","2015-07-04T00:00:00.000",,,,,,,,,,,,,,,,,,,,,,,,,,,,"https://opendata.rdw.nl/resource/3huj-srit.json","https://opendata.rdw.nl/resource/8ys7-d773.json","https://opendata.rdw.nl/resource/vezc-m2t6.json","https://opendata.rdw.nl/resource/jhie-znh9.json","https://opendata.rdw.nl/resource/kmfi-hrps.json"
"H644SR","Personenauto","TOYOTA","TOYOTA MR2,TOYOTA MR","20240731","20240317","6752","cabriolet","2","GRIJS","Niet geregistreerd","4","1794","965","1225","1065",,,"20040322","20200501","Geen verstrekking in Open Data",,"Ja","210",,,,,,"2","4",,,,,,"M1",,,,"1225","W3",,,,,,"0.10","245","Nee","Nee",,"Nee",,,,"2023","Geen oordeel","05","Ja","2024-07-31T00:00:00.000","2024-03-17T00:00:00.000","2004-03-22T00:00:00.000","2020-05-01T00:00:00.000",,,,,,,,,,,,,,,,,,,,,,,,,,,,"https://opendata.rdw.nl/resource/3huj-srit.json","https://opendata.rdw.nl/resource/8ys7-d773.json","https://opendata.rdw.nl/resource/vezc-m2t6.json","https://opendata.rdw.nl/resource/jhie-znh9.json","https://opendata.rdw.nl/resource/kmfi-hrps.json"
"J522NT","Personenauto","TOYOTA","TOYOTA MR2,TOYOTA MR","20240918","20200918","7296","cabriolet","2","ZWART","Niet geregistreerd","4","1794","950","1225","1050",,,"20020508","20200918","Geen verstrekking in Open Data",,"Ja","210",,,,,,"2","4",,,,,,"M1",,,,"1225","W3",,,,,,"0.10","245","Nee","Nee",,"Nee",,,,"2023","Geen oordeel","05","Ja","2024-09-18T00:00:00.000","2020-09-18T00:00:00.000","2002-05-08T00:00:00.000","2020-09-18T00:00:00.000",,,,,,,,,,,,,,,,,,,,,,,,,,,,"https://opendata.rdw.nl/resource/3huj-srit.json","https://opendata.rdw.nl/resource/8ys7-d773.json","https://opendata.rdw.nl/resource/vezc-m2t6.json","https://opendata.rdw.nl/resource/jhie-znh9.json","https://opendata.rdw.nl/resource/kmfi-hrps.json"
"J857LS","Personenauto","TOYOTA","TOYOTA MR2,TOYOTA MR","20240731","20201009","6488","cabriolet","2","GRIJS","Niet geregistreerd","4","1794","965","1225","1065",,,"20030822","20200904","Geen verstrekking in Open Data",,"Ja","210",,,,,,"2","4",,,,,,"M1",,,,"1225",,,,,,,"0.10","245","Nee","Nee",,"Nee",,,,"2023","Geen oordeel","05","Ja","2024-07-31T00:00:00.000","2020-10-09T00:00:00.000","2003-08-22T00:00:00.000","2020-09-04T00:00:00.000",,,,,,,,,,,,,,,,,,,,,,,,,,,,"https://opendata.rdw.nl/resource/3huj-srit.json","https://opendata.rdw.nl/resource/8ys7-d773.json","https://opendata.rdw.nl/resource/vezc-m2t6.json","https://opendata.rdw.nl/resource/jhie-znh9.json","https://opendata.rdw.nl/resource/kmfi-hrps.json"
"L569GR","Personenauto","TOYOTA","TOYOTA MR2,TOYOTA MR","20250124","20230708","7078","cabriolet","2","ZWART","Niet geregistreerd","4","1794","990","1225","1090",,,"20040908","20210514","Geen verstrekking in Open Data",,"Ja","210",,,,,,"2","4",,,,,,"M1",,,,"1225","W3",,,,,,"0.09","245","Nee","Nee",,"Nee",,,,"2024","Geen oordeel","05","Ja","2025-01-24T00:00:00.000","2023-07-08T00:00:00.000","2004-09-08T00:00:00.000","2021-05-14T00:00:00.000",,,,,,,,,,,,,,,,,,,,,,,,,,,,"https://opendata.rdw.nl/resource/3huj-srit.json","https://opendata.rdw.nl/resource/8ys7-d773.json","https://opendata.rdw.nl/resource/vezc-m2t6.json","https://opendata.rdw.nl/resource/jhie-znh9.json","https://opendata.rdw.nl/resource/kmfi-hrps.json"
"N409ZD","Personenauto","TOYOTA","TOYOTA MR2,TOYOTA MR","20250418","20220514","9825","cabriolet","2","ZWART","Niet geregistreerd","4","1794","965","1225","1065",,,"20030429","20220108","Geen verstrekking in Open Data",,"Ja","210",,,,,,"2","4",,,,,,"M1",,,,"1225","W3",,,,,,"0.10","244","Nee","Nee",,"Nee",,,,"2024","Geen oordeel","05","Ja","2025-04-18T00:00:00.000","2022-05-14T00:00:00.000","2003-04-29T00:00:00.000","2022-01-08T00:00:00.000",,,,,,,,,,,,,,,,,,,,,,"20220107","2022-01-07T00:00:00.000",,,,,"https://opendata.rdw.nl/resource/3huj-srit.json","https://opendata.rdw.nl/resource/8ys7-d773.json","https://opendata.rdw.nl/resource/vezc-m2t6.json","https://opendata.rdw.nl/resource/jhie-znh9.json","https://opendata.rdw.nl/resource/kmfi-hrps.json"
"NG411P","Personenauto","TOYOTA","TOYOTA MR2,TOYOTA MR","20250213","20170125","6515","cabriolet","2","GRIJS","Niet geregistreerd","4","1794","960","1235","1060",,,"20030310","20170125","Geen verstrekking in Open Data",,"Ja",,,,,,,"2","4",,,,,,"M1",,,"r. schutbord kofferruimte","1235",,,,,,,"0.10","245","Nee","Nee",,"Nee",,,,"2024","Geen oordeel","05","Ja","2025-02-13T00:00:00.000","2017-01-25T00:00:00.000","2003-03-10T00:00:00.000","2017-01-25T00:00:00.000",,,,,,,,,,,,,,,,,,,,,,,,,,,,"https://opendata.rdw.nl/resource/3huj-srit.json","https://opendata.rdw.nl/resource/8ys7-d773.json","https://opendata.rdw.nl/resource/vezc-m2t6.json","https://opendata.rdw.nl/resource/jhie-znh9.json","https://opendata.rdw.nl/resource/kmfi-hrps.json"
"NJ303S","Personenauto","TOYOTA","TOYOTA MR2,TOYOTA MR","20240930","20170217","7296","cabriolet","2","ZWART","Niet geregistreerd","4","1794","990","1225","1090",,,"20040427","20170217","Geen verstrekking in Open Data",,"Ja",,,,,,,"2","4",,,,,,"M1",,,"kofferruimte onder watergoot","1225","W3",,,,,,"0.09","246","Nee","Nee",,"Nee",,,,"2023","Geen oordeel","05","Ja","2024-09-30T00:00:00.000","2017-02-17T00:00:00.000","2004-04-27T00:00:00.000","2017-02-17T00:00:00.000",,,,,,,,,,,,,,,,,,,,,,,,,,,,"https://opendata.rdw.nl/resource/3huj-srit.json","https://opendata.rdw.nl/resource/8ys7-d773.json","https://opendata.rdw.nl/resource/vezc-m2t6.json","https://opendata.rdw.nl/resource/jhie-znh9.json","https://opendata.rdw.nl/resource/kmfi-hrps.json"
"P344GG","Personenauto","TOYOTA","TOYOTA MR2,TOYOTA MR","20241110","20231110","7359","cabriolet","2","ROOD","Niet geregistreerd","4","1794","960","1235","1060",,,"20020523","20231110","Geen verstrekking in Open Data",,"Ja","210",,,,,,"2","4",,,,,,"M1",,,,"1235","W3",,,,,,"0.10","245","Nee","Nee",,"Nee",,,,"2024","Geen oordeel","05","Ja","2024-11-10T00:00:00.000","2023-11-10T00:00:00.000","2002-05-23T00:00:00.000","2023-11-10T00:00:00.000",,,,,,,,,,,,,,,,,,,,,,"20220214","2022-02-14T00:00:00.000",,,,,"https://opendata.rdw.nl/resource/3huj-srit.json","https://opendata.rdw.nl/resource/8ys7-d773.json","https://opendata.rdw.nl/resource/vezc-m2t6.json","https://opendata.rdw.nl/resource/jhie-znh9.json","https://opendata.rdw.nl/resource/kmfi-hrps.json"
"P648LG","Personenauto","TOYOTA","TOYOTA MR2,TOYOTA MR","20240726","20220415","7296","cabriolet","2","GRIJS","Niet geregistreerd","4","1794","965","1225","1065",,,"20031205","20220415","Geen verstrekking in Open Data",,"Ja","210",,,,,,"2","4",,,,,,"M1",,,,"1225",,,,,,,"0.10","245","Nee","Nee",,"Nee",,,,"2023","Geen oordeel","05","Ja","2024-07-26T00:00:00.000","2022-04-15T00:00:00.000","2003-12-05T00:00:00.000","2022-04-15T00:00:00.000",,,,,,,,,,,,,,,,,,,,,,"20220404","2022-04-04T00:00:00.000",,,,,"https://opendata.rdw.nl/resource/3huj-srit.json","https://opendata.rdw.nl/resource/8ys7-d773.json","https://opendata.rdw.nl/resource/vezc-m2t6.json","https://opendata.rdw.nl/resource/jhie-znh9.json","https://opendata.rdw.nl/resource/kmfi-hrps.json"
"R153GJ","Personenauto","TOYOTA","TOYOTA MR2,TOYOTA MR","20250430","20240308","7425","cabriolet","2","GRIJS","Niet geregistreerd","4","1794","990","1225","1090",,,"20051216","20220820","Geen verstrekking in Open Data",,"Ja","210",,,,,,"2","4",,,,,,"M1",,,,"1225","W3",,,,,,"0.09","245","Nee","Nee",,"Nee",,,,"2024","Geen oordeel","05","Ja","2025-04-30T00:00:00.000","2024-03-08T00:00:00.000","2005-12-16T00:00:00.000","2022-08-20T00:00:00.000",,,,,,,,,,,,,,,,,,,,,,"20220810","2022-08-10T00:00:00.000",,,,,"https://opendata.rdw.nl/resource/3huj-srit.json","https://opendata.rdw.nl/resource/8ys7-d773.json","https://opendata.rdw.nl/resource/vezc-m2t6.json","https://opendata.rdw.nl/resource/jhie-znh9.json","https://opendata.rdw.nl/resource/kmfi-hrps.json"
"RB546N","Personenauto","TOYOTA","TOYOTA MR2,TOYOTA MR","20241026","20221029","7143","cabriolet","2","GRIJS","Niet geregistreerd","4","1794","950","1225","1050",,,"20000706","20171018","Geen verstrekking in Open Data",,"Nee",,,,,,,"2","4",,,,,,"M1",,,"schutbord by motorruimte","1225","W3",,,,,,"0.10","245","Nee","Nee",,"Nee","1225",,,"2023","Geen oordeel","05","Ja","2024-10-26T00:00:00.000","2022-10-29T00:00:00.000","2000-07-06T00:00:00.000","2017-10-18T00:00:00.000",,,,,,,,,,,,,,,,,,,,,,,,,,,,"https://opendata.rdw.nl/resource/3huj-srit.json","https://opendata.rdw.nl/resource/8ys7-d773.json","https://opendata.rdw.nl/resource/vezc-m2t6.json","https://opendata.rdw.nl/resource/jhie-znh9.json","https://opendata.rdw.nl/resource/kmfi-hrps.json"
"RF898H","Personenauto","TOYOTA","TOYOTA MR2,TOYOTA MR","20241102","20220924","7199","cabriolet","2","ZWART","Niet geregistreerd","4","1794","950","1225","1050",,,"20000915","20171031","Geen verstrekking in Open Data",,"Ja",,,,,,,"2","4",,,,,,"M1",,,,"1225","W3",,,,,,"0.10","245","Nee","Nee",,"Nee",,,,"2023","Geen oordeel","05","Ja","2024-11-02T00:00:00.000","2022-09-24T00:00:00.000","2000-09-15T00:00:00.000","2017-10-31T00:00:00.000",,,,,,,,,,,,,,,,,,,,,,,,,,,,"https://opendata.rdw.nl/resource/3huj-srit.json","https://opendata.rdw.nl/resource/8ys7-d773.json","https://opendata.rdw.nl/resource/vezc-m2t6.json","https://opendata.rdw.nl/resource/jhie-znh9.json","https://opendata.rdw.nl/resource/kmfi-hrps.json"
"SR541H","Personenauto","TOYOTA","TOYOTA MR2,TOYOTA MR","20250429","20190423","7942","cabriolet","2","BLAUW","Niet geregistreerd","4","1794","950","1225","1050",,,"20000607","20180518","Geen verstrekking in Open Data",,"Ja",,,,,,,"2","4",,,,,,"M1",,,"v. by schutbord","1225","W3",,,,,,"0.10","145","Nee","Nee",,"Nee","1225",,,"2024","Geen oordeel","05","Ja","2025-04-29T00:00:00.000","2019-04-23T00:00:00.000","2000-06-07T00:00:00.000","2018-05-18T00:00:00.000",,,,,,,,,,,,,,,,,,,,,,,,,,,,"https://opendata.rdw.nl/resource/3huj-srit.json","https://opendata.rdw.nl/resource/8ys7-d773.json","https://opendata.rdw.nl/resource/vezc-m2t6.json","https://opendata.rdw.nl/resource/jhie-znh9.json","https://opendata.rdw.nl/resource/kmfi-hrps.json"
"TN454J","Personenauto","TOYOTA","TOYOTA MR2,TOYOTA MR","20230519","20180906","254","cabriolet","2","GRIJS","Niet geregistreerd","4","1794","1005","1235","1105",,,"20050228","20180906","Geen verstrekking in Open Data","37815","Ja",,,,,,,"2","4",,,,,,"M1",,,,"1235",,,,,,,"0.09","245","Nee","Nee",,"Nee",,,,"2023","Geen oordeel","05","Ja","2023-05-19T00:00:00.000","2018-09-06T00:00:00.000","2005-02-28T00:00:00.000","2018-09-06T00:00:00.000",,,,,,,,,,,,,,,,,,,,,,,,,,,,"https://opendata.rdw.nl/resource/3huj-srit.json","https://opendata.rdw.nl/resource/8ys7-d773.json","https://opendata.rdw.nl/resource/vezc-m2t6.json","https://opendata.rdw.nl/resource/jhie-znh9.json","https://opendata.rdw.nl/resource/kmfi-hrps.json"
"TZ532P","Personenauto","TOYOTA","TOYOTA MR2,TOYOTA MR","20250428","20181116","7349","cabriolet","2","GRIJS","Niet geregistreerd","4","1794","965","1225","1065",,,"20031015","20181116","Geen verstrekking in Open Data",,"Ja",,,,,,,"2","4",,,,,,"M1",,,,"1225","W3",,,,,,"0.10","244","Nee","Nee",,"Nee",,,,"2024","Geen oordeel","05","Ja","2025-04-28T00:00:00.000","2018-11-16T00:00:00.000","2003-10-15T00:00:00.000","2018-11-16T00:00:00.000",,,,,,,,,,,,,,,,,,,,,,,,,,,,"https://opendata.rdw.nl/resource/3huj-srit.json","https://opendata.rdw.nl/resource/8ys7-d773.json","https://opendata.rdw.nl/resource/vezc-m2t6.json","https://opendata.rdw.nl/resource/jhie-znh9.json","https://opendata.rdw.nl/resource/kmfi-hrps.json"
"XL470D","Personenauto","TOYOTA","TOYOTA MR2,TOYOTA MR","20220527","20190209","6828","cabriolet","2","GRIJS","Niet geregistreerd","4","1794","990","1225","1090",,,"20040823","20190209","Geen verstrekking in Open Data",,"Nee",,,,,,,"2","4",,,,,,"M1",,,"r. schutbord by motorruimte","1225",,,,,,,"0.09","245","Nee","Nee",,"Nee",,,,"2021","Geen oordeel","05","Ja","2022-05-27T00:00:00.000","2019-02-09T00:00:00.000","2004-08-23T00:00:00.000","2019-02-09T00:00:00.000",,,,,,,,,,,,,,,,,,,,,,,,,,,,"https://opendata.rdw.nl/resource/3huj-srit.json","https://opendata.rdw.nl/resource/8ys7-d773.json","https://opendata.rdw.nl/resource/vezc-m2t6.json","https://opendata.rdw.nl/resource/jhie-znh9.json","https://opendata.rdw.nl/resource/kmfi-hrps.json"
"ZG484P","Personenauto","TOYOTA","TOYOTA MR2,TOYOTA MR","20240804","20190808","7119","cabriolet","2","GRIJS","Niet geregistreerd","4","1794","990","1225","1090",,,"20050401","20190517","Geen verstrekking in Open Data",,"Ja",,,,,,,"2","4",,,,,,"M1",,,,"1225",,,,,,,"0.09","245","Nee","Nee",,"Nee",,,,"2023","Geen oordeel","05","Ja","2024-08-04T00:00:00.000","2019-08-08T00:00:00.000","2005-04-01T00:00:00.000","2019-05-17T00:00:00.000",,,,,,,,,,,,,,,,,,,,,,,,,,,,"https://opendata.rdw.nl/resource/3huj-srit.json","https://opendata.rdw.nl/resource/8ys7-d773.json","https://opendata.rdw.nl/resource/vezc-m2t6.json","https://opendata.rdw.nl/resource/jhie-znh9.json","https://opendata.rdw.nl/resource/kmfi-hrps.json"
"ZH806S","Personenauto","TOYOTA","TOYOTA MR2,TOYOTA MR","20230531","20190601","6974","cabriolet","2","ZWART","Niet geregistreerd","4","1794","950","1225","1050",,,"20000818","20190601","Geen verstrekking in Open Data",,"Ja",,,,,,,"2","4",,,,,,"M1",,,,"1225","W3",,,,,,"0.10","245","Nee","Nee",,"Nee",,,,"2022","Geen oordeel","05","Ja","2023-05-31T00:00:00.000","2019-06-01T00:00:00.000","2000-08-18T00:00:00.000","2019-06-01T00:00:00.000",,,,,,,,,,,,,,,,,,,,,,,,,,,,"https://opendata.rdw.nl/resource/3huj-srit.json","https://opendata.rdw.nl/resource/8ys7-d773.json","https://opendata.rdw.nl/resource/vezc-m2t6.json","https://opendata.rdw.nl/resource/jhie-znh9.json","https://opendata.rdw.nl/resource/kmfi-hrps.json"
"TF652D","Personenauto","TOYOTA","TOYOTA MR2,TOYOTA MR","20250507","20210609","7352","cabriolet","2","ZWART","Niet geregistreerd","4","1794","950","1225","1050",,,"20010531","20180710","Geen verstrekking in Open Data",,"Ja",,,,,,,"2","4",,,,,,"M1",,,"midden tegen schutbord in kofferruimte","1225","W3",,,,,,"0.10","245","Nee","Nee",,"Nee",,,,"2024","Geen oordeel","05","Ja","2025-05-07T00:00:00.000","2021-06-09T00:00:00.000","2001-05-31T00:00:00.000","2018-07-10T00:00:00.000",,,,,,,,,,,,,,,,,,,,,,,,,,,,"https://opendata.rdw.nl/resource/3huj-srit.json","https://opendata.rdw.nl/resource/8ys7-d773.json","https://opendata.rdw.nl/resource/vezc-m2t6.json","https://opendata.rdw.nl/resource/jhie-znh9.json","https://opendata.rdw.nl/resource/kmfi-hrps.json"
