"kenteken","voertuigsoort","merk","handelsbenaming","vervaldatum_apk","datum_tenaamstelling","bruto_bpm","inrichting","aantal_zitplaatsen","eerste_kleur","tweede_kleur","aantal_cilinders","cilinderinhoud","massa_ledig_voertuig","toegestane_maximum_massa_voertuig","massa_rijklaar","maximum_massa_trekken_ongeremd","maximum_trekken_massa_geremd","datum_eerste_toelating","datum_eerste_tenaamstelling_in_nederland","wacht_op_keuren","catalogusprijs","wam_verzekerd","maximale_constructiesnelheid","laadvermogen","oplegger_geremd","aanhangwagen_autonoom_geremd","aanhangwagen_middenas_geremd","aantal_staanplaatsen","aantal_deuren","aantal_wielen","afstand_hart_koppeling_tot_achterzijde_voertuig","afstand_voorzijde_voertuig_tot_hart_koppeling","afwijkende_maximum_snelheid","lengte","breedte","europese_voertuigcategorie","europese_voertuigcategorie_toevoeging","europese_uitvoeringcategorie_toevoeging","plaats_chassisnummer","technische_max_massa_voertuig","type","type_gasinstallatie","typegoedkeuringsnummer","variant","uitvoering","volgnummer_wijziging_eu_typegoedkeuring","vermogen_massarijklaar","wielbasis","export_indicator","openstaande_terugroepactie_indicator","vervaldatum_tachograaf","taxi_indicator","maximum_massa_samenstelling","aantal_rolstoelplaatsen","maximum_ondersteunende_snelheid","jaar_laatste_registratie_tellerstand","tellerstandoordeel","code_toelichting_tellerstandoordeel","tenaamstellen_mogelijk","vervaldatum_apk_dt","datum_tenaamstelling_dt","datum_eerste_toelating_dt","datum_eerste_tenaamstelling_in_nederland_dt","vervaldatum_tachograaf_dt","maximum_last_onder_de_vooras_sen_tezamen_koppeling","type_remsysteem_voertuig_code","rupsonderstelconfiguratiecode","wielbasis_voertuig_minimum","wielbasis_voertuig_maximum","lengte_voertuig_minimum","lengte_voertuig_maximum","breedte_voertuig_minimum","breedte_voertuig_maximum","hoogte_voertuig","hoogte_voertuig_minimum","hoogte_voertuig_maximum","massa_bedrijfsklaar_minimaal","massa_bedrijfsklaar_maximaal","technisch_toelaatbaar_massa_koppelpunt","maximum_massa_technisch_maximaal","maximum_massa_technisch_minimaal","subcategorie_nederland","verticale_belasting_koppelpunt_getrokken_voertuig","zuinigheidsclassificatie","registratie_datum_goedkeuring_afschrijvingsmoment_bpm","registratie_datum_goedkeuring_afschrijvingsmoment_bpm_dt","gem_lading_wrde","aerodyn_voorz","massa_alt_aandr","verl_cab_ind","api_gekentekende_voertuigen_assen","api_gekentekende_voertuigen_brandstof","api_gekentekende_voertuigen_carrosserie","api_gekentekende_voertuigen_carrosserie_specifiek","api_gekentekende_voertuigen_voertuigklasse"
"VJ015N","Bedrijfsauto","TOYOTA","TOYOTA PROACE DUBBELE CABINE","20240926","20140627","9422","gesloten opbouw","6","N.v.t.","N.v.t.","4","1997","1795","2932","1895","750",,"20140627","20140627","Geen verstrekking in Open Data","38788","Ja",,"1137",,,"2000",,"0","4","0","0",,"0","190","N1",,,"r. schutbord","2932","X",,"e4*NKS*0079*00","UAHZ","MDX331L-LPZSPW(1CDCAB00)","0","0.05","312","Nee","Nee",,"Nee","4932","0","0.00","2023","Logisch","00","Ja","2024-09-26T00:00:00.000","2014-06-27T00:00:00.000","2014-06-27T00:00:00.000","2014-06-27T00:00:00.000",,"0",,,,,,,,,,,,,,,,,,,,,,,,,,"https://opendata.rdw.nl/resource/3huj-srit.json","https://opendata.rdw.nl/resource/8ys7-d773.json","https://opendata.rdw.nl/resource/vezc-m2t6.json","https://opendata.rdw.nl/resource/jhie-znh9.json","https://opendata.rdw.nl/resource/kmfi-hrps.json"
"VJ309B","Bedrijfsauto","TOYOTA","TOYOTA PROACE DUBBELE CABINE","20250508","20180419","8685","gesloten opbouw","6","N.v.t.","N.v.t.","4","1560","1755","2880","1855","750",,"20140502","20140502","Geen verstrekking in Open Data","35686","Ja",,"1125",,,"1453",,"0","4","0","0",,"0","190","N1",,,"r. schutbord","2880","X",,"e4*NKS*0079*00","U9HM","MDX931L-LPMSGW(1BDCAB00)","0","0.04","312","Nee","Nee",,"Nee","4333","0","0.00","2024","Logisch","00","Ja","2025-05-08T00:00:00.000","2018-04-19T00:00:00.000","2014-05-02T00:00:00.000","2014-05-02T00:00:00.000",,"0",,,,,,,,,,,,,,,,,,,,,,,,,,"https://opendata.rdw.nl/resource/3huj-srit.json","https://opendata.rdw.nl/resource/8ys7-d773.json","https://opendata.rdw.nl/resource/vezc-m2t6.json","https://opendata.rdw.nl/resource/jhie-znh9.json","https://opendata.rdw.nl/resource/kmfi-hrps.json"
"VJ310B","Bedrijfsauto","TOYOTA","TOYOTA PROACE DUBBELE CABINE","20240613","20180601","8685","gesloten opbouw","6","N.v.t.","N.v.t.","4","1560","1755","2880","1855","750",,"20140502","20140502","Geen verstrekking in Open Data","35686","Ja",,"1125",,,"1453",,"0","4","0","0",,"0","190","N1",,,"r. schutbord","2880","X",,"e4*NKS*0079*00","U9HM","MDX931L-LPMSGW(1CDCAB00)","0","0.04","312","Nee","Nee",,"Nee","4333","0","0.00","2023","Logisch","00","Ja","2024-06-13T00:00:00.000","2018-06-01T00:00:00.000","2014-05-02T00:00:00.000","2014-05-02T00:00:00.000",,"0",,,,,,,,,,,,,,,,,,,,,,,,,,"https://opendata.rdw.nl/resource/3huj-srit.json","https://opendata.rdw.nl/resource/8ys7-d773.json","https://opendata.rdw.nl/resource/vezc-m2t6.json","https://opendata.rdw.nl/resource/jhie-znh9.json","https://opendata.rdw.nl/resource/kmfi-hrps.json"
"VJ475H","Bedrijfsauto","TOYOTA","TOYOTA PROACE DUBBELE CABINE","20250612","20200613","10438","gesloten opbouw","6","N.v.t.","N.v.t.","4","1997","1836","2973","1936","750",,"20140527","20140527","Geen verstrekking in Open Data","43065","Ja",,"1137",,,"2000",,"0","4","0","0",,"0","190","N1",,,"r. schutbord","2973","X",,"e4*NKS*0079*00","URHH","MDX631L-LPHDGW(1CDCAB00)","0","0.06","312","Nee","Nee",,"Nee","4973","0","0.00","2024","Onlogisch","04","Ja","2025-06-12T00:00:00.000","2020-06-13T00:00:00.000","2014-05-27T00:00:00.000","2014-05-27T00:00:00.000",,"0",,,,,,,,,,,,,,,,,,,,,,,,,,"https://opendata.rdw.nl/resource/3huj-srit.json","https://opendata.rdw.nl/resource/8ys7-d773.json","https://opendata.rdw.nl/resource/vezc-m2t6.json","https://opendata.rdw.nl/resource/jhie-znh9.json","https://opendata.rdw.nl/resource/kmfi-hrps.json"
"VJ561N","Bedrijfsauto","TOYOTA","TOYOTA PROACE DUBBELE CABINE","20240720","20140621","9545","gesloten opbouw","6","N.v.t.","N.v.t.","4","1997","1795","2932","1895","750",,"20140621","20140621","Geen verstrekking in Open Data","39304","Ja",,"1137",,,"2000",,"0","4","0","0",,"0","190","N1",,,"r. schutbord","2932","X",,"e4*NKS*0079*00","UAHZ","MDX331L-LPZSGW(1CDCAB00)","0","0.05","312","Nee","Nee",,"Nee","4932","0","0.00","2023","Logisch","00","Ja","2024-07-20T00:00:00.000","2014-06-21T00:00:00.000","2014-06-21T00:00:00.000","2014-06-21T00:00:00.000",,"0",,,,,,,,,,,,,,,,,,,,,,,,,,"https://opendata.rdw.nl/resource/3huj-srit.json","https://opendata.rdw.nl/resource/8ys7-d773.json","https://opendata.rdw.nl/resource/vezc-m2t6.json","https://opendata.rdw.nl/resource/jhie-znh9.json","https://opendata.rdw.nl/resource/kmfi-hrps.json"
"VJ735F","Bedrijfsauto","TOYOTA","TOYOTA PROACE DUBBELE CABINE","20250219","20220228","10076","gesloten opbouw","6","N.v.t.","N.v.t.","4","1997","1827","2964","1927","750",,"20140522","20140522","Geen verstrekking in Open Data","41542","Ja",,"1137",,,"2000",,"0","4","0","0",,"0","190","N1",,,"r. schutbord","2964","X",,"e4*NKS*0079*00","VAHZ","MDX331L-HPZSPW(1CDCAB00)","0","0.05","312","Nee","Nee",,"Nee","4964","0","0.00","2024","Logisch","00","Ja","2025-02-19T00:00:00.000","2022-02-28T00:00:00.000","2014-05-22T00:00:00.000","2014-05-22T00:00:00.000",,"0",,,,,,,,,,,,,,,,,,,,,,,,,,"https://opendata.rdw.nl/resource/3huj-srit.json","https://opendata.rdw.nl/resource/8ys7-d773.json","https://opendata.rdw.nl/resource/vezc-m2t6.json","https://opendata.rdw.nl/resource/jhie-znh9.json","https://opendata.rdw.nl/resource/kmfi-hrps.json"
"VJ800G","Bedrijfsauto","TOYOTA","TOYOTA PROACE DUBBELE CABINE","20240805","20211011","10655","gesloten opbouw","6","N.v.t.","N.v.t.","4","1997","1819","2950","1919","750",,"20140523","20140523","Geen verstrekking in Open Data","43978","Ja",,"1131",,,"1800",,"0","4","0","0",,"0","190","N1",,,"r. schutbord","2950","X",,"e4*NKS*0079*00","URHH","MDX631L-LPASPW(1CDCAB00)","0","0.06","312","Nee","Nee",,"Nee","4750","0","0.00","2023","Logisch","00","Ja","2024-08-05T00:00:00.000","2021-10-11T00:00:00.000","2014-05-23T00:00:00.000","2014-05-23T00:00:00.000",,"0",,,,,,,,,,,,,,,,,,,,,,,,,,"https://opendata.rdw.nl/resource/3huj-srit.json","https://opendata.rdw.nl/resource/8ys7-d773.json","https://opendata.rdw.nl/resource/vezc-m2t6.json","https://opendata.rdw.nl/resource/jhie-znh9.json","https://opendata.rdw.nl/resource/kmfi-hrps.json"
"VK284H","Bedrijfsauto","TOYOTA","TOYOTA PROACE DUBBELE CABINE","20250601","20190223","9515","gesloten opbouw","6","N.v.t.","N.v.t.","4","1997","1795","2932","1895","750",,"20140911","20140911","Geen verstrekking in Open Data","39178","Ja",,"1137",,,"2000",,"0","4","0","0",,"514","190","N1",,,"r. schutbord","2932","X",,"e4*NKS*0079*01","UAHZ","MDX331L-LPZSGW(1DDCAB01)","0","0.05","312","Nee","Nee",,"Nee","4932","0","0.00","2024","Logisch","00","Ja","2025-06-01T00:00:00.000","2019-02-23T00:00:00.000","2014-09-11T00:00:00.000","2014-09-11T00:00:00.000",,"0",,,,,,,,,,,,,,,,,,,,,,,,,,"https://opendata.rdw.nl/resource/3huj-srit.json","https://opendata.rdw.nl/resource/8ys7-d773.json","https://opendata.rdw.nl/resource/vezc-m2t6.json","https://opendata.rdw.nl/resource/jhie-znh9.json","https://opendata.rdw.nl/resource/kmfi-hrps.json"
"VK287H","Bedrijfsauto","TOYOTA","TOYOTA PROACE DUBBELE CABINE","20240126","20230227","9788","gesloten opbouw","6","N.v.t.","N.v.t.","4","1997","1795","2932","1895","750",,"20140916","20140916","Geen verstrekking in Open Data","40328","Nee",,"1137",,,"2000",,"0","4","0","0",,"514","190","N1",,,"r. schutbord","2932","X",,"e4*NKS*0079*01","UAHZ","MDX331L-LPZDPW(1DDCAB01)","0","0.05","312","Nee","Nee",,"Nee","4932","0","0.00","2023","Logisch","00","Ja","2024-01-26T00:00:00.000","2023-02-27T00:00:00.000","2014-09-16T00:00:00.000","2014-09-16T00:00:00.000",,"0",,,,,,,,,,,,,,,,,,,,,,,,,,"https://opendata.rdw.nl/resource/3huj-srit.json","https://opendata.rdw.nl/resource/8ys7-d773.json","https://opendata.rdw.nl/resource/vezc-m2t6.json","https://opendata.rdw.nl/resource/jhie-znh9.json","https://opendata.rdw.nl/resource/kmfi-hrps.json"
"VK581D","Bedrijfsauto","TOYOTA","TOYOTA PROACE DUBBELE CABINE","20240828","20180502","9692","gesloten opbouw","6","N.v.t.","N.v.t.","4","1997","1795","2932","1895","750",,"20140826","20140826","Geen verstrekking in Open Data","39923","Ja",,"1137",,,"2000",,"0","4","0","0",,"514","190","N1",,,"r. schutbord","2932","X",,"e4*NKS*0079*01","UAHZ","MDX331L-LPZSGW(1DDCAB01)","0","0.05","312","Nee","Nee",,"Nee","4932","0","0.00","2024","Logisch","00","Ja","2024-08-28T00:00:00.000","2018-05-02T00:00:00.000","2014-08-26T00:00:00.000","2014-08-26T00:00:00.000",,"0",,,,,,,,,,,,,,,,,,,,,,,,,,"https://opendata.rdw.nl/resource/3huj-srit.json","https://opendata.rdw.nl/resource/8ys7-d773.json","https://opendata.rdw.nl/resource/vezc-m2t6.json","https://opendata.rdw.nl/resource/jhie-znh9.json","https://opendata.rdw.nl/resource/kmfi-hrps.json"
"VL852J","Bedrijfsauto","TOYOTA","TOYOTA PROACE DUBBELE CABINE","20241230","20141230","9515","gesloten opbouw","6","N.v.t.","N.v.t.","4","1997","1795","2932","1895","750",,"20141230","20141230","Geen verstrekking in Open Data","39178","Ja",,"1137",,"2000","2000",,"0","4","0","0",,"514","190","N1",,,"r. schutbord","2932","X",,"e4*NKS*0079*02","UAHZ","MDX331L-LPZDPW(1EDCAB02)","0","0.05","312","Nee","Nee",,"Nee","4932","0",,"2023","Logisch","00","Ja","2024-12-30T00:00:00.000","2014-12-30T00:00:00.000","2014-12-30T00:00:00.000","2014-12-30T00:00:00.000",,"0",,,,,,,,,,,,,,,,,,,,,,,,,,"https://opendata.rdw.nl/resource/3huj-srit.json","https://opendata.rdw.nl/resource/8ys7-d773.json","https://opendata.rdw.nl/resource/vezc-m2t6.json","https://opendata.rdw.nl/resource/jhie-znh9.json","https://opendata.rdw.nl/resource/kmfi-hrps.json"
"VN269G","Bedrijfsauto","TOYOTA","TOYOTA PROACE DUBBELE CABINE","20250319","20180319","11769","gesloten opbouw","6","N.v.t.","N.v.t.","4","1997","1836","2950","1936","750",,"20150306","20150306","Geen verstrekking in Open Data","48667","Ja",,"1114",,"1800","1800",,"0","4","0","0",,"514","190","N1",,,"r. schutbord","2950","X",,"e4*NKS*0079*02","URHH","MDX631L-LPASPW(1EDCAB02)","0","0.06","312","Nee","Nee",,"Nee","4750","0",,"2024","Logisch","00","Ja","2025-03-19T00:00:00.000","2018-03-19T00:00:00.000","2015-03-06T00:00:00.000","2015-03-06T00:00:00.000",,"0",,,,,,,,,,,,,,,,,,,,,,,,,,"https://opendata.rdw.nl/resource/3huj-srit.json","https://opendata.rdw.nl/resource/8ys7-d773.json","https://opendata.rdw.nl/resource/vezc-m2t6.json","https://opendata.rdw.nl/resource/jhie-znh9.json","https://opendata.rdw.nl/resource/kmfi-hrps.json"
"VN291R","Bedrijfsauto","TOYOTA","TOYOTA PROACE DUBBELE CABINE","20250410","20240315","9647","gesloten opbouw","6","N.v.t.","N.v.t.","4","1560","1755","2880","1855","750",,"20150409","20150409","Geen verstrekking in Open Data","39734","Ja",,"1125",,"1453","1453",,"0","4","0","0",,"514","190","N1",,,"r. schutbord","2880","X",,"e4*NKS*0079*02","U9HM","MDX931L-LPMDTW(1EDCAB02)","0","0.04","312","Nee","Nee",,"Nee","4333","0",,"2024","Logisch","00","Ja","2025-04-10T00:00:00.000","2024-03-15T00:00:00.000","2015-04-09T00:00:00.000","2015-04-09T00:00:00.000",,"0",,,,,,,,,,,,,,,,,,,,,,,,,,"https://opendata.rdw.nl/resource/3huj-srit.json","https://opendata.rdw.nl/resource/8ys7-d773.json","https://opendata.rdw.nl/resource/vezc-m2t6.json","https://opendata.rdw.nl/resource/jhie-znh9.json","https://opendata.rdw.nl/resource/kmfi-hrps.json"
"VN602T","Bedrijfsauto","TOYOTA","TOYOTA PROACE DUBBELE CABINE","20241121","20231030","12211","gesloten opbouw","6","N.v.t.","N.v.t.","4","1997","1836","2950","1936","750",,"20150520","20150520","Geen verstrekking in Open Data","50529","Ja",,"1114",,"1800","1800",,"0","4","0","0",,"514","190","N1",,,"r. schutbord","2950","X",,"e4*NKS*0079*02","URHH","MDX631L-LPASPW(1EDCAB02)","0","0.06","312","Nee","Nee",,"Nee","4750","0",,"2023","Logisch","00","Ja","2024-11-21T00:00:00.000","2023-10-30T00:00:00.000","2015-05-20T00:00:00.000","2015-05-20T00:00:00.000",,"0",,,,,,,,,,,,,,,,,,,,,,,,,,"https://opendata.rdw.nl/resource/3huj-srit.json","https://opendata.rdw.nl/resource/8ys7-d773.json","https://opendata.rdw.nl/resource/vezc-m2t6.json","https://opendata.rdw.nl/resource/jhie-znh9.json","https://opendata.rdw.nl/resource/kmfi-hrps.json"
"VN858B","Bedrijfsauto","TOYOTA","TOYOTA PROACE DUBBELE CABINE","20250226","20191227","9726","gesloten opbouw","6","N.v.t.","N.v.t.","4","1560","1755","2880","1855","750",,"20150226","20150226","Geen verstrekking in Open Data","40067","Ja",,"1125",,"1453","1453",,"0","4","0","0",,"514","190","N1",,,"r. schutbord","2880","X",,"e4*NKS*0079*02","U9HM","MDX931L-LPMDTW(1EDCAB02)","0","0.04","312","Nee","Nee",,"Nee","4333","0",,"2024","Logisch","00","Ja","2025-02-26T00:00:00.000","2019-12-27T00:00:00.000","2015-02-26T00:00:00.000","2015-02-26T00:00:00.000",,"0",,,,,,,,,,,,,,,,,,,,,,,,,,"https://opendata.rdw.nl/resource/3huj-srit.json","https://opendata.rdw.nl/resource/8ys7-d773.json","https://opendata.rdw.nl/resource/vezc-m2t6.json","https://opendata.rdw.nl/resource/jhie-znh9.json","https://opendata.rdw.nl/resource/kmfi-hrps.json"
"VP026P","Bedrijfsauto","TOYOTA","TOYOTA PROACE DUBBELE CABINE","20240630","20190215","10619","gesloten opbouw","6","N.v.t.","N.v.t.","4","1997","1795","2932","1895","750",,"20150630","20150630","Geen verstrekking in Open Data","43827","Ja",,"1137",,"2000","2000",,"0","4","0","0",,"514","190","N1",,,"r. schutbord","2932","X",,"e4*NKS*0079*02","UAHZ","MDX331L-LPZSTW(1EDCAB02)","0","0.05","312","Nee","Nee",,"Nee","4932","0",,"2023","Logisch","00","Ja","2024-06-30T00:00:00.000","2019-02-15T00:00:00.000","2015-06-30T00:00:00.000","2015-06-30T00:00:00.000",,"0",,,,,,,,,,,,,,,,,,,,,,,,,,"https://opendata.rdw.nl/resource/3huj-srit.json","https://opendata.rdw.nl/resource/8ys7-d773.json","https://opendata.rdw.nl/resource/vezc-m2t6.json","https://opendata.rdw.nl/resource/jhie-znh9.json","https://opendata.rdw.nl/resource/kmfi-hrps.json"
"VP461X","Bedrijfsauto","TOYOTA","TOYOTA PROACE DUBBELE CABINE","20240723","20160909","12119","gesloten opbouw","6","N.v.t.","N.v.t.","4","1997","1827","2950","1927","750",,"20150722","20150722","Geen verstrekking in Open Data","50141","Ja",,"1123",,"1800","1800",,"0","4","0","0",,"514","190","N1",,,"r. schutbord","2950","X",,"e4*NKS*0079*02","URHH","MDX631L-LPADGW(1EDCAB02)","0","0.06","312","Nee","Nee",,"Nee","4750","0",,"2024","Logisch","00","Ja","2024-07-23T00:00:00.000","2016-09-09T00:00:00.000","2015-07-22T00:00:00.000","2015-07-22T00:00:00.000",,"0",,,,,,,,,,,,,,,,,,,,,,,,,,"https://opendata.rdw.nl/resource/3huj-srit.json","https://opendata.rdw.nl/resource/8ys7-d773.json","https://opendata.rdw.nl/resource/vezc-m2t6.json","https://opendata.rdw.nl/resource/jhie-znh9.json","https://opendata.rdw.nl/resource/kmfi-hrps.json"
"VP581T","Bedrijfsauto","TOYOTA","TOYOTA PROACE DUBBELE CABINE","20250503","20240424","9776","gesloten opbouw","6","N.v.t.","N.v.t.","4","1560","1755","2880","1855","750",,"20150713","20150713","Geen verstrekking in Open Data","40278","Ja",,"1125",,"1453","1453",,"0","4","0","0",,"514","190","N1",,,"r. schutbord","2880","X",,"e4*NKS*0079*02","U9HM","MDX931L-LPMDTW(1EDCAB02)","0","0.04","312","Nee","Nee",,"Nee","4333","0",,"2024","Logisch","00","Ja","2025-05-03T00:00:00.000","2024-04-24T00:00:00.000","2015-07-13T00:00:00.000","2015-07-13T00:00:00.000",,"0",,,,,,,,,,,,,,,,,,,,,,,,,,"https://opendata.rdw.nl/resource/3huj-srit.json","https://opendata.rdw.nl/resource/8ys7-d773.json","https://opendata.rdw.nl/resource/vezc-m2t6.json","https://opendata.rdw.nl/resource/jhie-znh9.json","https://opendata.rdw.nl/resource/kmfi-hrps.json"
"VP890R","Bedrijfsauto","TOYOTA","TOYOTA PROACE DUBBELE CABINE","20240809","20200626","10516","gesloten opbouw","6","N.v.t.","N.v.t.","4","1997","1795","2932","1895","750",,"20150717","20150717","Geen verstrekking in Open Data","43392","Ja",,"1137",,"2000","2000",,"0","4","0","0",,"514","190","N1",,,"r. schutbord","2932","X",,"e4*NKS*0079*02","UAHZ","MDX331L-LPZSTW(1EDCAB02)","0","0.05","312","Nee","Nee",,"Nee","4932","0",,"2023","Logisch","00","Ja","2024-08-09T00:00:00.000","2020-06-26T00:00:00.000","2015-07-17T00:00:00.000","2015-07-17T00:00:00.000",,"0",,,,,,,,,,,,,,,,,,,,,,,,,,"https://opendata.rdw.nl/resource/3huj-srit.json","https://opendata.rdw.nl/resource/8ys7-d773.json","https://opendata.rdw.nl/resource/vezc-m2t6.json","https://opendata.rdw.nl/resource/jhie-znh9.json","https://opendata.rdw.nl/resource/kmfi-hrps.json"
"VR067J","Bedrijfsauto","TOYOTA","TOYOTA PROACE DUBBELE CABINE","20240918","20191113","10615","gesloten opbouw","6","N.v.t.","N.v.t.","4","1997","1795","2932","1895","750",,"20150904","20150904","Geen verstrekking in Open Data","43809","Ja",,"1137",,"2000","2000",,"0","4","0","0",,"514","190","N1",,,"r. schutbord","2932","X",,"e4*NKS*0079*02","UAHZ","MDX331L-LPZDGW(1EDCAB02)","0","0.05","312","Nee","Nee",,"Nee","4932","0",,"2024","Logisch","00","Ja","2024-09-18T00:00:00.000","2019-11-13T00:00:00.000","2015-09-04T00:00:00.000","2015-09-04T00:00:00.000",,"0",,,,,,,,,,,,,,,,,,,,,,,,,,"https://opendata.rdw.nl/resource/3huj-srit.json","https://opendata.rdw.nl/resource/8ys7-d773.json","https://opendata.rdw.nl/resource/vezc-m2t6.json","https://opendata.rdw.nl/resource/jhie-znh9.json","https://opendata.rdw.nl/resource/kmfi-hrps.json"
"VR095P","Bedrijfsauto","TOYOTA","TOYOTA PROACE DUBBELE CABINE","20250311","20220401","10359","gesloten opbouw","6","N.v.t.","N.v.t.","4","1997","1795","2932","1895","750",,"20150925","20150925","Geen verstrekking in Open Data","42733","Ja",,"1137",,,"2000",,"0","4","0","0",,"514","190","N1",,,"in motorruimte a.","2932","X",,"e4*NKS*0079*02","UAHZ","MDX331L-LPZSTW(1EDCAB02)","0","0.05","312","Nee","Nee",,"Nee","4932","0",,"2024","Logisch","00","Ja","2025-03-11T00:00:00.000","2022-04-01T00:00:00.000","2015-09-25T00:00:00.000","2015-09-25T00:00:00.000",,,,,,,,,,,,,,,,,,,,,,,,,,,,"https://opendata.rdw.nl/resource/3huj-srit.json","https://opendata.rdw.nl/resource/8ys7-d773.json","https://opendata.rdw.nl/resource/vezc-m2t6.json","https://opendata.rdw.nl/resource/jhie-znh9.json","https://opendata.rdw.nl/resource/kmfi-hrps.json"
"VR108Z","Bedrijfsauto","TOYOTA","TOYOTA PROACE DUBBELE CABINE","20241112","20151112","11748","gesloten opbouw","6","N.v.t.","N.v.t.","4","1997","1836","2950","1936","750",,"20151112","20151112","Geen verstrekking in Open Data","48580","Ja",,"1114",,,"1800",,"0","4","0","0",,"514","190","N1",,,"in motorruimte a.","2950","X",,"e4*NKS*0079*03","URHH","MDX631L-LPASGW(1FDCAB03)","0","0.06","312","Nee","Nee",,"Nee","4750","0","0.00","2023","Logisch","00","Ja","2024-11-12T00:00:00.000","2015-11-12T00:00:00.000","2015-11-12T00:00:00.000","2015-11-12T00:00:00.000",,,,,,,,,,,,,,,,,,,,,,,,,,,,"https://opendata.rdw.nl/resource/3huj-srit.json","https://opendata.rdw.nl/resource/8ys7-d773.json","https://opendata.rdw.nl/resource/vezc-m2t6.json","https://opendata.rdw.nl/resource/jhie-znh9.json","https://opendata.rdw.nl/resource/kmfi-hrps.json"
"VR413J","Bedrijfsauto","TOYOTA","TOYOTA PROACE DUBBELE CABINE","20241122","20210822","11592","gesloten opbouw","6","N.v.t.","N.v.t.","4","1997","1836","2950","1936","750",,"20150918","20150918","Geen verstrekking in Open Data","47922","Ja",,"1114",,"1800","1800",,"0","4","0","0",,"514","190","N1",,,"r. schutbord","2950","X",,"e4*NKS*0079*03","URHH","MDX631L-LPASTW(1FDCAB03)","0","0.06","312","Nee","Nee",,"Nee","4750","0",,"2023","Onlogisch","04","Ja","2024-11-22T00:00:00.000","2021-08-22T00:00:00.000","2015-09-18T00:00:00.000","2015-09-18T00:00:00.000",,"0",,,,,,,,,,,,,,,,,,,,,,,,,,"https://opendata.rdw.nl/resource/3huj-srit.json","https://opendata.rdw.nl/resource/8ys7-d773.json","https://opendata.rdw.nl/resource/vezc-m2t6.json","https://opendata.rdw.nl/resource/jhie-znh9.json","https://opendata.rdw.nl/resource/kmfi-hrps.json"
"VR515Z","Bedrijfsauto","TOYOTA","TOYOTA PROACE DUBBELE CABINE","20250212","20230126","10522","gesloten opbouw","6","N.v.t.","N.v.t.","4","1997","1795","2932","1895","750",,"20151028","20151028","Geen verstrekking in Open Data","43419","Ja",,"1137",,,"2000",,"0","4","0","0",,"514","190","N1",,,"in motorruimte a.","2932","X",,"e4*NKS*0079*02","UAHZ","MDX331L-LPZDPW(1EDCAB02)","0","0.05","312","Nee","Nee",,"Nee","4932","0",,"2024","Logisch","00","Ja","2025-02-12T00:00:00.000","2023-01-26T00:00:00.000","2015-10-28T00:00:00.000","2015-10-28T00:00:00.000",,,,,,,,,,,,,,,,,,,,,,,,,,,,"https://opendata.rdw.nl/resource/3huj-srit.json","https://opendata.rdw.nl/resource/8ys7-d773.json","https://opendata.rdw.nl/resource/vezc-m2t6.json","https://opendata.rdw.nl/resource/jhie-znh9.json","https://opendata.rdw.nl/resource/kmfi-hrps.json"
"VR718F","Bedrijfsauto","TOYOTA","TOYOTA PROACE DUBBELE CABINE","20241016","20150827","10599","gesloten opbouw","6","N.v.t.","N.v.t.","4","1997","1795","2932","1895","750",,"20150827","20150827","Geen verstrekking in Open Data","43741","Ja",,"1137",,"2000","2000",,"0","4","0","0",,"514","190","N1",,,"r. schutbord","2932","X",,"e4*NKS*0079*03","UAHZ","MDX331L-LPZSGW(1FDCAB03)","0","0.05","312","Nee","Nee",,"Nee","4932","0",,"2024","Logisch","00","Ja","2024-10-16T00:00:00.000","2015-08-27T00:00:00.000","2015-08-27T00:00:00.000","2015-08-27T00:00:00.000",,"0",,,,,,,,,,,,,,,,,,,,,,,,,,"https://opendata.rdw.nl/resource/3huj-srit.json","https://opendata.rdw.nl/resource/8ys7-d773.json","https://opendata.rdw.nl/resource/vezc-m2t6.json","https://opendata.rdw.nl/resource/jhie-znh9.json","https://opendata.rdw.nl/resource/kmfi-hrps.json"