"kenteken","voertuigsoort","merk","handelsbenaming","vervaldatum_apk","datum_tenaamstelling","bruto_bpm","inrichting","aantal_zitplaatsen","eerste_kleur","tweede_kleur","aantal_cilinders","cilinderinhoud","massa_ledig_voertuig","toegestane_maximum_massa_voertuig","massa_rijklaar","maximum_massa_trekken_ongeremd","maximum_trekken_massa_geremd","datum_eerste_toelating","datum_eerste_tenaamstelling_in_nederland","wacht_op_keuren","catalogusprijs","wam_verzekerd","maximale_constructiesnelheid","laadvermogen","oplegger_geremd","aanhangwagen_autonoom_geremd","aanhangwagen_middenas_geremd","aantal_staanplaatsen","aantal_deuren","aantal_wielen","afstand_hart_koppeling_tot_achterzijde_voertuig","afstand_voorzijde_voertuig_tot_hart_koppeling","afwijkende_maximum_snelheid","lengte","breedte","europese_voertuigcategorie","europese_voertuigcategorie_toevoeging","europese_uitvoeringcategorie_toevoeging","plaats_chassisnummer","technische_max_massa_voertuig","type","type_gasinstallatie","typegoedkeuringsnummer","variant","uitvoering","volgnummer_wijziging_eu_typegoedkeuring","vermogen_massarijklaar","wielbasis","export_indicator","openstaande_terugroepactie_indicator","vervaldatum_tachograaf","taxi_indicator","maximum_massa_samenstelling","aantal_rolstoelplaatsen","maximum_ondersteunende_snelheid","jaar_laatste_registratie_tellerstand","tellerstandoordeel","code_toelichting_tellerstandoordeel","tenaamstellen_mogelijk","vervaldatum_apk_dt","datum_tenaamstelling_dt","datum_eerste_toelating_dt","datum_eerste_tenaamstelling_in_nederland_dt","vervaldatum_tachograaf_dt","maximum_last_onder_de_vooras_sen_tezamen_koppeling","type_remsysteem_voertuig_code","rupsonderstelconfiguratiecode","wielbasis_voertuig_minimum","wielbasis_voertuig_maximum","lengte_voertuig_minimum","lengte_voertuig_maximum","breedte_voertuig_minimum","breedte_voertuig_maximum","hoogte_voertuig","hoogte_voertuig_minimum","hoogte_voertuig_maximum","massa_bedrijfsklaar_minimaal","massa_bedrijfsklaar_maximaal","technisch_toelaatbaar_massa_koppelpunt","maximum_massa_technisch_maximaal","maximum_massa_technisch_minimaal","subcategorie_nederland","verticale_belasting_koppelpunt_getrokken_voertuig","zuinigheidsclassificatie","registratie_datum_goedkeuring_afschrijvingsmoment_bpm","registratie_datum_goedkeuring_afschrijvingsmoment_bpm_dt","gem_lading_wrde","aerodyn_voorz","massa_alt_aandr","verl_cab_ind","api_gekentekende_voertuigen_assen","api_gekentekende_voertuigen_brandstof","api_gekentekende_voertuigen_carrosserie","api_gekentekende_voertuigen_carrosserie_specifiek","api_gekentekende_voertuigen_voertuigklasse"
"1ZVG44","Personenauto","SEAT","LEON X-PERIENCE","20250215","20150421","9801","stationwagen","5","ZWART","Niet geregistreerd","4","1968","1429","2060","1529","750","2000","20150421","20150421","Geen verstrekking in Open Data","42329","Ja",,,,,,,"5","4","0","0",,"454","0","M1",,,"r. motorkap","2060","5F",,"e9*2007/46*0094*13","XCUNAX1","AD6SAD6D90037MMMLO","0","0.09","263","Nee","Nee",,"Nee","4060","0",,"2024","Logisch","00","Ja","2025-02-15T00:00:00.000","2015-04-21T00:00:00.000","2015-04-21T00:00:00.000","2015-04-21T00:00:00.000",,,,,,,,,,,,,,,,,,,,,"E",,,,,,,"https://opendata.rdw.nl/resource/3huj-srit.json","https://opendata.rdw.nl/resource/8ys7-d773.json","https://opendata.rdw.nl/resource/vezc-m2t6.json","https://opendata.rdw.nl/resource/jhie-znh9.json","https://opendata.rdw.nl/resource/kmfi-hrps.json"
"5ZFD51","Personenauto","SEAT","LEON X-PERIENCE","20250417","20230420","7056","stationwagen","5","ZWART","Niet geregistreerd","4","1798","1386","2010","1486","740","1500","20150103","20150103","Geen verstrekking in Open Data","40878","Ja",,,,,,,"5","4","0","0",,"454","0","M1",,,"r. motorkap","2010","5F",,"e9*2007/46*0094*13","XCJSBX1","AD6SAD6D90047MMMLO","0","0.09","263","Nee","Nee",,"Nee","3510","0","0.00","2024","Logisch","00","Ja","2025-04-17T00:00:00.000","2023-04-20T00:00:00.000","2015-01-03T00:00:00.000","2015-01-03T00:00:00.000",,,,,,,,,,,,,,,,,,,,,"C",,,,,,,"https://opendata.rdw.nl/resource/3huj-srit.json","https://opendata.rdw.nl/resource/8ys7-d773.json","https://opendata.rdw.nl/resource/vezc-m2t6.json","https://opendata.rdw.nl/resource/jhie-znh9.json","https://opendata.rdw.nl/resource/kmfi-hrps.json"
"5ZNG24","Personenauto","SEAT","LEON X-PERIENCE","20250318","20240319","7079","stationwagen","5","WIT","Niet geregistreerd","4","1798","1386","2010","1486","740","1500","20150206","20150206","Geen verstrekking in Open Data","43664","Ja",,,,,,,"5","4","0","0",,"454","0","M1",,,"r. motorkap","2010","5F",,"e9*2007/46*0094*13","XCJSBX1","AD6SAD6D90047MMMLO","0","0.09","263","Nee","Nee",,"Nee","3510","0","0.00","2024","Logisch","00","Ja","2025-03-18T00:00:00.000","2024-03-19T00:00:00.000","2015-02-06T00:00:00.000","2015-02-06T00:00:00.000",,,,,,,,,,,,,,,,,,,,,"C",,,,,,,"https://opendata.rdw.nl/resource/3huj-srit.json","https://opendata.rdw.nl/resource/8ys7-d773.json","https://opendata.rdw.nl/resource/vezc-m2t6.json","https://opendata.rdw.nl/resource/jhie-znh9.json","https://opendata.rdw.nl/resource/kmfi-hrps.json"
"5ZNG97","Personenauto","SEAT","LEON X-PERIENCE","20250318","20150318","9801","stationwagen","5","BRUIN","Niet geregistreerd","4","1968","1429","2060","1529","750","2000","20150318","20150318","Geen verstrekking in Open Data","42664","Ja",,,,,,,"5","4","0","0",,"454","0","M1",,,"r. motorkap","2060","5F",,"e9*2007/46*0094*13","XCUNAX1","AD6SAD6D90037MMMLO","0","0.09","263","Nee","Nee",,"Nee","4060","0",,"2024","Logisch","00","Ja","2025-03-18T00:00:00.000","2015-03-18T00:00:00.000","2015-03-18T00:00:00.000","2015-03-18T00:00:00.000",,,,,,,,,,,,,,,,,,,,,"E",,,,,,,"https://opendata.rdw.nl/resource/3huj-srit.json","https://opendata.rdw.nl/resource/8ys7-d773.json","https://opendata.rdw.nl/resource/vezc-m2t6.json","https://opendata.rdw.nl/resource/jhie-znh9.json","https://opendata.rdw.nl/resource/kmfi-hrps.json"
"6ZND53","Personenauto","SEAT","LEON X-PERIENCE","20250417","20150311","9801","stationwagen","5","BRUIN","Niet geregistreerd","4","1968","1429","2060","1529","750","2000","20150311","20150311","Geen verstrekking in Open Data","42664","Ja",,,,,,,"5","4","0","0",,"454","0","M1",,,"r. motorkap","2060","5F",,"e9*2007/46*0094*13","XCUNAX1","AD6SAD6D90037MMMLO","0","0.09","263","Nee","Nee",,"Nee","4060","0",,"2024","Logisch","00","Ja","2025-04-17T00:00:00.000","2015-03-11T00:00:00.000","2015-03-11T00:00:00.000","2015-03-11T00:00:00.000",,,,,,,,,,,,,,,,,,,,,"E",,,,,,,"https://opendata.rdw.nl/resource/3huj-srit.json","https://opendata.rdw.nl/resource/8ys7-d773.json","https://opendata.rdw.nl/resource/vezc-m2t6.json","https://opendata.rdw.nl/resource/jhie-znh9.json","https://opendata.rdw.nl/resource/kmfi-hrps.json"
"8ZKV83","Personenauto","SEAT","LEON X-PERIENCE","20250107","20240217","7079","stationwagen","5","WIT","Niet geregistreerd","4","1798","1386","2010","1486","740","1500","20150107","20150107","Geen verstrekking in Open Data","40401","Ja",,,,,,,"5","4","0","0",,"454","0","M1",,,"r. motorkap","2010","5F",,"e9*2007/46*0094*13","XCJSBX1","AD6SAD6D90047MMMLO","0","0.09","263","Nee","Nee",,"Nee","3510","0","0.00","2024","Logisch","00","Ja","2025-01-07T00:00:00.000","2024-02-17T00:00:00.000","2015-01-07T00:00:00.000","2015-01-07T00:00:00.000",,,,,,,,,,,,,,,,,,,,,"C",,,,,,,"https://opendata.rdw.nl/resource/3huj-srit.json","https://opendata.rdw.nl/resource/8ys7-d773.json","https://opendata.rdw.nl/resource/vezc-m2t6.json","https://opendata.rdw.nl/resource/jhie-znh9.json","https://opendata.rdw.nl/resource/kmfi-hrps.json"
"9ZVB29","Personenauto","SEAT","LEON X-PERIENCE","20250331","20150331","9801","stationwagen","5","GRIJS","Niet geregistreerd","4","1968","1429","2060","1529","750","2000","20150331","20150331","Geen verstrekking in Open Data","42329","Ja",,,,,,,"5","4","0","0",,"454","0","M1",,,"r. motorkap","2060","5F",,"e9*2007/46*0094*13","XCUNAX1","AD6SAD6D90037MMMLO","0","0.09","263","Nee","Nee",,"Nee","4060","0",,"2024","Logisch","00","Ja","2025-03-31T00:00:00.000","2015-03-31T00:00:00.000","2015-03-31T00:00:00.000","2015-03-31T00:00:00.000",,,,,,,,,,,,,,,,,,,,,"E",,,,,,,"https://opendata.rdw.nl/resource/3huj-srit.json","https://opendata.rdw.nl/resource/8ys7-d773.json","https://opendata.rdw.nl/resource/vezc-m2t6.json","https://opendata.rdw.nl/resource/jhie-znh9.json","https://opendata.rdw.nl/resource/kmfi-hrps.json"
"G122KB","Personenauto","SEAT","LEON X-PERIENCE","20250420","20191012","3740","stationwagen","5","WIT","Niet geregistreerd","4","1395","1163","1820","1263","630","1400","20160916","20191012","Geen verstrekking in Open Data","29689","Ja","200",,,,,,"5","4",,,,,"182","M1",,,,"1820","5F",,"e9*2007/46*0094*21","XCZCAX0V","FM6SFM6AJ0097MMVLO573","1","0.07","263","Nee","Nee",,"Nee","3220",,,"2024","Geen oordeel","05","Ja","2025-04-20T00:00:00.000","2019-10-12T00:00:00.000","2016-09-16T00:00:00.000","2019-10-12T00:00:00.000",,,,,,,,,,,"148",,,,,,,,,,"B",,,,,,,"https://opendata.rdw.nl/resource/3huj-srit.json","https://opendata.rdw.nl/resource/8ys7-d773.json","https://opendata.rdw.nl/resource/vezc-m2t6.json","https://opendata.rdw.nl/resource/jhie-znh9.json","https://opendata.rdw.nl/resource/kmfi-hrps.json"
"G672VL","Personenauto","SEAT","LEON X-PERIENCE","20250209","20221031","2859","stationwagen","5","GRIJS","Niet geregistreerd","4","1395","1163","1820","1263","630","1400","20160209","20191221","Geen verstrekking in Open Data","33280","Ja","200",,,,,,"5","4",,,,,"182","M1",,,"r. motorruimte","1820","5F",,"e9*2007/46*0094*18","XCZCAX0V","FM6SFM6AJ0097MMVLO573","0","0.07","263","Nee","Nee",,"Nee","3220",,,"2024","Geen oordeel","05","Ja","2025-02-09T00:00:00.000","2022-10-31T00:00:00.000","2016-02-09T00:00:00.000","2019-12-21T00:00:00.000",,,,,,,,,,,"148",,,,,,,,,,"B",,,,,,,"https://opendata.rdw.nl/resource/3huj-srit.json","https://opendata.rdw.nl/resource/8ys7-d773.json","https://opendata.rdw.nl/resource/vezc-m2t6.json","https://opendata.rdw.nl/resource/jhie-znh9.json","https://opendata.rdw.nl/resource/kmfi-hrps.json"
"G946HP","Personenauto","SEAT","LEON X-PERIENCE","20250609","20200523","1964","stationwagen","5","WIT","Niet geregistreerd","4","1395","1163","1820","1263","630","1400","20160920","20191002","Geen verstrekking in Open Data","28204","Ja","200",,,,,,"5","4",,,,,"182","M1",,,,"1820","5F",,"e9*2007/46*0094*21","XCZCAX0V","FM6SFM6AJ0097MMVLO573","1","0.07","263","Nee","Nee",,"Nee","3220",,,"2024","Geen oordeel","05","Ja","2025-06-09T00:00:00.000","2020-05-23T00:00:00.000","2016-09-20T00:00:00.000","2019-10-02T00:00:00.000",,,,,,,,,,,"148",,,,,,,,,,"B",,,,,,,"https://opendata.rdw.nl/resource/3huj-srit.json","https://opendata.rdw.nl/resource/8ys7-d773.json","https://opendata.rdw.nl/resource/vezc-m2t6.json","https://opendata.rdw.nl/resource/jhie-znh9.json","https://opendata.rdw.nl/resource/kmfi-hrps.json"
"GF095R","Personenauto","SEAT","LEON X-PERIENCE","20250321","20150519","9801","stationwagen","5","ZWART","Niet geregistreerd","4","1968","1429","2060","1529","750","2000","20150519","20150519","Geen verstrekking in Open Data","42329","Ja",,,,,,,"5","4","0","0",,"454","0","M1",,,"r. motorkap","2060","5F",,"e9*2007/46*0094*13","XCUNAX1","AD6SAD6D90037MMMLO","0","0.09","263","Nee","Nee",,"Nee","4060","0",,"2024","Logisch","00","Ja","2025-03-21T00:00:00.000","2015-05-19T00:00:00.000","2015-05-19T00:00:00.000","2015-05-19T00:00:00.000",,,,,,,,,,,,,,,,,,,,,"E",,,,,,,"https://opendata.rdw.nl/resource/3huj-srit.json","https://opendata.rdw.nl/resource/8ys7-d773.json","https://opendata.rdw.nl/resource/vezc-m2t6.json","https://opendata.rdw.nl/resource/jhie-znh9.json","https://opendata.rdw.nl/resource/kmfi-hrps.json"
"GF607B","Personenauto","SEAT","LEON X-PERIENCE","20250429","20150429","9801","stationwagen","5","GRIJS","Niet geregistreerd","4","1968","1429","2060","1529","750","2000","20150429","20150429","Geen verstrekking in Open Data","42329","Ja",,,,,,,"5","4","0","0",,"454","0","M1",,,"r. motorkap","2060","5F",,"e9*2007/46*0094*13","XCUNAX1","AD6SAD6D90037MMMLO","0","0.09","263","Nee","Nee",,"Nee","4060","0",,"2024","Logisch","00","Ja","2025-04-29T00:00:00.000","2015-04-29T00:00:00.000","2015-04-29T00:00:00.000","2015-04-29T00:00:00.000",,,,,,,,,,,,,,,,,,,,,"E",,,,,,,"https://opendata.rdw.nl/resource/3huj-srit.json","https://opendata.rdw.nl/resource/8ys7-d773.json","https://opendata.rdw.nl/resource/vezc-m2t6.json","https://opendata.rdw.nl/resource/jhie-znh9.json","https://opendata.rdw.nl/resource/kmfi-hrps.json"
"GN389F","Personenauto","SEAT","LEON X-PERIENCE","20250213","20190219","5416","stationwagen","5","GRIJS","Niet geregistreerd","4","1598","1231","1890","1331","660","1500","20161018","20161018","Geen verstrekking in Open Data","33701","Ja",,,,,,,"5","4","0","0",,"0","0","M1",,,"r. motorkap","1890","5F",,"e9*2007/46*0094*16","XCXXBX0V","FM5SFM5A40517MMVLO573","0","0.06","263","Nee","Nee",,"Nee","3390","0","0.00","2024","Logisch","00","Ja","2025-02-13T00:00:00.000","2019-02-19T00:00:00.000","2016-10-18T00:00:00.000","2016-10-18T00:00:00.000",,,,,,,,,,,,,,,,,,,,,"D",,,,,,,"https://opendata.rdw.nl/resource/3huj-srit.json","https://opendata.rdw.nl/resource/8ys7-d773.json","https://opendata.rdw.nl/resource/vezc-m2t6.json","https://opendata.rdw.nl/resource/jhie-znh9.json","https://opendata.rdw.nl/resource/kmfi-hrps.json"
"GN584K","Personenauto","SEAT","LEON X-PERIENCE","20240907","20201021","7303","stationwagen","5","WIT","Niet geregistreerd","4","1798","1386","2040","1486","740","1500","20150710","20150710","Geen verstrekking in Open Data","43644","Ja",,,,,,,"5","4","0","0",,"0","0","M1",,,"r. motorkap","2040","5F",,"e9*2007/46*0094*15","XCJSBX1V","AD6SAD6D90047MMMLM573","0","0.09","263","Nee","Nee",,"Nee","3540","0",,"2023","Logisch","00","Ja","2024-09-07T00:00:00.000","2020-10-21T00:00:00.000","2015-07-10T00:00:00.000","2015-07-10T00:00:00.000",,,,,,,,,,,,,,,,,,,,,"C",,,,,,,"https://opendata.rdw.nl/resource/3huj-srit.json","https://opendata.rdw.nl/resource/8ys7-d773.json","https://opendata.rdw.nl/resource/vezc-m2t6.json","https://opendata.rdw.nl/resource/jhie-znh9.json","https://opendata.rdw.nl/resource/kmfi-hrps.json"
"GT166N","Personenauto","SEAT","LEON X-PERIENCE","20241107","20220630","4954","stationwagen","5","BRUIN","Niet geregistreerd","4","1598","1231","1890","1331","660","1500","20150818","20150818","Geen verstrekking in Open Data","29608","Ja",,,,,,,"5","4","0","0",,"0","0","M1",,,"r. motorkap","1890","5F",,"e9*2007/46*0094*17","XCXXBX0V","FM5SFM5A40517MMVLO573","0","0.06","263","Nee","Nee",,"Nee","3390","0",,"2023","Logisch","00","Ja","2024-11-07T00:00:00.000","2022-06-30T00:00:00.000","2015-08-18T00:00:00.000","2015-08-18T00:00:00.000",,,,,,,,,,,,,,,,,,,,,"B",,,,,,,"https://opendata.rdw.nl/resource/3huj-srit.json","https://opendata.rdw.nl/resource/8ys7-d773.json","https://opendata.rdw.nl/resource/vezc-m2t6.json","https://opendata.rdw.nl/resource/jhie-znh9.json","https://opendata.rdw.nl/resource/kmfi-hrps.json"
"GT175N","Personenauto","SEAT","LEON X-PERIENCE","20240821","20240117","4954","stationwagen","5","WIT","Niet geregistreerd","4","1598","1231","1890","1331","660","1500","20150821","20150821","Geen verstrekking in Open Data","31098","Ja",,,,,,,"5","4","0","0",,"0","0","M1",,,"r. motorkap","1890","5F",,"e9*2007/46*0094*16","XCXXBX0V","FM5SFM5A40517MMVLO573","0","0.06","263","Nee","Nee",,"Nee","3390","0","0.00","2023","Logisch","00","Ja","2024-08-21T00:00:00.000","2024-01-17T00:00:00.000","2015-08-21T00:00:00.000","2015-08-21T00:00:00.000",,,,,,,,,,,,,,,,,,,,,"B",,,,,,,"https://opendata.rdw.nl/resource/3huj-srit.json","https://opendata.rdw.nl/resource/8ys7-d773.json","https://opendata.rdw.nl/resource/vezc-m2t6.json","https://opendata.rdw.nl/resource/jhie-znh9.json","https://opendata.rdw.nl/resource/kmfi-hrps.json"
"GT189N","Personenauto","SEAT","LEON X-PERIENCE","20240926","20191129","7079","stationwagen","5","GRIJS","Niet geregistreerd","4","1798","1386","2010","1486","740","1500","20150924","20150924","Geen verstrekking in Open Data","38534","Ja",,,,,,,"5","4","0","0",,"454","0","M1",,,"r. motorkap","2010","5F",,"e9*2007/46*0094*14","XCJSBX1V","AD6SAD6D90047MMMLO5","0","0.09","263","Nee","Nee",,"Nee","3510","0","0.00","2023","Logisch","00","Ja","2024-09-26T00:00:00.000","2019-11-29T00:00:00.000","2015-09-24T00:00:00.000","2015-09-24T00:00:00.000",,,,,,,,,,,,,,,,,,,,,"C",,,,,,,"https://opendata.rdw.nl/resource/3huj-srit.json","https://opendata.rdw.nl/resource/8ys7-d773.json","https://opendata.rdw.nl/resource/vezc-m2t6.json","https://opendata.rdw.nl/resource/jhie-znh9.json","https://opendata.rdw.nl/resource/kmfi-hrps.json"
"GT190N","Personenauto","SEAT","LEON X-PERIENCE","20241023","20160226","3943","stationwagen","5","BRUIN","Niet geregistreerd","4","1395","1163","1820","1263","630","1400","20151023","20151023","Geen verstrekking in Open Data","26085","Ja",,,,,,,"5","4","0","0",,"0","0","M1",,,"r. motorkap","1820","5F",,"e9*2007/46*0094*16","XCZCAX0V","FM6SFM6AJ0097MMVLO573","0","0.07","263","Nee","Nee",,"Nee","3220","0",,"2023","Logisch","00","Ja","2024-10-23T00:00:00.000","2016-02-26T00:00:00.000","2015-10-23T00:00:00.000","2015-10-23T00:00:00.000",,,,,,,,,,,,,,,,,,,,,"A",,,,,,,"https://opendata.rdw.nl/resource/3huj-srit.json","https://opendata.rdw.nl/resource/8ys7-d773.json","https://opendata.rdw.nl/resource/vezc-m2t6.json","https://opendata.rdw.nl/resource/jhie-znh9.json","https://opendata.rdw.nl/resource/kmfi-hrps.json"
"GT753K","Personenauto","SEAT","LEON X-PERIENCE","20250228","20200516","5502","stationwagen","5","WIT","Niet geregistreerd","4","1798","1386","2010","1486","740","1500","20150227","20150815","Geen verstrekking in Open Data","41075","Ja",,,,,,,"5","4","0","0",,"454","0","M1",,,"r. motorkap","2010","5F",,"e9*2007/46*0094*13","XCJSBX1","AD6SAD6D90047MMMLO","0","0.09","263","Nee","Nee",,"Nee","3510","0","0.00","2024","Geen oordeel","05","Ja","2025-02-28T00:00:00.000","2020-05-16T00:00:00.000","2015-02-27T00:00:00.000","2015-08-15T00:00:00.000",,,,,,,,,,,,,,,,,,,,,"C",,,,,,,"https://opendata.rdw.nl/resource/3huj-srit.json","https://opendata.rdw.nl/resource/8ys7-d773.json","https://opendata.rdw.nl/resource/vezc-m2t6.json","https://opendata.rdw.nl/resource/jhie-znh9.json","https://opendata.rdw.nl/resource/kmfi-hrps.json"
"GV144H","Personenauto","SEAT","LEON X-PERIENCE","20241210","20180609","3943","stationwagen","5","BRUIN","Niet geregistreerd","4","1395","1163","1820","1263","630","1400","20151210","20151210","Geen verstrekking in Open Data","27698","Ja",,,,,,,"5","4","0","0",,"0","0","M1",,,"r. motorkap","1820","5F",,"e9*2007/46*0094*17","XCZCAX0V","FM6SFM6AJ0097MMVLO573","0","0.07","263","Nee","Nee",,"Nee","3220","0",,"2023","Logisch","00","Ja","2024-12-10T00:00:00.000","2018-06-09T00:00:00.000","2015-12-10T00:00:00.000","2015-12-10T00:00:00.000",,,,,,,,,,,,,,,,,,,,,"A",,,,,,,"https://opendata.rdw.nl/resource/3huj-srit.json","https://opendata.rdw.nl/resource/8ys7-d773.json","https://opendata.rdw.nl/resource/vezc-m2t6.json","https://opendata.rdw.nl/resource/jhie-znh9.json","https://opendata.rdw.nl/resource/kmfi-hrps.json"
"GV374R","Personenauto","SEAT","LEON X-PERIENCE","20250226","20240610","3943","stationwagen","5","GRIJS","Niet geregistreerd","4","1395","1163","1820","1263","630","1400","20160226","20160226","Geen verstrekking in Open Data","29238","Ja",,,,,,,"5","4","0","0",,"0","0","M1",,,"r. motorkap","1820","5F",,"e9*2007/46*0094*16","XCZCAX0V","FM6SFM6AJ0097MMVLO573","0","0.07","263","Nee","Nee",,"Nee","3220","0",,"2024","Logisch","00","Ja","2025-02-26T00:00:00.000","2024-06-10T00:00:00.000","2016-02-26T00:00:00.000","2016-02-26T00:00:00.000",,,,,,,,,,,,,,,,,,,,,"B",,,,,,,"https://opendata.rdw.nl/resource/3huj-srit.json","https://opendata.rdw.nl/resource/8ys7-d773.json","https://opendata.rdw.nl/resource/vezc-m2t6.json","https://opendata.rdw.nl/resource/jhie-znh9.json","https://opendata.rdw.nl/resource/kmfi-hrps.json"
"GV575J","Personenauto","SEAT","LEON X-PERIENCE","20240827","20200828","3943","stationwagen","5","GRIJS","Niet geregistreerd","4","1395","1163","1820","1263","630","1400","20150827","20150827","Geen verstrekking in Open Data","25160","Ja",,,,,,,"5","4","0","0",,"0","0","M1",,,"r. motorkap","1820","5F",,"e9*2007/46*0094*17","XCZCAX0V","FM6SFM6AJ0097MMVLO573","0","0.07","263","Nee","Nee",,"Nee","3220","0",,"2023","Logisch","00","Ja","2024-08-27T00:00:00.000","2020-08-28T00:00:00.000","2015-08-27T00:00:00.000","2015-08-27T00:00:00.000",,,,,,,,,,,,,,,,,,,,,"A",,,,,,,"https://opendata.rdw.nl/resource/3huj-srit.json","https://opendata.rdw.nl/resource/8ys7-d773.json","https://opendata.rdw.nl/resource/vezc-m2t6.json","https://opendata.rdw.nl/resource/jhie-znh9.json","https://opendata.rdw.nl/resource/kmfi-hrps.json"
"GV613J","Personenauto","SEAT","LEON X-PERIENCE","20250415","20200416","5416","stationwagen","5","WIT","Niet geregistreerd","4","1598","1231","1890","1331","660","1500","20160318","20160318","Geen verstrekking in Open Data","33151","Ja",,,,,,,"5","4","0","0",,"0","0","M1",,,"r. motorkap","1890","5F",,"e9*2007/46*0094*17","XCXXBX0V","FM5SFM5A40517MMVLO573","0","0.06","263","Nee","Nee",,"Nee","3390","0",,"2024","Logisch","00","Ja","2025-04-15T00:00:00.000","2020-04-16T00:00:00.000","2016-03-18T00:00:00.000","2016-03-18T00:00:00.000",,,,,,,,,,,,,,,,,,,,,"D",,,,,,,"https://opendata.rdw.nl/resource/3huj-srit.json","https://opendata.rdw.nl/resource/8ys7-d773.json","https://opendata.rdw.nl/resource/vezc-m2t6.json","https://opendata.rdw.nl/resource/jhie-znh9.json","https://opendata.rdw.nl/resource/kmfi-hrps.json"
"H084NR","Personenauto","SEAT","LEON X-PERIENCE","20250511","20200512","2771","stationwagen","5","GRIJS","Niet geregistreerd","4","1395","1163","1820","1263","630","1400","20161123","20200512","Geen verstrekking in Open Data","27150","Ja","200",,,,,,"5","4",,,,,"182","M1",,,"r. motorkap","1820","5F",,"e9*2007/46*0094*21","XCZCAX0V","FM6SFM6AJ0097MMVLO573","1","0.07","263","Nee","Nee",,"Nee","3220",,,"2024","Geen oordeel","05","Ja","2025-05-11T00:00:00.000","2020-05-12T00:00:00.000","2016-11-23T00:00:00.000","2020-05-12T00:00:00.000",,,,,,,,,,,"148",,,,,,,,,,"B",,,,,,,"https://opendata.rdw.nl/resource/3huj-srit.json","https://opendata.rdw.nl/resource/8ys7-d773.json","https://opendata.rdw.nl/resource/vezc-m2t6.json","https://opendata.rdw.nl/resource/jhie-znh9.json","https://opendata.rdw.nl/resource/kmfi-hrps.json"
"HB078H","Personenauto","SEAT","LEON X-PERIENCE","20241010","20231209","4954","stationwagen","5","WIT","Niet geregistreerd","4","1598","1231","1890","1331","660","1500","20151009","20151009","Geen verstrekking in Open Data","29608","Ja",,,,,,,"5","4","0","0",,"0","0","M1",,,"r. motorkap","1890","5F",,"e9*2007/46*0094*16","XCXXBX0V","FM5SFM5A40517MMVLO573","0","0.06","263","Nee","Nee",,"Nee","3390","0","0.00","2023","Logisch","00","Ja","2024-10-10T00:00:00.000","2023-12-09T00:00:00.000","2015-10-09T00:00:00.000","2015-10-09T00:00:00.000",,,,,,,,,,,,,,,,,,,,,"B",,,,,,,"https://opendata.rdw.nl/resource/3huj-srit.json","https://opendata.rdw.nl/resource/8ys7-d773.json","https://opendata.rdw.nl/resource/vezc-m2t6.json","https://opendata.rdw.nl/resource/jhie-znh9.json","https://opendata.rdw.nl/resource/kmfi-hrps.json"
"HB161H","Personenauto","SEAT","LEON X-PERIENCE","20241006","20180504","3943","stationwagen","5","GRIJS","Niet geregistreerd","4","1395","1163","1820","1263","630","1400","20150925","20150925","Geen verstrekking in Open Data","25608","Ja",,,,,,,"5","4","0","0",,"0","0","M1",,,"r. motorkap","1820","5F",,"e9*2007/46*0094*16","XCZCAX0V","FM6SFM6AJ0097MMVLO573","0","0.07","263","Nee","Nee",,"Nee","3220","0",,"2023","Logisch","00","Ja","2024-10-06T00:00:00.000","2018-05-04T00:00:00.000","2015-09-25T00:00:00.000","2015-09-25T00:00:00.000",,,,,,,,,,,,,,,,,,,,,"A",,,,,,,"https://opendata.rdw.nl/resource/3huj-srit.json","https://opendata.rdw.nl/resource/8ys7-d773.json","https://opendata.rdw.nl/resource/vezc-m2t6.json","https://opendata.rdw.nl/resource/jhie-znh9.json","https://opendata.rdw.nl/resource/kmfi-hrps.json"