"kenteken","voertuigsoort","merk","handelsbenaming","vervaldatum_apk","datum_tenaamstelling","bruto_bpm","inrichting","aantal_zitplaatsen","eerste_kleur","tweede_kleur","aantal_cilinders","cilinderinhoud","massa_ledig_voertuig","toegestane_maximum_massa_voertuig","massa_rijklaar","maximum_massa_trekken_ongeremd","maximum_trekken_massa_geremd","datum_eerste_toelating","datum_eerste_tenaamstelling_in_nederland","wacht_op_keuren","catalogusprijs","wam_verzekerd","maximale_constructiesnelheid","laadvermogen","oplegger_geremd","aanhangwagen_autonoom_geremd","aanhangwagen_middenas_geremd","aantal_staanplaatsen","aantal_deuren","aantal_wielen","afstand_hart_koppeling_tot_achterzijde_voertuig","afstand_voorzijde_voertuig_tot_hart_koppeling","afwijkende_maximum_snelheid","lengte","breedte","europese_voertuigcategorie","europese_voertuigcategorie_toevoeging","europese_uitvoeringcategorie_toevoeging","plaats_chassisnummer","technische_max_massa_voertuig","type","type_gasinstallatie","typegoedkeuringsnummer","variant","uitvoering","volgnummer_wijziging_eu_typegoedkeuring","vermogen_massarijklaar","wielbasis","export_indicator","openstaande_terugroepactie_indicator","vervaldatum_tachograaf","taxi_indicator","maximum_massa_samenstelling","aantal_rolstoelplaatsen","maximum_ondersteunende_snelheid","jaar_laatste_registratie_tellerstand","tellerstandoordeel","code_toelichting_tellerstandoordeel","tenaamstellen_mogelijk","vervaldatum_apk_dt","datum_tenaamstelling_dt","datum_eerste_toelating_dt","datum_eerste_tenaamstelling_in_nederland_dt","vervaldatum_tachograaf_dt","maximum_last_onder_de_vooras_sen_tezamen_koppeling","type_remsysteem_voertuig_code","rupsonderstelconfiguratiecode","wielbasis_voertuig_minimum","wielbasis_voertuig_maximum","lengte_voertuig_minimum","lengte_voertuig_maximum","breedte_voertuig_minimum","breedte_voertuig_maximum","hoogte_voertuig","hoogte_voertuig_minimum","hoogte_voertuig_maximum","massa_bedrijfsklaar_minimaal","massa_bedrijfsklaar_maximaal","technisch_toelaatbaar_massa_koppelpunt","maximum_massa_technisch_maximaal","maximum_massa_technisch_minimaal","subcategorie_nederland","verticale_belasting_koppelpunt_getrokken_voertuig","zuinigheidsclassificatie","registratie_datum_goedkeuring_afschrijvingsmoment_bpm","registratie_datum_goedkeuring_afschrijvingsmoment_bpm_dt","gem_lading_wrde","aerodyn_voorz","massa_alt_aandr","verl_cab_ind","api_gekentekende_voertuigen_assen","api_gekentekende_voertuigen_brandstof","api_gekentekende_voertuigen_carrosserie","api_gekentekende_voertuigen_carrosserie_specifiek","api_gekentekende_voertuigen_voertuigklasse"
"00GKT4","Personenauto","SAAB","SAAB 9-3","20240714","20170617","8391","sedan","5","ZWART","Niet geregistreerd","4","1998","1430","1990","1530","750","1600","20080714","20080714","Geen verstrekking in Open Data","34928","Ja",,,,,,,"4","4","0","0",,"465","0","M1",,,"r. op schutbord onder motorkap","1990","YS3F",,"e4*2001/116*0065*19","F4F","A5 04","0","0.07","268","Nee","Nee",,"Nee","3590","0",,"2023","Logisch","00","Ja","2024-07-14T00:00:00.000","2017-06-17T00:00:00.000","2008-07-14T00:00:00.000","2008-07-14T00:00:00.000",,,,,,,,,,,,,,,,,,,,,"D",,,,,,,"https://opendata.rdw.nl/resource/3huj-srit.json","https://opendata.rdw.nl/resource/8ys7-d773.json","https://opendata.rdw.nl/resource/vezc-m2t6.json","https://opendata.rdw.nl/resource/jhie-znh9.json","https://opendata.rdw.nl/resource/kmfi-hrps.json"
"00HKJ6","Personenauto","SAAB","SAAB 9-3","20250507","20180309","13012","sedan","5","GRIJS","Niet geregistreerd","4","1910","1480","2060","1580","750","1600","20090102","20090102","Geen verstrekking in Open Data","52418","Ja",,,,,,,"4","4","0","0",,"465","0","M1",,,"r. op schutbord onder motorkap","2060","YS3F",,"e4*2001/116*0065*21","F4P","M6 01","0","0.08","268","Nee","Nee",,"Nee","3660","0",,"2024","Logisch","00","Ja","2025-05-07T00:00:00.000","2018-03-09T00:00:00.000","2009-01-02T00:00:00.000","2009-01-02T00:00:00.000",,,,,,,,,,,,,,,,,,,,,"C",,,,,,,"https://opendata.rdw.nl/resource/3huj-srit.json","https://opendata.rdw.nl/resource/8ys7-d773.json","https://opendata.rdw.nl/resource/vezc-m2t6.json","https://opendata.rdw.nl/resource/jhie-znh9.json","https://opendata.rdw.nl/resource/kmfi-hrps.json"
"00HKP9","Personenauto","SAAB","SAAB 9-3","20250430","20130406","6808","sedan","5","BLAUW","Niet geregistreerd","4","1796","1340","1910","1440","720","1400","20090108","20090108","Geen verstrekking in Open Data","30893","Ja",,,,,,,"4","4","0","0",,"465","0","M1",,,"r. op schutbord onder motorkap","1910","YS3F",,"e4*2001/116*0065*19","F4B","M5 04","0","0.06","268","Nee","Nee",,"Nee","3310","0",,"2024","Logisch","00","Ja","2025-04-30T00:00:00.000","2013-04-06T00:00:00.000","2009-01-08T00:00:00.000","2009-01-08T00:00:00.000",,,,,,,,,,,,,,,,,,,,,"C",,,,,,,"https://opendata.rdw.nl/resource/3huj-srit.json","https://opendata.rdw.nl/resource/8ys7-d773.json","https://opendata.rdw.nl/resource/vezc-m2t6.json","https://opendata.rdw.nl/resource/jhie-znh9.json","https://opendata.rdw.nl/resource/kmfi-hrps.json"
"00PBZ5","Personenauto","SAAB","SAAB 9-3","20250328","20141128","6834","sedan","5","ZWART","Niet geregistreerd","4","1910","1480","2060","1580","750","1600","20110112","20110112","Geen verstrekking in Open Data","32994","Ja",,,,,,,"4","4",,,,"465",,"M1",,,"r. op schutbord onder motorkap","2060","YS3F",,,,,,"0.06","268","Nee","Nee",,"Nee","3660",,,"2024","Logisch","00","Ja","2025-03-28T00:00:00.000","2014-11-28T00:00:00.000","2011-01-12T00:00:00.000","2011-01-12T00:00:00.000",,,,,,,,,,,,,,,,,,,,,"A",,,,,,,"https://opendata.rdw.nl/resource/3huj-srit.json","https://opendata.rdw.nl/resource/8ys7-d773.json","https://opendata.rdw.nl/resource/vezc-m2t6.json","https://opendata.rdw.nl/resource/jhie-znh9.json","https://opendata.rdw.nl/resource/kmfi-hrps.json"
"00PXP7","Personenauto","SAAB","SAAB 9-3","20240909","20230102","6241","sedan","5","ZWART","Niet geregistreerd","4","1998","1390","1980","1490","745","1600","20110408","20110408","Geen verstrekking in Open Data","29995","Ja",,,,,,,"4","4","0","0",,"465","0","M1",,,"r. op schutbord onder motorkap","1980","YS3F",,"e4*2001/116*0065*27","F4FAA","M6F01","0","0.07","268","Nee","Nee",,"Nee","3580","0",,"2023","Logisch","00","Ja","2024-09-09T00:00:00.000","2023-01-02T00:00:00.000","2011-04-08T00:00:00.000","2011-04-08T00:00:00.000",,,,,,,,,,,,,,,,,,,,,"C",,,,,,,"https://opendata.rdw.nl/resource/3huj-srit.json","https://opendata.rdw.nl/resource/8ys7-d773.json","https://opendata.rdw.nl/resource/vezc-m2t6.json","https://opendata.rdw.nl/resource/jhie-znh9.json","https://opendata.rdw.nl/resource/kmfi-hrps.json"
"00RJB6","Personenauto","SAAB","SAAB 9-3","20240625","20160525","7029","sedan","5","ZWART","Niet geregistreerd","4","1998","1395","1990","1495","745","1600","20110527","20110527","Geen verstrekking in Open Data","35715","Ja",,,,,,,"4","4","0","0",,"465","0","M1",,,"r. op schutbord onder motorkap","1990","YS3F",,"e4*2001/116*0065*27","F4SAA","M6F01","0","0.09","268","Nee","Nee",,"Nee","3590","0",,"2023","Logisch","00","Ja","2024-06-25T00:00:00.000","2016-05-25T00:00:00.000","2011-05-27T00:00:00.000","2011-05-27T00:00:00.000",,,,,,,,,,,,,,,,,,,,,"C",,,,,,,"https://opendata.rdw.nl/resource/3huj-srit.json","https://opendata.rdw.nl/resource/8ys7-d773.json","https://opendata.rdw.nl/resource/vezc-m2t6.json","https://opendata.rdw.nl/resource/jhie-znh9.json","https://opendata.rdw.nl/resource/kmfi-hrps.json"
"01GKD7","Personenauto","SAAB","SAAB 9-3","20240721","20140410","21072","sedan","5","ZWART","Niet geregistreerd","6","2792","1620","2200","1720",,,"20080718","20080718","Geen verstrekking in Open Data","86715","Ja",,,,,,,"4","4","0","0",,"465","0","M1",,,"r. op schutbord onder motorkap","2200","YS3F",,"e4*2001/116*0065*19","F4R/TX","M6A 01","0","0.12","268","Nee","Nee",,"Nee","0","0",,"2023","Logisch","00","Ja","2024-07-21T00:00:00.000","2014-04-10T00:00:00.000","2008-07-18T00:00:00.000","2008-07-18T00:00:00.000",,,,,,,,,,,,,,,,,,,,,"G",,,,,,,"https://opendata.rdw.nl/resource/3huj-srit.json","https://opendata.rdw.nl/resource/8ys7-d773.json","https://opendata.rdw.nl/resource/vezc-m2t6.json","https://opendata.rdw.nl/resource/jhie-znh9.json","https://opendata.rdw.nl/resource/kmfi-hrps.json"
"01LGTV","Personenauto","SAAB","SAAB 9-3","20210826","20210305","7404","sedan","5","GRIJS","Niet geregistreerd","4","1998","1410","1970","1510","750","1600","20030108","20030108","Geen verstrekking in Open Data",,"Ja",,,,,,,"4","4","0","0",,"464","0","M1",,,"r. op schutbord onder motorkap","1970",,,"e4*2001/116*0065*01","F4F","M01","0","0.07","268","Nee","Nee",,"Nee","3570","0",,"2021","Logisch","00","Ja","2021-08-26T00:00:00.000","2021-03-05T00:00:00.000","2003-01-08T00:00:00.000","2003-01-08T00:00:00.000",,,,,,,,,,,,,,,,,,,,,"D",,,,,,,"https://opendata.rdw.nl/resource/3huj-srit.json","https://opendata.rdw.nl/resource/8ys7-d773.json","https://opendata.rdw.nl/resource/vezc-m2t6.json","https://opendata.rdw.nl/resource/jhie-znh9.json","https://opendata.rdw.nl/resource/kmfi-hrps.json"
"01LNGS","Personenauto","SAAB","SAAB 9-3","20250517","20170328","11520","sedan","5","ZWART","Niet geregistreerd","4","1998","1420","1980","1520","750","1600","20030307","20030307","Geen verstrekking in Open Data",,"Ja",,,,,,,"4","4","0","0",,"464","0","M1",,,"r. op schutbord onder motorkap","1980",,,"e4*2001/116*0065*02","F4S","M02","0","0.08","268","Nee","Nee",,"Nee","3580","0",,"2024","Logisch","00","Ja","2025-05-17T00:00:00.000","2017-03-28T00:00:00.000","2003-03-07T00:00:00.000","2003-03-07T00:00:00.000",,,,,,,,,,,,,,,,,,,,,"D",,,,,,,"https://opendata.rdw.nl/resource/3huj-srit.json","https://opendata.rdw.nl/resource/8ys7-d773.json","https://opendata.rdw.nl/resource/vezc-m2t6.json","https://opendata.rdw.nl/resource/jhie-znh9.json","https://opendata.rdw.nl/resource/kmfi-hrps.json"
"01LZXG","Personenauto","SAAB","SAAB 9-3","20250424","20200824","8397","sedan","5","ZWART","Niet geregistreerd","4","1998","1410","1970","1510","750","1600","20030703","20030703","Geen verstrekking in Open Data",,"Ja",,,,,,,"4","4","0","0",,"464","0","M1",,,"r. op schutbord onder motorkap","1970",,,"e4*2001/116*0065*02","F4F","M02","0","0.07","268","Nee","Nee",,"Nee","3570","0",,"2024","Logisch","00","Ja","2025-04-24T00:00:00.000","2020-08-24T00:00:00.000","2003-07-03T00:00:00.000","2003-07-03T00:00:00.000",,,,,,,,,,,,,,,,,,,,,"D",,,,,,,"https://opendata.rdw.nl/resource/3huj-srit.json","https://opendata.rdw.nl/resource/8ys7-d773.json","https://opendata.rdw.nl/resource/vezc-m2t6.json","https://opendata.rdw.nl/resource/jhie-znh9.json","https://opendata.rdw.nl/resource/kmfi-hrps.json"
"01NRFS","Personenauto","SAAB","SAAB 9-3","20250116","20110328","6367","sedan","5","GRIJS","Niet geregistreerd","4","1796","1350","1910","1450","725","1400","20040107","20040107","Geen verstrekking in Open Data",,"Ja",,,,,,,"4","4","0","0",,"464","0","M1",,,"r. op schutbord onder motorkap","1910",,,"e4*2001/116*0065*05","F4B","M5 01","0","0.06","268","Nee","Nee",,"Nee","3310","0",,"2024","Logisch","00","Ja","2025-01-16T00:00:00.000","2011-03-28T00:00:00.000","2004-01-07T00:00:00.000","2004-01-07T00:00:00.000",,,,,,,,,,,,,,,,,,,,,"C",,,,,,,"https://opendata.rdw.nl/resource/3huj-srit.json","https://opendata.rdw.nl/resource/8ys7-d773.json","https://opendata.rdw.nl/resource/vezc-m2t6.json","https://opendata.rdw.nl/resource/jhie-znh9.json","https://opendata.rdw.nl/resource/kmfi-hrps.json"
"01NZPN","Personenauto","SAAB","SAAB 9-3","20250224","20230605","7893","sedan","5","BLAUW","Niet geregistreerd","4","1998","1410","1970","1510","750","1600","20040409","20040409","Geen verstrekking in Open Data",,"Ja",,,,,,,"4","4","0","0",,"464","0","M1",,,"r. op schutbord onder motorkap","1970",,,"e4*2001/116*0065*05","F4F","M5 03","0","0.07","268","Nee","Nee",,"Nee","3570","0",,"2024","Logisch","00","Ja","2025-02-24T00:00:00.000","2023-06-05T00:00:00.000","2004-04-09T00:00:00.000","2004-04-09T00:00:00.000",,,,,,,,,,,,,,,,,,,,,"D",,,,,,,"https://opendata.rdw.nl/resource/3huj-srit.json","https://opendata.rdw.nl/resource/8ys7-d773.json","https://opendata.rdw.nl/resource/vezc-m2t6.json","https://opendata.rdw.nl/resource/jhie-znh9.json","https://opendata.rdw.nl/resource/kmfi-hrps.json"
"01PDZN","Personenauto","SAAB","SAAB 9-3","20240906","20191005","7614","sedan","5","ZWART","Niet geregistreerd","4","1998","1410","1970","1510","750","1600","20040517","20040517","Geen verstrekking in Open Data",,"Ja",,,,,,,"4","4","0","0",,"464","0","M1",,,"r. op schutbord onder motorkap","1970",,,"e4*2001/116*0065*05","F4F","M5 03","0","0.07","268","Nee","Nee",,"Nee","3570","0",,"2023","Logisch","00","Nee","2024-09-06T00:00:00.000","2019-10-05T00:00:00.000","2004-05-17T00:00:00.000","2004-05-17T00:00:00.000",,,,,,,,,,,,,,,,,,,,,"D",,,,,,,"https://opendata.rdw.nl/resource/3huj-srit.json","https://opendata.rdw.nl/resource/8ys7-d773.json","https://opendata.rdw.nl/resource/vezc-m2t6.json","https://opendata.rdw.nl/resource/jhie-znh9.json","https://opendata.rdw.nl/resource/kmfi-hrps.json"
"01PGVL","Personenauto","SAAB","SAAB 9-3","20240516","20231108","6505","sedan","5","ZWART","Niet geregistreerd","4","1796","1350","1910","1450","725","1400","20040618","20040618","Geen verstrekking in Open Data",,"Ja",,,,,,,"4","4","0","0",,"464","0","M1",,,"r. op schutbord onder motorkap","1910",,,"e4*2001/116*0065*05","F4B","M5 01","0","0.06","268","Nee","Nee",,"Nee","3310","0",,"2023","Logisch","00","Ja","2024-05-16T00:00:00.000","2023-11-08T00:00:00.000","2004-06-18T00:00:00.000","2004-06-18T00:00:00.000",,,,,,,,,,,,,,,,,,,,,"C",,,,,,,"https://opendata.rdw.nl/resource/3huj-srit.json","https://opendata.rdw.nl/resource/8ys7-d773.json","https://opendata.rdw.nl/resource/vezc-m2t6.json","https://opendata.rdw.nl/resource/jhie-znh9.json","https://opendata.rdw.nl/resource/kmfi-hrps.json"
"01PHN3","Personenauto","SAAB","SAAB 9-3","20250125","20200501","10921","sedan","5","GRIJS","Niet geregistreerd","4","1998","1420","1990","1520","750","1600","20110126","20110126","Geen verstrekking in Open Data","37630","Ja",,,,,,,"4","4","0","0",,"465","0","M1",,,"r. op schutbord onder motorkap","1990","YS3F",,"e4*2001/116*0065*28","F4SAA","A5F01","0","0.08","268","Nee","Nee",,"Nee","3590","0","0.00","2024","Logisch","00","Ja","2025-01-25T00:00:00.000","2020-05-01T00:00:00.000","2011-01-26T00:00:00.000","2011-01-26T00:00:00.000",,,,,,,,,,,,,,,,,,,,,"D",,,,,,,"https://opendata.rdw.nl/resource/3huj-srit.json","https://opendata.rdw.nl/resource/8ys7-d773.json","https://opendata.rdw.nl/resource/vezc-m2t6.json","https://opendata.rdw.nl/resource/jhie-znh9.json","https://opendata.rdw.nl/resource/kmfi-hrps.json"
"01PHRK","Personenauto","SAAB","SAAB 9-3","20240719","20190330","7904","sedan","5","ROOD","Niet geregistreerd","4","1998","1440","2000","1540","750","1600","20040630","20040630","Geen verstrekking in Open Data",,"Ja",,,,,,,"4","4","0","0",,"464","0","M1",,,"r. op schutbord onder motorkap","2000",,,"e4*2001/116*0065*05","F4F","A5 02","0","0.07","268","Nee","Nee",,"Nee","3600","0",,"2023","Logisch","00","Ja","2024-07-19T00:00:00.000","2019-03-30T00:00:00.000","2004-06-30T00:00:00.000","2004-06-30T00:00:00.000",,,,,,,,,,,,,,,,,,,,,"E",,,,,,,"https://opendata.rdw.nl/resource/3huj-srit.json","https://opendata.rdw.nl/resource/8ys7-d773.json","https://opendata.rdw.nl/resource/vezc-m2t6.json","https://opendata.rdw.nl/resource/jhie-znh9.json","https://opendata.rdw.nl/resource/kmfi-hrps.json"
"01PJSB","Personenauto","SAAB","SAAB 9-3","20241219","20240305","6504","sedan","5","ZWART","Niet geregistreerd","4","1796","1350","1910","1450","725","1400","20040715","20040715","Geen verstrekking in Open Data",,"Ja",,,,,,,"4","4","0","0",,"464","0","M1",,,"r. op schutbord onder motorkap","1910",,,"e4*2001/116*0065*05","F4B","M5 01","0","0.06","268","Nee","Nee",,"Nee","3310","0",,"2024","Logisch","00","Ja","2024-12-19T00:00:00.000","2024-03-05T00:00:00.000","2004-07-15T00:00:00.000","2004-07-15T00:00:00.000",,,,,,,,,,,,,,,,,,,,,"C",,,,,,,"https://opendata.rdw.nl/resource/3huj-srit.json","https://opendata.rdw.nl/resource/8ys7-d773.json","https://opendata.rdw.nl/resource/vezc-m2t6.json","https://opendata.rdw.nl/resource/jhie-znh9.json","https://opendata.rdw.nl/resource/kmfi-hrps.json"
"01PKJN","Personenauto","SAAB","SAAB 9-3","20240708","20220723","7794","sedan","5","BLAUW","Niet geregistreerd","4","1998","1410","1970","1510","750","1600","20040802","20040802","Geen verstrekking in Open Data",,"Ja",,,,,,,"4","4","0","0",,"464","0","M1",,,"r. op schutbord onder motorkap","1970",,,"e4*2001/116*0065*05","F4F","M5 03","0","0.07","268","Nee","Nee",,"Nee","3570","0",,"2024","Logisch","00","Ja","2024-07-08T00:00:00.000","2022-07-23T00:00:00.000","2004-08-02T00:00:00.000","2004-08-02T00:00:00.000",,,,,,,,,,,,,,,,,,,,,"D",,,,,,,"https://opendata.rdw.nl/resource/3huj-srit.json","https://opendata.rdw.nl/resource/8ys7-d773.json","https://opendata.rdw.nl/resource/vezc-m2t6.json","https://opendata.rdw.nl/resource/jhie-znh9.json","https://opendata.rdw.nl/resource/kmfi-hrps.json"
"01PTHN","Personenauto","SAAB","SAAB 9-3","20250212","20240326","7657","sedan","5","ZWART","Niet geregistreerd","4","1998","1410","1970","1510","750","1600","20041119","20041119","Geen verstrekking in Open Data",,"Ja",,,,,,,"4","4","0","0",,"464","0","M1",,,"r. op schutbord onder motorkap","1970",,,"e4*2001/116*0065*05","F4F","M5 03","0","0.07","268","Nee","Nee",,"Nee","3570","0",,"2024","Logisch","00","Ja","2025-02-12T00:00:00.000","2024-03-26T00:00:00.000","2004-11-19T00:00:00.000","2004-11-19T00:00:00.000",,,,,,,,,,,,,,,,,,,,,"D",,,,,,,"https://opendata.rdw.nl/resource/3huj-srit.json","https://opendata.rdw.nl/resource/8ys7-d773.json","https://opendata.rdw.nl/resource/vezc-m2t6.json","https://opendata.rdw.nl/resource/jhie-znh9.json","https://opendata.rdw.nl/resource/kmfi-hrps.json"
"01PXP7","Personenauto","SAAB","SAAB 9-3","20240714","20201006","6794","sedan","5","BLAUW","Niet geregistreerd","4","1998","1395","1990","1495","745","1600","20110415","20110415","Geen verstrekking in Open Data","34010","Ja",,,,,,,"4","4","0","0",,"465","0","M1",,,"r. op schutbord onder motorkap","1990","YS3F",,"e4*2001/116*0065*28","F4SAA","M6F01","0","0.09","268","Nee","Nee",,"Nee","3590","0","0.00","2024","Logisch","00","Ja","2024-07-14T00:00:00.000","2020-10-06T00:00:00.000","2011-04-15T00:00:00.000","2011-04-15T00:00:00.000",,,,,,,,,,,,,,,,,,,,,"C",,,,,,,"https://opendata.rdw.nl/resource/3huj-srit.json","https://opendata.rdw.nl/resource/8ys7-d773.json","https://opendata.rdw.nl/resource/vezc-m2t6.json","https://opendata.rdw.nl/resource/jhie-znh9.json","https://opendata.rdw.nl/resource/kmfi-hrps.json"
"01PXXT","Personenauto","SAAB","SAAB 9-3","20241216","20240318","6181","sedan","5","ZWART","Niet geregistreerd","4","1796","1393","1910","1493","720","1400","20050104","20050104","Geen verstrekking in Open Data","27888","Ja",,,,,,,"4","4","0","0",,"464","0","M1",,,"r. op schutbord onder motorkap","1910",,"G3 gasinstallatie","e4*2001/116*0065*08","F4B","M5 03","0","0.06","267","Nee","Nee",,"Nee","3310","0",,"2023","Logisch","00","Ja","2024-12-16T00:00:00.000","2024-03-18T00:00:00.000","2005-01-04T00:00:00.000","2005-01-04T00:00:00.000",,"0",,,,,,,,,,,,,,,,,,,"C",,,,,,,"https://opendata.rdw.nl/resource/3huj-srit.json","https://opendata.rdw.nl/resource/8ys7-d773.json","https://opendata.rdw.nl/resource/vezc-m2t6.json","https://opendata.rdw.nl/resource/jhie-znh9.json","https://opendata.rdw.nl/resource/kmfi-hrps.json"
"01PZFK","Personenauto","SAAB","SAAB 9-3","20250527","20210226","7410","sedan","5","ZWART","Niet geregistreerd","4","1998","1457","1970","1557","750","1600","20050105","20050105","Geen verstrekking in Open Data","32357","Ja",,,,,,,"4","4","0","0",,"464","0","M1",,,"r. op schutbord onder motorkap","1970",,"G3 gasinstallatie","e4*2001/116*0065*05","F4F","M5 03","0","0.07","268","Nee","Nee",,"Nee","3570","0",,"2024","Logisch","00","Ja","2025-05-27T00:00:00.000","2021-02-26T00:00:00.000","2005-01-05T00:00:00.000","2005-01-05T00:00:00.000",,"0",,,,,,,,,,,,,,,,,,,"D",,,,,,,"https://opendata.rdw.nl/resource/3huj-srit.json","https://opendata.rdw.nl/resource/8ys7-d773.json","https://opendata.rdw.nl/resource/vezc-m2t6.json","https://opendata.rdw.nl/resource/jhie-znh9.json","https://opendata.rdw.nl/resource/kmfi-hrps.json"
"01PZJV","Personenauto","SAAB","SAAB 9-3","20241030","20230426","7724","sedan","5","ZWART","Niet geregistreerd","4","1998","1395","1960","1495","745","1600","20050103","20050103","Geen verstrekking in Open Data","33498","Ja",,,,,,,"4","4","0","0",,"464","0","M1",,,"r. op schutbord onder motorkap","1960",,,"e4*2001/116*0065*06","F4F","M5 04","0","0.07","268","Nee","Nee",,"Nee","3560","0",,"2023","Logisch","00","Ja","2024-10-30T00:00:00.000","2023-04-26T00:00:00.000","2005-01-03T00:00:00.000","2005-01-03T00:00:00.000",,,,,,,,,,,,,,,,,,,,,"D",,,,,,,"https://opendata.rdw.nl/resource/3huj-srit.json","https://opendata.rdw.nl/resource/8ys7-d773.json","https://opendata.rdw.nl/resource/vezc-m2t6.json","https://opendata.rdw.nl/resource/jhie-znh9.json","https://opendata.rdw.nl/resource/kmfi-hrps.json"
"01RBTG","Personenauto","SAAB","SAAB 9-3","20241002","20150929","7348","sedan","5","ZWART","Niet geregistreerd","4","1998","1395","1960","1495","745","1600","20050128","20050128","Geen verstrekking in Open Data",,"Ja",,,,,,,"4","4","0","0",,"464","0","M1",,,"r. op schutbord onder motorkap","1960",,,"e4*2001/116*0065*08","F4F","M5 05","0","0.07","268","Nee","Nee",,"Nee","3560","0",,"2023","Logisch","00","Ja","2024-10-02T00:00:00.000","2015-09-29T00:00:00.000","2005-01-28T00:00:00.000","2005-01-28T00:00:00.000",,,,,,,,,,,,,,,,,,,,,"C",,,,,,,"https://opendata.rdw.nl/resource/3huj-srit.json","https://opendata.rdw.nl/resource/8ys7-d773.json","https://opendata.rdw.nl/resource/vezc-m2t6.json","https://opendata.rdw.nl/resource/jhie-znh9.json","https://opendata.rdw.nl/resource/kmfi-hrps.json"
"01RBVD","Personenauto","SAAB","SAAB 9-3","20220326","20190702","15097","sedan","5","ZWART","Niet geregistreerd","4","1998","1460","2000","1560","750","1600","20050204","20050204","Geen verstrekking in Open Data","58909","Nee",,,,,,,"4","4","0","0",,"464","0","M1",,,"r. op schutbord onder motorkap","2000",,,"e4*2001/116*0065*08","F4Y","A5 03","0","0.10","268","Nee","Nee",,"Nee","3600","0",,"2021","Logisch","00","Ja","2022-03-26T00:00:00.000","2019-07-02T00:00:00.000","2005-02-04T00:00:00.000","2005-02-04T00:00:00.000",,,,,,,,,,,,,,,,,,,,,"E",,,,,,,"https://opendata.rdw.nl/resource/3huj-srit.json","https://opendata.rdw.nl/resource/8ys7-d773.json","https://opendata.rdw.nl/resource/vezc-m2t6.json","https://opendata.rdw.nl/resource/jhie-znh9.json","https://opendata.rdw.nl/resource/kmfi-hrps.json"
"01RFJG","Personenauto","SAAB","SAAB 9-3","20151010","20150411","10611","sedan","5","ZWART","Niet geregistreerd","4","1910","1465","2030","1565","750","1500","20050301","20050301","Geen verstrekking in Open Data",,"Ja",,,,,,,"4","4","0","0",,"464","0","M1",,,"r. op schutbord onder motorkap","2030",,,"e4*2001/116*0065*08","F4V","M6 01","0","0.06","268","Nee","Nee",,"Nee","3530","0",,"2015","Logisch","00","Ja","2015-10-10T00:00:00.000","2015-04-11T00:00:00.000","2005-03-01T00:00:00.000","2005-03-01T00:00:00.000",,,,,,,,,,,,,,,,,,,,,"C",,,,,,,"https://opendata.rdw.nl/resource/3huj-srit.json","https://opendata.rdw.nl/resource/8ys7-d773.json","https://opendata.rdw.nl/resource/vezc-m2t6.json","https://opendata.rdw.nl/resource/jhie-znh9.json","https://opendata.rdw.nl/resource/kmfi-hrps.json"