"kenteken","voertuigsoort","merk","handelsbenaming","vervaldatum_apk","datum_tenaamstelling","bruto_bpm","inrichting","aantal_zitplaatsen","eerste_kleur","tweede_kleur","aantal_cilinders","cilinderinhoud","massa_ledig_voertuig","toegestane_maximum_massa_voertuig","massa_rijklaar","maximum_massa_trekken_ongeremd","maximum_trekken_massa_geremd","datum_eerste_toelating","datum_eerste_tenaamstelling_in_nederland","wacht_op_keuren","catalogusprijs","wam_verzekerd","maximale_constructiesnelheid","laadvermogen","oplegger_geremd","aanhangwagen_autonoom_geremd","aanhangwagen_middenas_geremd","aantal_staanplaatsen","aantal_deuren","aantal_wielen","afstand_hart_koppeling_tot_achterzijde_voertuig","afstand_voorzijde_voertuig_tot_hart_koppeling","afwijkende_maximum_snelheid","lengte","breedte","europese_voertuigcategorie","europese_voertuigcategorie_toevoeging","europese_uitvoeringcategorie_toevoeging","plaats_chassisnummer","technische_max_massa_voertuig","type","type_gasinstallatie","typegoedkeuringsnummer","variant","uitvoering","volgnummer_wijziging_eu_typegoedkeuring","vermogen_massarijklaar","wielbasis","export_indicator","openstaande_terugroepactie_indicator","vervaldatum_tachograaf","taxi_indicator","maximum_massa_samenstelling","aantal_rolstoelplaatsen","maximum_ondersteunende_snelheid","jaar_laatste_registratie_tellerstand","tellerstandoordeel","code_toelichting_tellerstandoordeel","tenaamstellen_mogelijk","vervaldatum_apk_dt","datum_tenaamstelling_dt","datum_eerste_toelating_dt","datum_eerste_tenaamstelling_in_nederland_dt","vervaldatum_tachograaf_dt","maximum_last_onder_de_vooras_sen_tezamen_koppeling","type_remsysteem_voertuig_code","rupsonderstelconfiguratiecode","wielbasis_voertuig_minimum","wielbasis_voertuig_maximum","lengte_voertuig_minimum","lengte_voertuig_maximum","breedte_voertuig_minimum","breedte_voertuig_maximum","hoogte_voertuig","hoogte_voertuig_minimum","hoogte_voertuig_maximum","massa_bedrijfsklaar_minimaal","massa_bedrijfsklaar_maximaal","technisch_toelaatbaar_massa_koppelpunt","maximum_massa_technisch_maximaal","maximum_massa_technisch_minimaal","subcategorie_nederland","verticale_belasting_koppelpunt_getrokken_voertuig","zuinigheidsclassificatie","registratie_datum_goedkeuring_afschrijvingsmoment_bpm","registratie_datum_goedkeuring_afschrijvingsmoment_bpm_dt","gem_lading_wrde","aerodyn_voorz","massa_alt_aandr","verl_cab_ind","api_gekentekende_voertuigen_assen","api_gekentekende_voertuigen_brandstof","api_gekentekende_voertuigen_carrosserie","api_gekentekende_voertuigen_carrosserie_specifiek","api_gekentekende_voertuigen_voertuigklasse"
"H341FP","Personenauto","RENAULT","SCENIC HYBRID ASSIST","20241120","20200109","3268","hatchback","7","BRUIN","Niet geregistreerd","4","1461","1515","2301","1615","750","1850","20170829","20200109","Geen verstrekking in Open Data","42439","Ja","184",,,,,,"5","4","0","0",,"464","187","M1",,,,"2301","RFA",,"e2*2007/46*0574*02","RS2","AE6RVA017000","0","0.00","280","Nee","Nee",,"Nee","3801","0","0.00","2023","Geen oordeel","05","Ja","2024-11-20T00:00:00.000","2020-01-09T00:00:00.000","2017-08-29T00:00:00.000","2020-01-09T00:00:00.000",,,,,,,,,,,"165",,,,,,,,,,"B",,,,,,,"https://opendata.rdw.nl/resource/3huj-srit.json","https://opendata.rdw.nl/resource/8ys7-d773.json","https://opendata.rdw.nl/resource/vezc-m2t6.json","https://opendata.rdw.nl/resource/jhie-znh9.json","https://opendata.rdw.nl/resource/kmfi-hrps.json"
"H859GJ","Personenauto","RENAULT","SCENIC HYBRID ASSIST","20241010","20200313","4207","hatchback","5","WIT","ZWART","4","1461","1513","2240","1613","750","1850","20171010","20200313","Geen verstrekking in Open Data","34899","Ja","184",,,,,,"5","4","0","0",,"464","187","M1",,,,"2240","RFA",,"e2*2007/46*0574*02","RS2","AE6RVA015000","0","0.00","280","Nee","Nee",,"Nee","3740","0","0.00","2023","Geen oordeel","05","Ja","2024-10-10T00:00:00.000","2020-03-13T00:00:00.000","2017-10-10T00:00:00.000","2020-03-13T00:00:00.000",,,,,,,,,,,"165",,,,,,,,,,"B",,,,,,,"https://opendata.rdw.nl/resource/3huj-srit.json","https://opendata.rdw.nl/resource/8ys7-d773.json","https://opendata.rdw.nl/resource/vezc-m2t6.json","https://opendata.rdw.nl/resource/jhie-znh9.json","https://opendata.rdw.nl/resource/kmfi-hrps.json"
"P517DX","Personenauto","RENAULT","SCENIC HYBRID ASSIST","20240801","20220723","432","hatchback","5","ORANJE","ZWART","4","1461","1483","2116","1583","750","1850","20180412","20220216","Geen verstrekking in Open Data","36599","Ja","183",,,,,,"5","4","0","0",,"441","187","M1",,,,"2116","RFA",,"e2*2007/46*0574*04","JS2","AE6RVA015000","0","0.00","273","Nee","Nee",,"Nee","3616","0","0.00","2023","Geen oordeel","05","Ja","2024-08-01T00:00:00.000","2022-07-23T00:00:00.000","2018-04-12T00:00:00.000","2022-02-16T00:00:00.000",,,,,,,,,,,"165",,,,,,,,,,,"20220204","2022-02-04T00:00:00.000",,,,,"https://opendata.rdw.nl/resource/3huj-srit.json","https://opendata.rdw.nl/resource/8ys7-d773.json","https://opendata.rdw.nl/resource/vezc-m2t6.json","https://opendata.rdw.nl/resource/jhie-znh9.json","https://opendata.rdw.nl/resource/kmfi-hrps.json"
"PP822P","Personenauto","RENAULT","SCENIC HYBRID ASSIST","20240908","20190504","4207","hatchback","5","GRIJS","Niet geregistreerd","4","1461","1483","2116","1583","750","1850","20170825","20170825","Geen verstrekking in Open Data","36745","Ja",,,,,,,"5","4","0","0",,"441","187","M1",,,"op r. deurstyl","2116","RFA",,"e2*2007/46*0574*02","JS2","AE6RVA015000","0","0.05","273","Nee","Nee",,"Nee","3616","0","0.00","2024","Logisch","00","Ja","2024-09-08T00:00:00.000","2019-05-04T00:00:00.000","2017-08-25T00:00:00.000","2017-08-25T00:00:00.000",,,,,,,,,,,"165",,,,,,,,,,"B",,,,,,,"https://opendata.rdw.nl/resource/3huj-srit.json","https://opendata.rdw.nl/resource/8ys7-d773.json","https://opendata.rdw.nl/resource/vezc-m2t6.json","https://opendata.rdw.nl/resource/jhie-znh9.json","https://opendata.rdw.nl/resource/kmfi-hrps.json"
"PR721Z","Personenauto","RENAULT","SCENIC HYBRID ASSIST","20250118","20220121","4207","hatchback","5","BLAUW","Niet geregistreerd","4","1461","1483","2116","1583","750","1850","20171006","20171006","Geen verstrekking in Open Data","35010","Ja",,,,,,,"5","4","0","0",,"441","187","M1",,,"op r. deurstyl","2116","RFA",,"e2*2007/46*0574*02","JS2","AE6RVA015000","0","0.05","273","Nee","Nee",,"Nee","3616","0","0.00","2024","Logisch","00","Ja","2025-01-18T00:00:00.000","2022-01-21T00:00:00.000","2017-10-06T00:00:00.000","2017-10-06T00:00:00.000",,,,,,,,,,,"165",,,,,,,,,,"B",,,,,,,"https://opendata.rdw.nl/resource/3huj-srit.json","https://opendata.rdw.nl/resource/8ys7-d773.json","https://opendata.rdw.nl/resource/vezc-m2t6.json","https://opendata.rdw.nl/resource/jhie-znh9.json","https://opendata.rdw.nl/resource/kmfi-hrps.json"
"PS556P","Personenauto","RENAULT","SCENIC HYBRID ASSIST","20241109","20210123","4207","hatchback","5","GRIJS","Niet geregistreerd","4","1461","1513","2240","1613","750","1850","20171002","20171002","Geen verstrekking in Open Data","36210","Ja",,,,,,,"5","4","0","0",,"464","187","M1",,,"op r. deurstyl","2240","RFA",,"e2*2007/46*0574*02","RS2","AE6RVA015000","0","0.05","280","Nee","Nee",,"Nee","3740","0","0.00","2023","Logisch","00","Ja","2024-11-09T00:00:00.000","2021-01-23T00:00:00.000","2017-10-02T00:00:00.000","2017-10-02T00:00:00.000",,,,,,,,,,,"165",,,,,,,,,,"B",,,,,,,"https://opendata.rdw.nl/resource/3huj-srit.json","https://opendata.rdw.nl/resource/8ys7-d773.json","https://opendata.rdw.nl/resource/vezc-m2t6.json","https://opendata.rdw.nl/resource/jhie-znh9.json","https://opendata.rdw.nl/resource/kmfi-hrps.json"
"PS665X","Personenauto","RENAULT","SCENIC HYBRID ASSIST","20240915","20220916","4207","hatchback","5","WIT","Niet geregistreerd","4","1461","1513","2240","1613","750","1850","20170915","20170915","Geen verstrekking in Open Data","37715","Ja",,,,,,,"5","4","0","0",,"464","187","M1",,,"op r. deurstyl","2240","RFA",,"e2*2007/46*0574*02","RS2","AE6RVA015000","0","0.05","280","Nee","Nee",,"Nee","3740","0","0.00","2024","Logisch","00","Ja","2024-09-15T00:00:00.000","2022-09-16T00:00:00.000","2017-09-15T00:00:00.000","2017-09-15T00:00:00.000",,,,,,,,,,,"165",,,,,,,,,,"B",,,,,,,"https://opendata.rdw.nl/resource/3huj-srit.json","https://opendata.rdw.nl/resource/8ys7-d773.json","https://opendata.rdw.nl/resource/vezc-m2t6.json","https://opendata.rdw.nl/resource/jhie-znh9.json","https://opendata.rdw.nl/resource/kmfi-hrps.json"
"PT117V","Personenauto","RENAULT","SCENIC HYBRID ASSIST","20241105","20231212","4207","hatchback","7","ZWART","Niet geregistreerd","4","1461","1515","2301","1615","750","1850","20170922","20170922","Geen verstrekking in Open Data","37405","Ja",,,,,,,"5","4","0","0",,"464","187","M1",,,"op r. deurstyl","2301","RFA",,"e2*2007/46*0574*02","RS2","AE6RVA017000","0","0.05","280","Nee","Nee",,"Nee","3801","0","0.00","2023","Logisch","00","Ja","2024-11-05T00:00:00.000","2023-12-12T00:00:00.000","2017-09-22T00:00:00.000","2017-09-22T00:00:00.000",,,,,,,,,,,"165",,,,,,,,,,"B",,,,,,,"https://opendata.rdw.nl/resource/3huj-srit.json","https://opendata.rdw.nl/resource/8ys7-d773.json","https://opendata.rdw.nl/resource/vezc-m2t6.json","https://opendata.rdw.nl/resource/jhie-znh9.json","https://opendata.rdw.nl/resource/kmfi-hrps.json"
"PZ106S","Personenauto","RENAULT","SCENIC HYBRID ASSIST","20241104","20240216","4207","hatchback","5","ZWART","Niet geregistreerd","4","1461","1513","2240","1613","750","1850","20171020","20171020","Geen verstrekking in Open Data","38455","Ja",,,,,,,"5","4","0","0",,"464","187","M1",,,"op r. deurstyl","2240","RFA",,"e2*2007/46*0574*02","RS2","AE6RVA015000","0","0.05","280","Nee","Nee",,"Nee","3740","0","0.00","2024","Logisch","00","Ja","2024-11-04T00:00:00.000","2024-02-16T00:00:00.000","2017-10-20T00:00:00.000","2017-10-20T00:00:00.000",,,,,,,,,,,"165",,,,,,,,,,"B",,,,,,,"https://opendata.rdw.nl/resource/3huj-srit.json","https://opendata.rdw.nl/resource/8ys7-d773.json","https://opendata.rdw.nl/resource/vezc-m2t6.json","https://opendata.rdw.nl/resource/jhie-znh9.json","https://opendata.rdw.nl/resource/kmfi-hrps.json"
"PZ310V","Personenauto","RENAULT","SCENIC HYBRID ASSIST","20250418","20220221","4207","hatchback","5","GRIJS","Niet geregistreerd","4","1461","1483","2116","1583","750","1850","20171028","20171028","Geen verstrekking in Open Data","34490","Ja",,,,,,,"5","4","0","0",,"441","187","M1",,,"op r. deurstyl","2116","RFA",,"e2*2007/46*0574*02","JS2","AE6RVA015000","0","0.05","273","Nee","Nee",,"Nee","3616","0","0.00","2024","Logisch","00","Ja","2025-04-18T00:00:00.000","2022-02-21T00:00:00.000","2017-10-28T00:00:00.000","2017-10-28T00:00:00.000",,,,,,,,,,,"165",,,,,,,,,,"B",,,,,,,"https://opendata.rdw.nl/resource/3huj-srit.json","https://opendata.rdw.nl/resource/8ys7-d773.json","https://opendata.rdw.nl/resource/vezc-m2t6.json","https://opendata.rdw.nl/resource/jhie-znh9.json","https://opendata.rdw.nl/resource/kmfi-hrps.json"
"PZ677B","Personenauto","RENAULT","SCENIC HYBRID ASSIST","20250303","20210308","4533","hatchback","5","WIT","Niet geregistreerd","4","1461","1483","2116","1583","750","1850","20190102","20190102","Geen verstrekking in Open Data","37631","Ja",,,,,,,"5","4","0","0",,"441","187","M1",,,"op r. deurstyl","2116","RFA",,"e2*2007/46*0574*02","JS2","AE6RVA015000","0","0.05","273","Nee","Nee",,"Nee","3616","0","0.00","2024","Logisch","00","Ja","2025-03-03T00:00:00.000","2021-03-08T00:00:00.000","2019-01-02T00:00:00.000","2019-01-02T00:00:00.000",,,,,,,,,,,"165",,,,,,,,,,,,,,,,,"https://opendata.rdw.nl/resource/3huj-srit.json","https://opendata.rdw.nl/resource/8ys7-d773.json","https://opendata.rdw.nl/resource/vezc-m2t6.json","https://opendata.rdw.nl/resource/jhie-znh9.json","https://opendata.rdw.nl/resource/kmfi-hrps.json"
"PZ721Z","Personenauto","RENAULT","SCENIC HYBRID ASSIST","20250407","20220611","4207","hatchback","7","BLAUW","Niet geregistreerd","4","1461","1515","2301","1615","750","1850","20171115","20171115","Geen verstrekking in Open Data","34710","Ja",,,,,,,"5","4","0","0",,"464","187","M1",,,"op r. deurstyl","2301","RFA",,"e2*2007/46*0574*02","RS2","AE6RVA017000","0","0.05","280","Nee","Nee",,"Nee","3801","0","0.00","2024","Logisch","00","Ja","2025-04-07T00:00:00.000","2022-06-11T00:00:00.000","2017-11-15T00:00:00.000","2017-11-15T00:00:00.000",,,,,,,,,,,"165",,,,,,,,,,"B",,,,,,,"https://opendata.rdw.nl/resource/3huj-srit.json","https://opendata.rdw.nl/resource/8ys7-d773.json","https://opendata.rdw.nl/resource/vezc-m2t6.json","https://opendata.rdw.nl/resource/jhie-znh9.json","https://opendata.rdw.nl/resource/kmfi-hrps.json"
"RB484T","Personenauto","RENAULT","SCENIC HYBRID ASSIST","20240708","20220708","2845","hatchback","5","ZWART","GRIJS","4","1461","1483","2116","1583","750","1850","20170301","20171206","Geen verstrekking in Open Data","35705","Ja",,,,,,,"5","4",,,,,,"M1",,,"r. deurstyl","2116","RFA",,,,,,"0.00","273","Nee","Nee",,"Nee","3616",,,"2023","Geen oordeel","05","Ja","2024-07-08T00:00:00.000","2022-07-08T00:00:00.000","2017-03-01T00:00:00.000","2017-12-06T00:00:00.000",,,,,,,,,,,,,,,,,,,,,,,,,,,,"https://opendata.rdw.nl/resource/3huj-srit.json","https://opendata.rdw.nl/resource/8ys7-d773.json","https://opendata.rdw.nl/resource/vezc-m2t6.json","https://opendata.rdw.nl/resource/jhie-znh9.json","https://opendata.rdw.nl/resource/kmfi-hrps.json"
"RD377P","Personenauto","RENAULT","SCENIC HYBRID ASSIST","20241031","20200625","4207","hatchback","5","GRIJS","Niet geregistreerd","4","1461","1513","2240","1613","750","1850","20171031","20171031","Geen verstrekking in Open Data","38455","Ja",,,,,,,"5","4","0","0",,"464","187","M1",,,"op r. deurstyl","2240","RFA",,"e2*2007/46*0574*02","RS2","AE6RVA015000","0","0.05","280","Nee","Nee",,"Nee","3740","0","0.00","2023","Logisch","00","Ja","2024-10-31T00:00:00.000","2020-06-25T00:00:00.000","2017-10-31T00:00:00.000","2017-10-31T00:00:00.000",,,,,,,,,,,"165",,,,,,,,,,"B",,,,,,,"https://opendata.rdw.nl/resource/3huj-srit.json","https://opendata.rdw.nl/resource/8ys7-d773.json","https://opendata.rdw.nl/resource/vezc-m2t6.json","https://opendata.rdw.nl/resource/jhie-znh9.json","https://opendata.rdw.nl/resource/kmfi-hrps.json"
"RD681K","Personenauto","RENAULT","SCENIC HYBRID ASSIST","20250210","20210212","4207","hatchback","5","WIT","Niet geregistreerd","4","1461","1513","2240","1613","750","1850","20171103","20171103","Geen verstrekking in Open Data","35120","Ja",,,,,,,"5","4","0","0",,"464","187","M1",,,"op r. deurstyl","2240","RFA",,"e2*2007/46*0574*02","RS2","AE6RVA015000","0","0.05","280","Nee","Nee",,"Nee","3740","0","0.00","2024","Logisch","00","Ja","2025-02-10T00:00:00.000","2021-02-12T00:00:00.000","2017-11-03T00:00:00.000","2017-11-03T00:00:00.000",,,,,,,,,,,"165",,,,,,,,,,"B",,,,,,,"https://opendata.rdw.nl/resource/3huj-srit.json","https://opendata.rdw.nl/resource/8ys7-d773.json","https://opendata.rdw.nl/resource/vezc-m2t6.json","https://opendata.rdw.nl/resource/jhie-znh9.json","https://opendata.rdw.nl/resource/kmfi-hrps.json"
"RD709K","Personenauto","RENAULT","SCENIC HYBRID ASSIST","20241208","20220108","4207","hatchback","5","GRIJS","Niet geregistreerd","4","1461","1513","2240","1613","750","1850","20171108","20171108","Geen verstrekking in Open Data","37809","Ja",,,,,,,"5","4","0","0",,"464","187","M1",,,"op r. deurstyl","2240","RFA",,"e2*2007/46*0574*02","RS2","AE6RVA015000","0","0.05","280","Nee","Nee",,"Nee","3740","0","0.00","2023","Logisch","00","Ja","2024-12-08T00:00:00.000","2022-01-08T00:00:00.000","2017-11-08T00:00:00.000","2017-11-08T00:00:00.000",,,,,,,,,,,"165",,,,,,,,,,"B",,,,,,,"https://opendata.rdw.nl/resource/3huj-srit.json","https://opendata.rdw.nl/resource/8ys7-d773.json","https://opendata.rdw.nl/resource/vezc-m2t6.json","https://opendata.rdw.nl/resource/jhie-znh9.json","https://opendata.rdw.nl/resource/kmfi-hrps.json"
"RD997G","Personenauto","RENAULT","SCENIC HYBRID ASSIST","20241104","20220516","4207","hatchback","7","WIT","Niet geregistreerd","4","1461","1515","2301","1615","750","1850","20171103","20171103","Geen verstrekking in Open Data","35920","Ja",,,,,,,"5","4","0","0",,"464","187","M1",,,"op r. deurstyl","2301","RFA",,"e2*2007/46*0574*02","RS2","AE6RVA017000","0","0.05","280","Nee","Nee",,"Nee","3801","0","0.00","2023","Logisch","00","Ja","2024-11-04T00:00:00.000","2022-05-16T00:00:00.000","2017-11-03T00:00:00.000","2017-11-03T00:00:00.000",,,,,,,,,,,"165",,,,,,,,,,"B",,,,,,,"https://opendata.rdw.nl/resource/3huj-srit.json","https://opendata.rdw.nl/resource/8ys7-d773.json","https://opendata.rdw.nl/resource/vezc-m2t6.json","https://opendata.rdw.nl/resource/jhie-znh9.json","https://opendata.rdw.nl/resource/kmfi-hrps.json"
"RF465F","Personenauto","RENAULT","SCENIC HYBRID ASSIST","20250601","20230602","4207","hatchback","5","GRIJS","Niet geregistreerd","4","1461","1483","2116","1583","750","1850","20171106","20171106","Geen verstrekking in Open Data","33700","Ja",,,,,,,"5","4","0","0",,"441","187","M1",,,"op r. deurstyl","2116","RFA",,"e2*2007/46*0574*02","JS2","AE6RVA015000","0","0.05","273","Nee","Nee",,"Nee","3616","0","0.00","2024","Logisch","00","Ja","2025-06-01T00:00:00.000","2023-06-02T00:00:00.000","2017-11-06T00:00:00.000","2017-11-06T00:00:00.000",,,,,,,,,,,"165",,,,,,,,,,"B",,,,,,,"https://opendata.rdw.nl/resource/3huj-srit.json","https://opendata.rdw.nl/resource/8ys7-d773.json","https://opendata.rdw.nl/resource/vezc-m2t6.json","https://opendata.rdw.nl/resource/jhie-znh9.json","https://opendata.rdw.nl/resource/kmfi-hrps.json"
"RF844S","Personenauto","RENAULT","SCENIC HYBRID ASSIST","20241108","20211021","4207","hatchback","7","ZWART","Niet geregistreerd","4","1461","1515","2301","1615","750","1850","20171108","20171108","Geen verstrekking in Open Data","41815","Ja",,,,,,,"5","4","0","0",,"464","187","M1",,,"op r. deurstyl","2301","RFA",,"e2*2007/46*0574*02","RS2","AE6RVA017000","0","0.05","280","Nee","Nee",,"Nee","3801","0","0.00","2024","Logisch","00","Ja","2024-11-08T00:00:00.000","2021-10-21T00:00:00.000","2017-11-08T00:00:00.000","2017-11-08T00:00:00.000",,,,,,,,,,,"165",,,,,,,,,,"B",,,,,,,"https://opendata.rdw.nl/resource/3huj-srit.json","https://opendata.rdw.nl/resource/8ys7-d773.json","https://opendata.rdw.nl/resource/vezc-m2t6.json","https://opendata.rdw.nl/resource/jhie-znh9.json","https://opendata.rdw.nl/resource/kmfi-hrps.json"
"RG269B","Personenauto","RENAULT","SCENIC HYBRID ASSIST","20241207","20240116","4207","hatchback","5","GRIJS","Niet geregistreerd","4","1461","1513","2240","1613","750","1850","20171114","20171114","Geen verstrekking in Open Data","37910","Ja",,,,,,,"5","4","0","0",,"464","187","M1",,,"op r. deurstyl","2240","RFA",,"e2*2007/46*0574*02","RS2","AE6RVA015000","0","0.05","280","Nee","Nee",,"Nee","3740","0","0.00","2024","Logisch","00","Ja","2024-12-07T00:00:00.000","2024-01-16T00:00:00.000","2017-11-14T00:00:00.000","2017-11-14T00:00:00.000",,,,,,,,,,,"165",,,,,,,,,,"B",,,,,,,"https://opendata.rdw.nl/resource/3huj-srit.json","https://opendata.rdw.nl/resource/8ys7-d773.json","https://opendata.rdw.nl/resource/vezc-m2t6.json","https://opendata.rdw.nl/resource/jhie-znh9.json","https://opendata.rdw.nl/resource/kmfi-hrps.json"
"RG638Z","Personenauto","RENAULT","SCENIC HYBRID ASSIST","20250519","20220521","4207","hatchback","7","BLAUW","Niet geregistreerd","4","1461","1515","2301","1615","750","1850","20171123","20171123","Geen verstrekking in Open Data","37010","Ja",,,,,,,"5","4","0","0",,"464","187","M1",,,"op r. deurstyl","2301","RFA",,"e2*2007/46*0574*02","RS2","AE6RVA017000","0","0.05","280","Nee","Nee",,"Nee","3801","0","0.00","2024","Logisch","00","Ja","2025-05-19T00:00:00.000","2022-05-21T00:00:00.000","2017-11-23T00:00:00.000","2017-11-23T00:00:00.000",,,,,,,,,,,"165",,,,,,,,,,"B",,,,,,,"https://opendata.rdw.nl/resource/3huj-srit.json","https://opendata.rdw.nl/resource/8ys7-d773.json","https://opendata.rdw.nl/resource/vezc-m2t6.json","https://opendata.rdw.nl/resource/jhie-znh9.json","https://opendata.rdw.nl/resource/kmfi-hrps.json"
"RK282R","Personenauto","RENAULT","SCENIC HYBRID ASSIST","20241021","20211025","4207","hatchback","5","BRUIN","Niet geregistreerd","4","1461","1513","2240","1613","750","1850","20180104","20180104","Geen verstrekking in Open Data","38750","Ja",,,,,,,"5","4","0","0",,"464","187","M1",,,"op r. deurstyl","2240","RFA",,"e2*2007/46*0574*02","RS2","AE6RVA015000","0","0.05","280","Nee","Nee",,"Nee","3740","0","0.00","2024","Logisch","00","Ja","2024-10-21T00:00:00.000","2021-10-25T00:00:00.000","2018-01-04T00:00:00.000","2018-01-04T00:00:00.000",,,,,,,,,,,"165",,,,,,,,,,"B",,,,,,,"https://opendata.rdw.nl/resource/3huj-srit.json","https://opendata.rdw.nl/resource/8ys7-d773.json","https://opendata.rdw.nl/resource/vezc-m2t6.json","https://opendata.rdw.nl/resource/jhie-znh9.json","https://opendata.rdw.nl/resource/kmfi-hrps.json"
"RK291T","Personenauto","RENAULT","SCENIC HYBRID ASSIST","20241228","20230714","4207","hatchback","7","BLAUW","Niet geregistreerd","4","1461","1515","2301","1615","750","1850","20171228","20171228","Geen verstrekking in Open Data","35105","Ja",,,,,,,"5","4","0","0",,"464","187","M1",,,"op r. deurstyl","2301","RFA",,"e2*2007/46*0574*02","RS2","AE6RVA017000","0","0.05","280","Nee","Nee",,"Nee","3801","0","0.00","2023","Onlogisch","04","Ja","2024-12-28T00:00:00.000","2023-07-14T00:00:00.000","2017-12-28T00:00:00.000","2017-12-28T00:00:00.000",,,,,,,,,,,"165",,,,,,,,,,"B",,,,,,,"https://opendata.rdw.nl/resource/3huj-srit.json","https://opendata.rdw.nl/resource/8ys7-d773.json","https://opendata.rdw.nl/resource/vezc-m2t6.json","https://opendata.rdw.nl/resource/jhie-znh9.json","https://opendata.rdw.nl/resource/kmfi-hrps.json"
"RK456X","Personenauto","RENAULT","SCENIC HYBRID ASSIST","20241220","20190215","4207","hatchback","5","WIT","Niet geregistreerd","4","1461","1513","2240","1613","750","1850","20171220","20171220","Geen verstrekking in Open Data","39400","Ja",,,,,,,"5","4","0","0",,"464","187","M1",,,"op r. deurstyl","2240","RFA",,"e2*2007/46*0574*02","RS2","AE6RVA015000","0","0.05","280","Nee","Nee",,"Nee","3740","0","0.00","2023","Logisch","00","Ja","2024-12-20T00:00:00.000","2019-02-15T00:00:00.000","2017-12-20T00:00:00.000","2017-12-20T00:00:00.000",,,,,,,,,,,"165",,,,,,,,,,"B",,,,,,,"https://opendata.rdw.nl/resource/3huj-srit.json","https://opendata.rdw.nl/resource/8ys7-d773.json","https://opendata.rdw.nl/resource/vezc-m2t6.json","https://opendata.rdw.nl/resource/jhie-znh9.json","https://opendata.rdw.nl/resource/kmfi-hrps.json"
"RK505X","Personenauto","RENAULT","SCENIC HYBRID ASSIST","20250105","20190717","4207","hatchback","5","ZWART","Niet geregistreerd","4","1461","1513","2240","1613","750","1850","20180105","20180105","Geen verstrekking in Open Data","37795","Ja",,,,,,,"5","4","0","0",,"464","187","M1",,,"op r. deurstyl","2240","RFA",,"e2*2007/46*0574*02","RS2","AE6RVA015000","0","0.05","280","Nee","Nee",,"Nee","3740","0","0.00","2024","Logisch","00","Ja","2025-01-05T00:00:00.000","2019-07-17T00:00:00.000","2018-01-05T00:00:00.000","2018-01-05T00:00:00.000",,,,,,,,,,,"165",,,,,,,,,,"B",,,,,,,"https://opendata.rdw.nl/resource/3huj-srit.json","https://opendata.rdw.nl/resource/8ys7-d773.json","https://opendata.rdw.nl/resource/vezc-m2t6.json","https://opendata.rdw.nl/resource/jhie-znh9.json","https://opendata.rdw.nl/resource/kmfi-hrps.json"