"kenteken","voertuigsoort","merk","handelsbenaming","vervaldatum_apk","datum_tenaamstelling","bruto_bpm","inrichting","aantal_zitplaatsen","eerste_kleur","tweede_kleur","aantal_cilinders","cilinderinhoud","massa_ledig_voertuig","toegestane_maximum_massa_voertuig","massa_rijklaar","maximum_massa_trekken_ongeremd","maximum_trekken_massa_geremd","datum_eerste_toelating","datum_eerste_tenaamstelling_in_nederland","wacht_op_keuren","catalogusprijs","wam_verzekerd","maximale_constructiesnelheid","laadvermogen","oplegger_geremd","aanhangwagen_autonoom_geremd","aanhangwagen_middenas_geremd","aantal_staanplaatsen","aantal_deuren","aantal_wielen","afstand_hart_koppeling_tot_achterzijde_voertuig","afstand_voorzijde_voertuig_tot_hart_koppeling","afwijkende_maximum_snelheid","lengte","breedte","europese_voertuigcategorie","europese_voertuigcategorie_toevoeging","europese_uitvoeringcategorie_toevoeging","plaats_chassisnummer","technische_max_massa_voertuig","type","type_gasinstallatie","typegoedkeuringsnummer","variant","uitvoering","volgnummer_wijziging_eu_typegoedkeuring","vermogen_massarijklaar","wielbasis","export_indicator","openstaande_terugroepactie_indicator","vervaldatum_tachograaf","taxi_indicator","maximum_massa_samenstelling","aantal_rolstoelplaatsen","maximum_ondersteunende_snelheid","jaar_laatste_registratie_tellerstand","tellerstandoordeel","code_toelichting_tellerstandoordeel","tenaamstellen_mogelijk","vervaldatum_apk_dt","datum_tenaamstelling_dt","datum_eerste_toelating_dt","datum_eerste_tenaamstelling_in_nederland_dt","vervaldatum_tachograaf_dt","maximum_last_onder_de_vooras_sen_tezamen_koppeling","type_remsysteem_voertuig_code","rupsonderstelconfiguratiecode","wielbasis_voertuig_minimum","wielbasis_voertuig_maximum","lengte_voertuig_minimum","lengte_voertuig_maximum","breedte_voertuig_minimum","breedte_voertuig_maximum","hoogte_voertuig","hoogte_voertuig_minimum","hoogte_voertuig_maximum","massa_bedrijfsklaar_minimaal","massa_bedrijfsklaar_maximaal","technisch_toelaatbaar_massa_koppelpunt","maximum_massa_technisch_maximaal","maximum_massa_technisch_minimaal","subcategorie_nederland","verticale_belasting_koppelpunt_getrokken_voertuig","zuinigheidsclassificatie","registratie_datum_goedkeuring_afschrijvingsmoment_bpm","registratie_datum_goedkeuring_afschrijvingsmoment_bpm_dt","gem_lading_wrde","aerodyn_voorz","massa_alt_aandr","verl_cab_ind","api_gekentekende_voertuigen_assen","api_gekentekende_voertuigen_brandstof","api_gekentekende_voertuigen_carrosserie","api_gekentekende_voertuigen_carrosserie_specifiek","api_gekentekende_voertuigen_voertuigklasse"
"G053DN","Personenauto","PORSCHE","PANAMERA 4S DIESEL","20250509","20190905","23007","hatchback","4","GRIJS","Niet geregistreerd","8","3956","2025","2635","2125","750","2200","20170509","20190905","Geen verstrekking in Open Data","184437","Ja","285",,,,,,"4","4","0","0",,"0","0","M1",,,,"2635","971",,"e13*2007/46*0971*03","GJ22","1644100","0","0.15","295","Nee","Nee",,"Nee","4835","0","0.00","2024","Geen oordeel","05","Ja","2025-05-09T00:00:00.000","2019-09-05T00:00:00.000","2017-05-09T00:00:00.000","2019-09-05T00:00:00.000",,,,,,,,,,,,,,,,,,,,,"E",,,,,,,"https://opendata.rdw.nl/resource/3huj-srit.json","https://opendata.rdw.nl/resource/8ys7-d773.json","https://opendata.rdw.nl/resource/vezc-m2t6.json","https://opendata.rdw.nl/resource/jhie-znh9.json","https://opendata.rdw.nl/resource/kmfi-hrps.json"
"H554VS","Personenauto","PORSCHE","PANAMERA 4S DIESEL","20250117","20210426","21393","hatchback","4","GRIJS","Niet geregistreerd","8","3956","2025","2635","2125","750","2200","20180117","20200603","Geen verstrekking in Open Data","141362","Ja","285",,,,,,"4","4","0","0",,"0","0","M1",,,,"2635","971",,"e13*2007/46*0971*04","GJ22","1644100","0","0.15","295","Nee","Nee",,"Nee","4835","0","0.00","2023","Geen oordeel","05","Ja","2025-01-17T00:00:00.000","2021-04-26T00:00:00.000","2018-01-17T00:00:00.000","2020-06-03T00:00:00.000",,,,,,,,,,,,,,,,,,,,,"F",,,,,,,"https://opendata.rdw.nl/resource/3huj-srit.json","https://opendata.rdw.nl/resource/8ys7-d773.json","https://opendata.rdw.nl/resource/vezc-m2t6.json","https://opendata.rdw.nl/resource/jhie-znh9.json","https://opendata.rdw.nl/resource/kmfi-hrps.json"
"H748TR","Personenauto","PORSCHE","PANAMERA 4S DIESEL","20241019","20240514","21289","hatchback","4","GRIJS","Niet geregistreerd","8","3956","2025","2635","2125","750","2200","20171019","20200529","Geen verstrekking in Open Data","192468","Ja","285",,,,,,"4","4","0","0",,"0","0","M1",,,,"2635","971",,"e13*2007/46*0971*01","GJ22","1644100","0","0.15","295","Nee","Nee",,"Nee","4835","0","0.00","2024","Geen oordeel","05","Ja","2024-10-19T00:00:00.000","2024-05-14T00:00:00.000","2017-10-19T00:00:00.000","2020-05-29T00:00:00.000",,,,,,,,,,,,,,,,,,,,,"E",,,,,,,"https://opendata.rdw.nl/resource/3huj-srit.json","https://opendata.rdw.nl/resource/8ys7-d773.json","https://opendata.rdw.nl/resource/vezc-m2t6.json","https://opendata.rdw.nl/resource/jhie-znh9.json","https://opendata.rdw.nl/resource/kmfi-hrps.json"
"J767PJ","Personenauto","PORSCHE","PANAMERA 4S DIESEL","20240821","20200921","31144","hatchback","4","GRIJS","Niet geregistreerd","8","3956","2025","2635","2125","750","2200","20190821","20200921","Geen verstrekking in Open Data","206165","Ja","285",,,,,,"4","4","0","0",,"0","0","M1",,,,"2635","971",,"e13*2007/46*0971*04","GJ22","1644100","0","0.15","295","Nee","Nee",,"Nee","4835","0","0.00","2023","Geen oordeel","05","Ja","2024-08-21T00:00:00.000","2020-09-21T00:00:00.000","2019-08-21T00:00:00.000","2020-09-21T00:00:00.000",,,,,,,,,,,,,,,,,,,,,"F",,,,,,,"https://opendata.rdw.nl/resource/3huj-srit.json","https://opendata.rdw.nl/resource/8ys7-d773.json","https://opendata.rdw.nl/resource/vezc-m2t6.json","https://opendata.rdw.nl/resource/jhie-znh9.json","https://opendata.rdw.nl/resource/kmfi-hrps.json"
"K551TG","Personenauto","PORSCHE","PANAMERA 4S DIESEL","20250311","20210304","25738","hatchback","4","GRIJS","Niet geregistreerd","8","3956","2025","2635","2125","750","2200","20190821","20210304","Geen verstrekking in Open Data","177037","Ja","285",,,,,,"4","4",,,,,,"M1",,,,"2635","971",,,,,,"0.15","295","Nee","Nee",,"Nee","4835",,,"2024","Geen oordeel","05","Ja","2025-03-11T00:00:00.000","2021-03-04T00:00:00.000","2019-08-21T00:00:00.000","2021-03-04T00:00:00.000",,,,,,,,,,,,,,,,,,,,,,,,,,,,"https://opendata.rdw.nl/resource/3huj-srit.json","https://opendata.rdw.nl/resource/8ys7-d773.json","https://opendata.rdw.nl/resource/vezc-m2t6.json","https://opendata.rdw.nl/resource/jhie-znh9.json","https://opendata.rdw.nl/resource/kmfi-hrps.json"
"K904GB","Personenauto","PORSCHE","PANAMERA 4S DIESEL","20250228","20201204","23384","hatchback","4","WIT","Niet geregistreerd","8","3956","2025","2635","2125","750","2200","20170103","20201204","Geen verstrekking in Open Data","178484","Ja","285",,,,,,"4","4","0","0",,"0","0","M1",,,,"2635","971",,"e13*2007/46*0971*01","GJ22","1644100","0","0.15","295","Nee","Nee",,"Nee","4835","0","0.00","2024","Geen oordeel","05","Ja","2025-02-28T00:00:00.000","2020-12-04T00:00:00.000","2017-01-03T00:00:00.000","2020-12-04T00:00:00.000",,,,,,,,,,,,,,,,,,,,,"E",,,,,,,"https://opendata.rdw.nl/resource/3huj-srit.json","https://opendata.rdw.nl/resource/8ys7-d773.json","https://opendata.rdw.nl/resource/vezc-m2t6.json","https://opendata.rdw.nl/resource/jhie-znh9.json","https://opendata.rdw.nl/resource/kmfi-hrps.json"
"KZ067L","Personenauto","PORSCHE","PANAMERA 4S DIESEL","20250203","20230718","24634","hatchback","4","GRIJS","Niet geregistreerd","8","3956","2025","2635","2125","750","2200","20170105","20170105","Geen verstrekking in Open Data","177347","Ja",,,,,,,"4","4","0","0",,"505","194","M1",,,"onder r. voorzitting","2635","971",,"e13*2007/46*0971*01","GJ22","1644100","0","0.15","295","Nee","Nee",,"Nee","4835","0","0.00","2024","Logisch","00","Ja","2025-02-03T00:00:00.000","2023-07-18T00:00:00.000","2017-01-05T00:00:00.000","2017-01-05T00:00:00.000",,,,,,,,,,,"142",,,,,,,,,,"E",,,,,,,"https://opendata.rdw.nl/resource/3huj-srit.json","https://opendata.rdw.nl/resource/8ys7-d773.json","https://opendata.rdw.nl/resource/vezc-m2t6.json","https://opendata.rdw.nl/resource/jhie-znh9.json","https://opendata.rdw.nl/resource/kmfi-hrps.json"
"N664GB","Personenauto","PORSCHE","PANAMERA 4S DIESEL","20250302","20210929","27623","hatchback","4","GRIJS","Niet geregistreerd","8","3956","2025","2635","2125","750","2200","20170704","20210929","Geen verstrekking in Open Data","165239","Ja","285",,,,,,"4","4","0","0",,"0","0","M1",,,"r. voorzitting","2635","971",,"e13*2007/46*0971*03","GJ22","1644100","0","0.15","295","Nee","Nee",,"Nee","4835","0","0.00","2024","Geen oordeel","05","Ja","2025-03-02T00:00:00.000","2021-09-29T00:00:00.000","2017-07-04T00:00:00.000","2021-09-29T00:00:00.000",,,,,,,,,,,,,,,,,,,,,,,,,,,,"https://opendata.rdw.nl/resource/3huj-srit.json","https://opendata.rdw.nl/resource/8ys7-d773.json","https://opendata.rdw.nl/resource/vezc-m2t6.json","https://opendata.rdw.nl/resource/jhie-znh9.json","https://opendata.rdw.nl/resource/kmfi-hrps.json"
"NB066H","Personenauto","PORSCHE","PANAMERA 4S DIESEL","20250203","20170106","24634","hatchback","4","GRIJS","Niet geregistreerd","8","3956","2025","2635","2125","750","2200","20170106","20170106","Geen verstrekking in Open Data","166834","Ja",,,,,,,"4","4","0","0",,"505","194","M1",,,"onder r. voorzitting","2635","971",,"e13*2007/46*0971*01","GJ22","1644100","0","0.15","295","Nee","Nee",,"Nee","4835","0","0.00","2024","Logisch","00","Ja","2025-02-03T00:00:00.000","2017-01-06T00:00:00.000","2017-01-06T00:00:00.000","2017-01-06T00:00:00.000",,,,,,,,,,,"142",,,,,,,,,,"E",,,,,,,"https://opendata.rdw.nl/resource/3huj-srit.json","https://opendata.rdw.nl/resource/8ys7-d773.json","https://opendata.rdw.nl/resource/vezc-m2t6.json","https://opendata.rdw.nl/resource/jhie-znh9.json","https://opendata.rdw.nl/resource/kmfi-hrps.json"
"ND026B","Personenauto","PORSCHE","PANAMERA 4S DIESEL","20240916","20240125","24634","hatchback","4","GRIJS","Niet geregistreerd","8","3956","2025","2635","2125","750","2200","20170110","20170110","Geen verstrekking in Open Data","200486","Ja",,,,,,,"4","4","0","0",,"505","194","M1",,,"onder r. voorzitting","2635","971",,"e13*2007/46*0971*01","GJ22","1644100","0","0.15","295","Nee","Nee",,"Nee","4835","0","0.00","2024","Logisch","00","Ja","2024-09-16T00:00:00.000","2024-01-25T00:00:00.000","2017-01-10T00:00:00.000","2017-01-10T00:00:00.000",,,,,,,,,,,"142",,,,,,,,,,"E",,,,,,,"https://opendata.rdw.nl/resource/3huj-srit.json","https://opendata.rdw.nl/resource/8ys7-d773.json","https://opendata.rdw.nl/resource/vezc-m2t6.json","https://opendata.rdw.nl/resource/jhie-znh9.json","https://opendata.rdw.nl/resource/kmfi-hrps.json"
"ND029B","Personenauto","PORSCHE","PANAMERA 4S DIESEL","20210312",,"7524","hatchback","4","GRIJS","Niet geregistreerd","8","3956","2025","2635","2125","750","2200","20170112","20170112","Geen verstrekking in Open Data","173885","Nee","285",,,,,,"4","4","0","0",,"505","194","M1",,,"r. voorzitting","2635","971",,"e13*2007/46*0971*01","GJ22","1644100","0","0.15","295","Nee","Nee",,"Nee","4835","0","0.00","2020","Geen oordeel","05","Nee","2021-03-12T00:00:00.000",,"2017-01-12T00:00:00.000","2017-01-12T00:00:00.000",,,,,,,,,,,"142",,,,,,,,,,"E",,,,,,,"https://opendata.rdw.nl/resource/3huj-srit.json","https://opendata.rdw.nl/resource/8ys7-d773.json","https://opendata.rdw.nl/resource/vezc-m2t6.json","https://opendata.rdw.nl/resource/jhie-znh9.json","https://opendata.rdw.nl/resource/kmfi-hrps.json"
"ND388F","Personenauto","PORSCHE","PANAMERA 4S DIESEL","20241205","20170105","24634","hatchback","4","ZWART","Niet geregistreerd","8","3956","2025","2635","2125","750","2200","20170105","20170105","Geen verstrekking in Open Data","183186","Ja",,,,,,,"4","4","0","0",,"505","194","M1",,,"onder r. voorzitting","2635","971",,"e13*2007/46*0971*01","GJ22","1644100","0","0.15","295","Nee","Nee",,"Nee","4835","0","0.00","2023","Logisch","00","Ja","2024-12-05T00:00:00.000","2017-01-05T00:00:00.000","2017-01-05T00:00:00.000","2017-01-05T00:00:00.000",,,,,,,,,,,"142",,,,,,,,,,"E",,,,,,,"https://opendata.rdw.nl/resource/3huj-srit.json","https://opendata.rdw.nl/resource/8ys7-d773.json","https://opendata.rdw.nl/resource/vezc-m2t6.json","https://opendata.rdw.nl/resource/jhie-znh9.json","https://opendata.rdw.nl/resource/kmfi-hrps.json"
"ND585F","Personenauto","PORSCHE","PANAMERA 4S DIESEL","20240229","20230624","13415","hatchback","4","ZWART","Niet geregistreerd","8","3956","2025","2635","2125","750","2200","20170117","20170117","Geen verstrekking in Open Data","168541","Ja","285",,,,,,"4","4","0","0",,"0","0","M1",,,,"2635","971",,"e13*2007/46*0971*01","GJ22","1644100","0","0.15","295","Nee","Nee",,"Nee","4835","0","0.00","2023","Geen oordeel","05","Ja","2024-02-29T00:00:00.000","2023-06-24T00:00:00.000","2017-01-17T00:00:00.000","2017-01-17T00:00:00.000",,,,,,,,,,,,,,,,,,,,,"E","20221005","2022-10-05T00:00:00.000",,,,,"https://opendata.rdw.nl/resource/3huj-srit.json","https://opendata.rdw.nl/resource/8ys7-d773.json","https://opendata.rdw.nl/resource/vezc-m2t6.json","https://opendata.rdw.nl/resource/jhie-znh9.json","https://opendata.rdw.nl/resource/kmfi-hrps.json"
"ND636V","Personenauto","PORSCHE","PANAMERA 4S DIESEL","20241127","20170222","24634","hatchback","4","GRIJS","Niet geregistreerd","8","3956","2025","2635","2125","750","2200","20170222","20170222","Geen verstrekking in Open Data","167689","Ja",,,,,,,"4","4","0","0",,"505","194","M1",,,"onder r. voorzitting","2635","971",,"e13*2007/46*0971*01","GJ22","1644100","0","0.15","295","Nee","Nee",,"Nee","4835","0","0.00","2023","Logisch","00","Ja","2024-11-27T00:00:00.000","2017-02-22T00:00:00.000","2017-02-22T00:00:00.000","2017-02-22T00:00:00.000",,,,,,,,,,,"142",,,,,,,,,,"E",,,,,,,"https://opendata.rdw.nl/resource/3huj-srit.json","https://opendata.rdw.nl/resource/8ys7-d773.json","https://opendata.rdw.nl/resource/vezc-m2t6.json","https://opendata.rdw.nl/resource/jhie-znh9.json","https://opendata.rdw.nl/resource/kmfi-hrps.json"
"ND985J","Personenauto","PORSCHE","PANAMERA 4S DIESEL","20250122","20210123","24634","hatchback","4","GRIJS","Niet geregistreerd","8","3956","2025","2635","2125","750","2200","20170107","20170107","Geen verstrekking in Open Data","211080","Ja",,,,,,,"4","4","0","0",,"505","194","M1",,,"onder r. voorzitting","2635","971",,"e13*2007/46*0971*01","GJ22","1644100","0","0.15","295","Nee","Nee",,"Nee","4835","0","0.00","2024","Logisch","00","Ja","2025-01-22T00:00:00.000","2021-01-23T00:00:00.000","2017-01-07T00:00:00.000","2017-01-07T00:00:00.000",,,,,,,,,,,"142",,,,,,,,,,"E",,,,,,,"https://opendata.rdw.nl/resource/3huj-srit.json","https://opendata.rdw.nl/resource/8ys7-d773.json","https://opendata.rdw.nl/resource/vezc-m2t6.json","https://opendata.rdw.nl/resource/jhie-znh9.json","https://opendata.rdw.nl/resource/kmfi-hrps.json"
"NF944G","Personenauto","PORSCHE","PANAMERA 4S DIESEL","20250203","20231230","24634","hatchback","4","ZWART","Niet geregistreerd","8","3956","2025","2635","2125","750","2200","20170102","20170102","Geen verstrekking in Open Data","194604","Ja",,,,,,,"4","4","0","0",,"505","194","M1",,,"onder r. voorzitting","2635","971",,"e13*2007/46*0971*01","GJ22","1644100","0","0.15","295","Nee","Nee",,"Nee","4835","0","0.00","2024","Logisch","00","Ja","2025-02-03T00:00:00.000","2023-12-30T00:00:00.000","2017-01-02T00:00:00.000","2017-01-02T00:00:00.000",,,,,,,,,,,"142",,,,,,,,,,"E",,,,,,,"https://opendata.rdw.nl/resource/3huj-srit.json","https://opendata.rdw.nl/resource/8ys7-d773.json","https://opendata.rdw.nl/resource/vezc-m2t6.json","https://opendata.rdw.nl/resource/jhie-znh9.json","https://opendata.rdw.nl/resource/kmfi-hrps.json"
"NH885H","Personenauto","PORSCHE","PANAMERA 4S DIESEL","20240816","20240510","9931","hatchback","4","ZWART","Niet geregistreerd","8","3956","2025","2635","2125","750","2200","20170203","20170203","Geen verstrekking in Open Data","175682","Nee","285",,,,,,"4","4","0","0",,"0","0","M1",,,,"2635","971",,"e13*2007/46*0971*01","GJ22","1644100","0","0.15","295","Nee","Nee",,"Nee","4835","0","0.00","2024","Onlogisch","04","Ja","2024-08-16T00:00:00.000","2024-05-10T00:00:00.000","2017-02-03T00:00:00.000","2017-02-03T00:00:00.000",,,,,,,,,,,,,,,,,,,,,"E","20240426","2024-04-26T00:00:00.000",,,,,"https://opendata.rdw.nl/resource/3huj-srit.json","https://opendata.rdw.nl/resource/8ys7-d773.json","https://opendata.rdw.nl/resource/vezc-m2t6.json","https://opendata.rdw.nl/resource/jhie-znh9.json","https://opendata.rdw.nl/resource/kmfi-hrps.json"
"NL343T","Personenauto","PORSCHE","PANAMERA 4S DIESEL","20241215","20240207","28010","hatchback","4","GRIJS","Niet geregistreerd","8","3956","2025","2635","2125","750","2200","20170303","20170303","Geen verstrekking in Open Data","194245","Ja",,,,,,,"4","4","0","0",,"505","194","M1",,,"onder r. voorzitting","2635","971",,"e13*2007/46*0971*02","GJ22","1644100","0","0.15","295","Nee","Nee",,"Nee","4835","0","0.00","2023","Logisch","00","Ja","2024-12-15T00:00:00.000","2024-02-07T00:00:00.000","2017-03-03T00:00:00.000","2017-03-03T00:00:00.000",,,,,,,,,,,"142",,,,,,,,,,"E",,,,,,,"https://opendata.rdw.nl/resource/3huj-srit.json","https://opendata.rdw.nl/resource/8ys7-d773.json","https://opendata.rdw.nl/resource/vezc-m2t6.json","https://opendata.rdw.nl/resource/jhie-znh9.json","https://opendata.rdw.nl/resource/kmfi-hrps.json"
"NL455N","Personenauto","PORSCHE","PANAMERA 4S DIESEL","20250503","20240504","28010","hatchback","4","GRIJS","Niet geregistreerd","8","3956","2025","2635","2125","750","2200","20170304","20170304","Geen verstrekking in Open Data","224069","Ja",,,,,,,"4","4","0","0",,"505","194","M1",,,"onder r. voorzitting","2635","971",,"e13*2007/46*0971*02","GJ22","1644100","0","0.15","295","Nee","Nee",,"Nee","4835","0","0.00","2024","Logisch","00","Ja","2025-05-03T00:00:00.000","2024-05-04T00:00:00.000","2017-03-04T00:00:00.000","2017-03-04T00:00:00.000",,,,,,,,,,,"142",,,,,,,,,,"E",,,,,,,"https://opendata.rdw.nl/resource/3huj-srit.json","https://opendata.rdw.nl/resource/8ys7-d773.json","https://opendata.rdw.nl/resource/vezc-m2t6.json","https://opendata.rdw.nl/resource/jhie-znh9.json","https://opendata.rdw.nl/resource/kmfi-hrps.json"
"NN863K","Personenauto","PORSCHE","PANAMERA 4S DIESEL","20240922","20170315","28010","hatchback","4","GRIJS","Niet geregistreerd","8","3956","2025","2635","2125","750","2200","20170315","20170315","Geen verstrekking in Open Data","174128","Ja",,,,,,,"4","4","0","0",,"505","194","M1",,,"onder r. voorzitting","2635","971",,"e13*2007/46*0971*02","GJ22","1644100","0","0.15","295","Nee","Nee",,"Nee","4835","0","0.00","2023","Logisch","00","Ja","2024-09-22T00:00:00.000","2017-03-15T00:00:00.000","2017-03-15T00:00:00.000","2017-03-15T00:00:00.000",,,,,,,,,,,"142",,,,,,,,,,"E",,,,,,,"https://opendata.rdw.nl/resource/3huj-srit.json","https://opendata.rdw.nl/resource/8ys7-d773.json","https://opendata.rdw.nl/resource/vezc-m2t6.json","https://opendata.rdw.nl/resource/jhie-znh9.json","https://opendata.rdw.nl/resource/kmfi-hrps.json"
"NS402F","Personenauto","PORSCHE","PANAMERA 4S DIESEL","20250126","20191007","19435","hatchback","4","ZWART","Niet geregistreerd","8","3956","2025","2635","2125","750","2200","20170309","20170401","Geen verstrekking in Open Data","160787","Ja",,,,,,,"4","4","0","0",,"0","0","M1",,,"r. voorzitting","2635","971",,"e13*2007/46*0971*01","GJ22","1644100","0","0.15","295","Nee","Nee",,"Nee","4835","0","0.00","2024","Logisch","00","Ja","2025-01-26T00:00:00.000","2019-10-07T00:00:00.000","2017-03-09T00:00:00.000","2017-04-01T00:00:00.000",,,,,,,,,,,,,,,,,,,,,"E",,,,,,,"https://opendata.rdw.nl/resource/3huj-srit.json","https://opendata.rdw.nl/resource/8ys7-d773.json","https://opendata.rdw.nl/resource/vezc-m2t6.json","https://opendata.rdw.nl/resource/jhie-znh9.json","https://opendata.rdw.nl/resource/kmfi-hrps.json"
"NS629Z","Personenauto","PORSCHE","PANAMERA 4S DIESEL","20250214","20181207","28010","hatchback","4","GRIJS","Niet geregistreerd","8","3956","2025","2635","2125","750","2200","20170411","20170411","Geen verstrekking in Open Data","183328","Ja",,,,,,,"4","4","0","0",,"505","194","M1",,,"onder r. voorzitting","2635","971",,"e13*2007/46*0971*03","GJ22","1644100","0","0.15","295","Nee","Nee",,"Nee","4835","0","0.00","2024","Logisch","00","Ja","2025-02-14T00:00:00.000","2018-12-07T00:00:00.000","2017-04-11T00:00:00.000","2017-04-11T00:00:00.000",,,,,,,,,,,"142",,,,,,,,,,"E",,,,,,,"https://opendata.rdw.nl/resource/3huj-srit.json","https://opendata.rdw.nl/resource/8ys7-d773.json","https://opendata.rdw.nl/resource/vezc-m2t6.json","https://opendata.rdw.nl/resource/jhie-znh9.json","https://opendata.rdw.nl/resource/kmfi-hrps.json"
"NX622G","Personenauto","PORSCHE","PANAMERA 4S DIESEL","20250508","20170505","26887","hatchback","4","ZWART","Niet geregistreerd","8","3956","2025","2635","2125","750","2200","20170505","20170505","Geen verstrekking in Open Data","205644","Ja",,,,,,,"4","4","0","0",,"505","194","M1",,,"onder r. voorzitting","2635","971",,"e13*2007/46*0971*03","GJ22","1634100","0","0.15","295","Nee","Nee",,"Nee","4835","0","0.00","2024","Logisch","00","Ja","2025-05-08T00:00:00.000","2017-05-05T00:00:00.000","2017-05-05T00:00:00.000","2017-05-05T00:00:00.000",,,,,,,,,,,"142",,,,,,,,,,"D",,,,,,,"https://opendata.rdw.nl/resource/3huj-srit.json","https://opendata.rdw.nl/resource/8ys7-d773.json","https://opendata.rdw.nl/resource/vezc-m2t6.json","https://opendata.rdw.nl/resource/jhie-znh9.json","https://opendata.rdw.nl/resource/kmfi-hrps.json"
"NX799L","Personenauto","PORSCHE","PANAMERA 4S DIESEL","20250314","20200205","16956","hatchback","4","GRIJS","Niet geregistreerd","8","3956","2025","2635","2125","750","2200","20170302","20200205","Geen verstrekking in Open Data","190668","Ja",,,,,,,"4","4","0","0",,"0","0","M1",,,"r. voorzitting","2635","971",,"e13*2007/46*0971*01","GJ22","1644100","0","0.15","295","Nee","Nee",,"Nee","4835","0","0.00","2024","Geen oordeel","05","Ja","2025-03-14T00:00:00.000","2020-02-05T00:00:00.000","2017-03-02T00:00:00.000","2020-02-05T00:00:00.000",,,,,,,,,,,,,,,,,,,,,"E",,,,,,,"https://opendata.rdw.nl/resource/3huj-srit.json","https://opendata.rdw.nl/resource/8ys7-d773.json","https://opendata.rdw.nl/resource/vezc-m2t6.json","https://opendata.rdw.nl/resource/jhie-znh9.json","https://opendata.rdw.nl/resource/kmfi-hrps.json"
"NX920R","Personenauto","PORSCHE","PANAMERA 4S DIESEL","20250301","20240503","28010","hatchback","4","GRIJS","Niet geregistreerd","8","3956","2025","2635","2125","750","2200","20170506","20170506","Geen verstrekking in Open Data","207972","Ja",,,,,,,"4","4","0","0",,"505","194","M1",,,"onder r. voorzitting","2635","971",,"e13*2007/46*0971*02","GJ22","1644100","0","0.15","295","Nee","Nee",,"Nee","4835","0","0.00","2024","Logisch","00","Ja","2025-03-01T00:00:00.000","2024-05-03T00:00:00.000","2017-05-06T00:00:00.000","2017-05-06T00:00:00.000",,,,,,,,,,,"142",,,,,,,,,,"E",,,,,,,"https://opendata.rdw.nl/resource/3huj-srit.json","https://opendata.rdw.nl/resource/8ys7-d773.json","https://opendata.rdw.nl/resource/vezc-m2t6.json","https://opendata.rdw.nl/resource/jhie-znh9.json","https://opendata.rdw.nl/resource/kmfi-hrps.json"
"NZ965D","Personenauto","PORSCHE","PANAMERA 4S DIESEL","20250430","20201118","16690","hatchback","4","BRUIN","Niet geregistreerd","8","3956","2025","2635","2125","750","2200","20170523","20170523","Geen verstrekking in Open Data","166401","Ja",,,,,,,"4","4",,,,,,"M1",,,"onder r. voorzitting","2635","971",,"e13*2007/46*0971*02","GJ22","1624100","0","0.15","295","Nee","Nee",,"Nee","4835",,,"2024","Geen oordeel","05","Ja","2025-04-30T00:00:00.000","2020-11-18T00:00:00.000","2017-05-23T00:00:00.000","2017-05-23T00:00:00.000",,,,,,,,,,,,,,,,,,,,,"D",,,,,,,"https://opendata.rdw.nl/resource/3huj-srit.json","https://opendata.rdw.nl/resource/8ys7-d773.json","https://opendata.rdw.nl/resource/vezc-m2t6.json","https://opendata.rdw.nl/resource/jhie-znh9.json","https://opendata.rdw.nl/resource/kmfi-hrps.json"