"kenteken","voertuigsoort","merk","handelsbenaming","vervaldatum_apk","datum_tenaamstelling","bruto_bpm","inrichting","aantal_zitplaatsen","eerste_kleur","tweede_kleur","aantal_cilinders","cilinderinhoud","massa_ledig_voertuig","toegestane_maximum_massa_voertuig","massa_rijklaar","maximum_massa_trekken_ongeremd","maximum_trekken_massa_geremd","datum_eerste_toelating","datum_eerste_tenaamstelling_in_nederland","wacht_op_keuren","catalogusprijs","wam_verzekerd","maximale_constructiesnelheid","laadvermogen","oplegger_geremd","aanhangwagen_autonoom_geremd","aanhangwagen_middenas_geremd","aantal_staanplaatsen","aantal_deuren","aantal_wielen","afstand_hart_koppeling_tot_achterzijde_voertuig","afstand_voorzijde_voertuig_tot_hart_koppeling","afwijkende_maximum_snelheid","lengte","breedte","europese_voertuigcategorie","europese_voertuigcategorie_toevoeging","europese_uitvoeringcategorie_toevoeging","plaats_chassisnummer","technische_max_massa_voertuig","type","type_gasinstallatie","typegoedkeuringsnummer","variant","uitvoering","volgnummer_wijziging_eu_typegoedkeuring","vermogen_massarijklaar","wielbasis","export_indicator","openstaande_terugroepactie_indicator","vervaldatum_tachograaf","taxi_indicator","maximum_massa_samenstelling","aantal_rolstoelplaatsen","maximum_ondersteunende_snelheid","jaar_laatste_registratie_tellerstand","tellerstandoordeel","code_toelichting_tellerstandoordeel","tenaamstellen_mogelijk","vervaldatum_apk_dt","datum_tenaamstelling_dt","datum_eerste_toelating_dt","datum_eerste_tenaamstelling_in_nederland_dt","vervaldatum_tachograaf_dt","maximum_last_onder_de_vooras_sen_tezamen_koppeling","type_remsysteem_voertuig_code","rupsonderstelconfiguratiecode","wielbasis_voertuig_minimum","wielbasis_voertuig_maximum","lengte_voertuig_minimum","lengte_voertuig_maximum","breedte_voertuig_minimum","breedte_voertuig_maximum","hoogte_voertuig","hoogte_voertuig_minimum","hoogte_voertuig_maximum","massa_bedrijfsklaar_minimaal","massa_bedrijfsklaar_maximaal","technisch_toelaatbaar_massa_koppelpunt","maximum_massa_technisch_maximaal","maximum_massa_technisch_minimaal","subcategorie_nederland","verticale_belasting_koppelpunt_getrokken_voertuig","zuinigheidsclassificatie","registratie_datum_goedkeuring_afschrijvingsmoment_bpm","registratie_datum_goedkeuring_afschrijvingsmoment_bpm_dt","gem_lading_wrde","aerodyn_voorz","massa_alt_aandr","verl_cab_ind","api_gekentekende_voertuigen_assen","api_gekentekende_voertuigen_brandstof","api_gekentekende_voertuigen_carrosserie","api_gekentekende_voertuigen_carrosserie_specifiek","api_gekentekende_voertuigen_voertuigklasse"
"01FSJF","Personenauto","NISSAN","NISSAN PRIMERA","20240701","20140116","5218","hatchback","5","GRIJS","Niet geregistreerd","4","1769","1225","1740","1325","550","1300","20000630","20000630","Geen verstrekking in Open Data",,"Ja",,,,,,,"4","4","0","0",,"452","0","M1",,,"r. tegen schutbord onder motorkap","1740",,,"e11*93/81*0060*05","F","F02","1","0.06","260","Nee","Nee",,"Nee","3040","0",,"2024","Logisch","00","Ja","2024-07-01T00:00:00.000","2014-01-16T00:00:00.000","2000-06-30T00:00:00.000","2000-06-30T00:00:00.000",,,,,,,,,,,,,,,,,,,,,,,,,,,,"https://opendata.rdw.nl/resource/3huj-srit.json","https://opendata.rdw.nl/resource/8ys7-d773.json","https://opendata.rdw.nl/resource/vezc-m2t6.json","https://opendata.rdw.nl/resource/jhie-znh9.json","https://opendata.rdw.nl/resource/kmfi-hrps.json"
"01GHKD","Personenauto","NISSAN","NISSAN PRIMERA","20241129","20211217","4506","stationwagen","5","BLAUW","Niet geregistreerd","4","1769","1326","1780","1426","550","1275","20001113","20001113","Geen verstrekking in Open Data",,"Ja",,,,,,,"4","4","0","0",,"458","0","M1",,,"r. tegen schutbord onder motorkap","1780",,"G3 gasinstallatie","e11*93/81*0060*04","K","K01","1","0.06","260","Nee","Nee",,"Nee","3055","0",,"2024","Logisch","00","Ja","2024-11-29T00:00:00.000","2021-12-17T00:00:00.000","2000-11-13T00:00:00.000","2000-11-13T00:00:00.000",,"0",,,,,,,,,,,,,,,,,,,,,,,,,,"https://opendata.rdw.nl/resource/3huj-srit.json","https://opendata.rdw.nl/resource/8ys7-d773.json","https://opendata.rdw.nl/resource/vezc-m2t6.json","https://opendata.rdw.nl/resource/jhie-znh9.json","https://opendata.rdw.nl/resource/kmfi-hrps.json"
"01HGTH","Personenauto","NISSAN","NISSAN PRIMERA","20240710","20220706","4509","sedan","5","ROOD","Niet geregistreerd","4","1769","1210","1725","1310","550","1300","20010629","20010629","Geen verstrekking in Open Data",,"Ja",,,,,,,"4","4","0","0",,"452","0","M1",,,"r. tegen schutbord onder motorkap","1725",,,"e11*93/81*0060*04","B","B02","1","0.06","260","Nee","Nee",,"Nee","3025","0",,"2023","Logisch","00","Ja","2024-07-10T00:00:00.000","2022-07-06T00:00:00.000","2001-06-29T00:00:00.000","2001-06-29T00:00:00.000",,,,,,,,,,,,,,,,,,,,,"C",,,,,,,"https://opendata.rdw.nl/resource/3huj-srit.json","https://opendata.rdw.nl/resource/8ys7-d773.json","https://opendata.rdw.nl/resource/vezc-m2t6.json","https://opendata.rdw.nl/resource/jhie-znh9.json","https://opendata.rdw.nl/resource/kmfi-hrps.json"
"01JGNB","Personenauto","NISSAN","NISSAN PRIMERA","20250401","20180329","5284","stationwagen","5","GRIJS","Niet geregistreerd","4","1769","1318","1880","1418","700","1500","20020322","20020322","Geen verstrekking in Open Data",,"Ja",,,,,,,"4","4","0","0",,"468","0","M1",,,"op bodemplaat by r. voorzitting","1880",,,"e11*98/14*0183*00","F","F02","0","0.06","268","Nee","Nee",,"Nee","3380","0",,"2024","Logisch","00","Ja","2025-04-01T00:00:00.000","2018-03-29T00:00:00.000","2002-03-22T00:00:00.000","2002-03-22T00:00:00.000",,,,,,,,,,,,,,,,,,,,,"B",,,,,,,"https://opendata.rdw.nl/resource/3huj-srit.json","https://opendata.rdw.nl/resource/8ys7-d773.json","https://opendata.rdw.nl/resource/vezc-m2t6.json","https://opendata.rdw.nl/resource/jhie-znh9.json","https://opendata.rdw.nl/resource/kmfi-hrps.json"
"01JVXL","Personenauto","NISSAN","NISSAN PRIMERA","20240725","20060720","4665","sedan","5","BLAUW","Niet geregistreerd","4","1597","1262","1790","1362","650","1250","20020930","20020930","Geen verstrekking in Open Data",,"Ja",,,,,,,"4","4","0","0",,"457","0","M1",,,"op bodemplaat by r. voorzitting","1790",,,"e11*98/14*0183*01","A","A02","0","0.06","268","Nee","Nee",,"Nee","3040","0",,"2023","Logisch","00","Ja","2024-07-25T00:00:00.000","2006-07-20T00:00:00.000","2002-09-30T00:00:00.000","2002-09-30T00:00:00.000",,,,,,,,,,,,,,,,,,,,,"B",,,,,,,"https://opendata.rdw.nl/resource/3huj-srit.json","https://opendata.rdw.nl/resource/8ys7-d773.json","https://opendata.rdw.nl/resource/vezc-m2t6.json","https://opendata.rdw.nl/resource/jhie-znh9.json","https://opendata.rdw.nl/resource/kmfi-hrps.json"
"01JXFH","Personenauto","NISSAN","NISSAN PRIMERA","20241006","20190118","5453","sedan","5","BLAUW","Niet geregistreerd","4","1769","1268","1810","1368","675","1500","20020927","20020927","Geen verstrekking in Open Data",,"Ja",,,,,,,"4","4","0","0",,"457","0","M1",,,"op bodemplaat by r. voorzitting","1810",,,"e11*98/14*0183*01","B","B02","0","0.06","268","Nee","Nee",,"Nee","3310","0",,"2023","Logisch","00","Ja","2024-10-06T00:00:00.000","2019-01-18T00:00:00.000","2002-09-27T00:00:00.000","2002-09-27T00:00:00.000",,,,,,,,,,,,,,,,,,,,,"B",,,,,,,"https://opendata.rdw.nl/resource/3huj-srit.json","https://opendata.rdw.nl/resource/8ys7-d773.json","https://opendata.rdw.nl/resource/vezc-m2t6.json","https://opendata.rdw.nl/resource/jhie-znh9.json","https://opendata.rdw.nl/resource/kmfi-hrps.json"
"01LSPP","Personenauto","NISSAN","NISSAN PRIMERA","20240615","20220219","5246","sedan","5","GRIJS","Niet geregistreerd","4","1998","1315","1910","1415","700","1500","20030508","20030508","Geen verstrekking in Open Data",,"Ja",,,,,,,"4","4","0","0",,"457","0","M1",,,"op bodemplaat by r. voorzitting","1910",,,"e11*98/14*0183*02","C","C03","0","0.07","268","Nee","Nee",,"Nee","3410","0",,"2023","Logisch","00","Ja","2024-06-15T00:00:00.000","2022-02-19T00:00:00.000","2003-05-08T00:00:00.000","2003-05-08T00:00:00.000",,,,,,,,,,,,,,,,,,,,,"D",,,,,,,"https://opendata.rdw.nl/resource/3huj-srit.json","https://opendata.rdw.nl/resource/8ys7-d773.json","https://opendata.rdw.nl/resource/vezc-m2t6.json","https://opendata.rdw.nl/resource/jhie-znh9.json","https://opendata.rdw.nl/resource/kmfi-hrps.json"
"01NBVR","Personenauto","NISSAN","NISSAN PRIMERA","20240805","20030725","5012","hatchback","5","BEIGE","Niet geregistreerd","4","1769","1281","1810","1381","675","1500","20030725","20030725","Geen verstrekking in Open Data",,"Ja",,,,,,,"4","4","0","0",,"457","0","M1",,,"op bodemplaat by r. voorzitting","1810",,,"e11*98/14*0183*02","K","K02","0","0.06","268","Nee","Nee",,"Nee","3310","0",,"2023","Logisch","00","Ja","2024-08-05T00:00:00.000","2003-07-25T00:00:00.000","2003-07-25T00:00:00.000","2003-07-25T00:00:00.000",,,,,,,,,,,,,,,,,,,,,"C",,,,,,,"https://opendata.rdw.nl/resource/3huj-srit.json","https://opendata.rdw.nl/resource/8ys7-d773.json","https://opendata.rdw.nl/resource/vezc-m2t6.json","https://opendata.rdw.nl/resource/jhie-znh9.json","https://opendata.rdw.nl/resource/kmfi-hrps.json"
"01NVBT","Personenauto","NISSAN","NISSAN PRIMERA","20240830","20230901","4562","sedan","5","ZWART","Niet geregistreerd","4","1597","1262","1790","1362","650","1250","20040226","20040226","Geen verstrekking in Open Data",,"Ja",,,,,,,"4","4","0","0",,"457","0","M1",,,"op bodemplaat by r. voorzitting","1790",,,"e11*98/14*0183*03","A","A02","0","0.06","268","Nee","Nee",,"Nee","3040","0",,"2023","Logisch","00","Ja","2024-08-30T00:00:00.000","2023-09-01T00:00:00.000","2004-02-26T00:00:00.000","2004-02-26T00:00:00.000",,,,,,,,,,,,,,,,,,,,,"C",,,,,,,"https://opendata.rdw.nl/resource/3huj-srit.json","https://opendata.rdw.nl/resource/8ys7-d773.json","https://opendata.rdw.nl/resource/vezc-m2t6.json","https://opendata.rdw.nl/resource/jhie-znh9.json","https://opendata.rdw.nl/resource/kmfi-hrps.json"
"01NXST","Personenauto","NISSAN","NISSAN PRIMERA","20250221","20230211","5750","sedan","5","GRIJS","Niet geregistreerd","4","1998","1315","1910","1415","700","1500","20040329","20040329","Geen verstrekking in Open Data",,"Ja",,,,,,,"4","4","0","0",,"457","0","M1",,,"op bodemplaat by r. voorzitting","1910",,,"e11*98/14*0183*03","C","C03","0","0.07","268","Nee","Nee",,"Nee","3410","0",,"2024","Logisch","00","Ja","2025-02-21T00:00:00.000","2023-02-11T00:00:00.000","2004-03-29T00:00:00.000","2004-03-29T00:00:00.000",,,,,,,,,,,,,,,,,,,,,"D",,,,,,,"https://opendata.rdw.nl/resource/3huj-srit.json","https://opendata.rdw.nl/resource/8ys7-d773.json","https://opendata.rdw.nl/resource/vezc-m2t6.json","https://opendata.rdw.nl/resource/jhie-znh9.json","https://opendata.rdw.nl/resource/kmfi-hrps.json"
"01NZZG","Personenauto","NISSAN","NISSAN PRIMERA","20250305","20240209","5480","hatchback","5","GRIJS","Niet geregistreerd","4","1769","1281","1810","1381","675","1500","20040416","20040416","Geen verstrekking in Open Data",,"Ja",,,,,,,"4","4","0","0",,"457","0","M1",,,"op bodemplaat by r. voorzitting","1810",,,"e11*98/14*0183*03","K","K02","0","0.06","268","Nee","Nee",,"Nee","3310","0",,"2024","Logisch","00","Ja","2025-03-05T00:00:00.000","2024-02-09T00:00:00.000","2004-04-16T00:00:00.000","2004-04-16T00:00:00.000",,,,,,,,,,,,,,,,,,,,,"C",,,,,,,"https://opendata.rdw.nl/resource/3huj-srit.json","https://opendata.rdw.nl/resource/8ys7-d773.json","https://opendata.rdw.nl/resource/vezc-m2t6.json","https://opendata.rdw.nl/resource/jhie-znh9.json","https://opendata.rdw.nl/resource/kmfi-hrps.json"
"01PTLJ","Personenauto","NISSAN","NISSAN PRIMERA","20240907","20191218","5640","sedan","5","GRIJS","Niet geregistreerd","4","1769","1268","1810","1368","675","1500","20041126","20041126","Geen verstrekking in Open Data",,"Ja",,,,,,,"4","4","0","0",,"457","0","M1",,,"op bodemplaat by r. voorzitting","1810",,,"e11*98/14*0183*04","B","B03","1","0.06","268","Nee","Nee",,"Nee","3345","0",,"2023","Logisch","00","Ja","2024-09-07T00:00:00.000","2019-12-18T00:00:00.000","2004-11-26T00:00:00.000","2004-11-26T00:00:00.000",,,,,,,,,,,,,,,,,,,,,"D",,,,,,,"https://opendata.rdw.nl/resource/3huj-srit.json","https://opendata.rdw.nl/resource/8ys7-d773.json","https://opendata.rdw.nl/resource/vezc-m2t6.json","https://opendata.rdw.nl/resource/jhie-znh9.json","https://opendata.rdw.nl/resource/kmfi-hrps.json"
"01PVLF","Personenauto","NISSAN","NISSAN PRIMERA","20250115","20240516","5279","hatchback","5","GRIJS","Niet geregistreerd","4","1769","1281","1810","1381","675","1500","20041223","20041223","Geen verstrekking in Open Data",,"Ja",,,,,,,"4","4","0","0",,"457","0","M1",,,"op bodemplaat by r. voorzitting","1810",,,"e11*98/14*0183*04","K","K02","1","0.06","268","Nee","Nee",,"Nee","3310","0",,"2024","Logisch","00","Ja","2025-01-15T00:00:00.000","2024-05-16T00:00:00.000","2004-12-23T00:00:00.000","2004-12-23T00:00:00.000",,,,,,,,,,,,,,,,,,,,,"C",,,,,,,"https://opendata.rdw.nl/resource/3huj-srit.json","https://opendata.rdw.nl/resource/8ys7-d773.json","https://opendata.rdw.nl/resource/vezc-m2t6.json","https://opendata.rdw.nl/resource/jhie-znh9.json","https://opendata.rdw.nl/resource/kmfi-hrps.json"
"01RFPX","Personenauto","NISSAN","NISSAN PRIMERA","20250109","20230605","8566","stationwagen","5","GRIJS","Niet geregistreerd","4","1998","1355","1940","1455","725","1500","20030925","20050301","Geen verstrekking in Open Data",,"Ja",,,,,,,"4","4","0","0",,"468","0","M1",,,"op dwarsbalk v. r. voorzitting","1940",,,"e11*98/14*0183*01","G","G02","0","0.07","268","Nee","Nee",,"Nee","3460","0",,"2024","Geen oordeel","05","Ja","2025-01-09T00:00:00.000","2023-06-05T00:00:00.000","2003-09-25T00:00:00.000","2005-03-01T00:00:00.000",,,,,,,,,,,,,,,,,,,,,"D",,,,,,,"https://opendata.rdw.nl/resource/3huj-srit.json","https://opendata.rdw.nl/resource/8ys7-d773.json","https://opendata.rdw.nl/resource/vezc-m2t6.json","https://opendata.rdw.nl/resource/jhie-znh9.json","https://opendata.rdw.nl/resource/kmfi-hrps.json"
"01RHBG","Personenauto","NISSAN","NISSAN PRIMERA","20241205","20221206","6233","stationwagen","5","GRIJS","Niet geregistreerd","4","1769","1318","1880","1418","700","1500","20050329","20050329","Geen verstrekking in Open Data",,"Ja",,,,,,,"4","4","0","0",,"468","0","M1",,,"op bodemplaat by r. voorzitting","1880",,,"e11*98/14*0183*04","F","F02","1","0.06","268","Nee","Nee",,"Nee","3380","0",,"2023","Logisch","00","Ja","2024-12-05T00:00:00.000","2022-12-06T00:00:00.000","2005-03-29T00:00:00.000","2005-03-29T00:00:00.000",,,,,,,,,,,,,,,,,,,,,"C",,,,,,,"https://opendata.rdw.nl/resource/3huj-srit.json","https://opendata.rdw.nl/resource/8ys7-d773.json","https://opendata.rdw.nl/resource/vezc-m2t6.json","https://opendata.rdw.nl/resource/jhie-znh9.json","https://opendata.rdw.nl/resource/kmfi-hrps.json"
"01RNPG","Personenauto","NISSAN","NISSAN PRIMERA","20250409","20180412","5663","hatchback","5","GRIJS","Niet geregistreerd","4","1769","1281","1810","1381","675","1500","20050620","20050620","Geen verstrekking in Open Data",,"Ja",,,,,,,"4","4","0","0",,"457","0","M1",,,"op bodemplaat by r. voorzitting","1810",,,"e11*98/14*0183*04","K","K02","1","0.06","268","Nee","Nee",,"Nee","3310","0",,"2024","Logisch","00","Ja","2025-04-09T00:00:00.000","2018-04-12T00:00:00.000","2005-06-20T00:00:00.000","2005-06-20T00:00:00.000",,"0",,,,,,,,,,,,,,,,,,,"C",,,,,,,"https://opendata.rdw.nl/resource/3huj-srit.json","https://opendata.rdw.nl/resource/8ys7-d773.json","https://opendata.rdw.nl/resource/vezc-m2t6.json","https://opendata.rdw.nl/resource/jhie-znh9.json","https://opendata.rdw.nl/resource/kmfi-hrps.json"
"01RTDX","Personenauto","NISSAN","NISSAN PRIMERA","20250518","20100518","5085","sedan","5","BRUIN","Niet geregistreerd","4","1597","1262","1790","1362","650","1250","20050824","20050824","Geen verstrekking in Open Data",,"Ja",,,,,,,"4","4","0","0",,"457","0","M1",,,"op bodemplaat by r. voorzitting","1790",,,"e11*98/14*0183*04","A","A02","1","0.06","268","Nee","Nee",,"Nee","3040","0",,"2024","Logisch","00","Ja","2025-05-18T00:00:00.000","2010-05-18T00:00:00.000","2005-08-24T00:00:00.000","2005-08-24T00:00:00.000",,,,,,,,,,,,,,,,,,,,,"C",,,,,,,"https://opendata.rdw.nl/resource/3huj-srit.json","https://opendata.rdw.nl/resource/8ys7-d773.json","https://opendata.rdw.nl/resource/vezc-m2t6.json","https://opendata.rdw.nl/resource/jhie-znh9.json","https://opendata.rdw.nl/resource/kmfi-hrps.json"
"01SPBV","Personenauto","NISSAN","NISSAN PRIMERA","20250103","20230106","5911","stationwagen","5","BRUIN","Niet geregistreerd","4","1769","1318","1880","1418","700","1500","20060324","20060324","Geen verstrekking in Open Data",,"Ja",,,,,,,"4","4","0","0",,"468","0","M1",,,"op bodemplaat by r. voorzitting","1880",,,"e11*98/14*0183*04","F","F02","1","0.06","268","Nee","Nee",,"Nee","3380","0",,"2023","Logisch","00","Ja","2025-01-03T00:00:00.000","2023-01-06T00:00:00.000","2006-03-24T00:00:00.000","2006-03-24T00:00:00.000",,,,,,,,,,,,,,,,,,,,,"C",,,,,,,"https://opendata.rdw.nl/resource/3huj-srit.json","https://opendata.rdw.nl/resource/8ys7-d773.json","https://opendata.rdw.nl/resource/vezc-m2t6.json","https://opendata.rdw.nl/resource/jhie-znh9.json","https://opendata.rdw.nl/resource/kmfi-hrps.json"
"01SZZB","Personenauto","NISSAN","NISSAN PRIMERA","20250629","20060629","6200","hatchback","5","GRIJS","Niet geregistreerd","4","1998","1314","1910","1414","700","1500","20060629","20060629","Geen verstrekking in Open Data",,"Ja",,,,,,,"4","4","0","0",,"457","0","M1",,,"op bodemplaat by r. voorzitting","1910",,,"e11*98/14*0183*05","L","L01","0","0.07","268","Nee","Nee",,"Nee","3410","0",,"2024","Logisch","00","Ja","2025-06-29T00:00:00.000","2006-06-29T00:00:00.000","2006-06-29T00:00:00.000","2006-06-29T00:00:00.000",,,,,,,,,,,,,,,,,,,,,"E",,,,,,,"https://opendata.rdw.nl/resource/3huj-srit.json","https://opendata.rdw.nl/resource/8ys7-d773.json","https://opendata.rdw.nl/resource/vezc-m2t6.json","https://opendata.rdw.nl/resource/jhie-znh9.json","https://opendata.rdw.nl/resource/kmfi-hrps.json"
"01TBHJ","Personenauto","NISSAN","NISSAN PRIMERA","20250104","20240502","7631","sedan","5","GRIJS","Niet geregistreerd","4","1998","1315","1910","1415","700","1500","20060801","20060801","Geen verstrekking in Open Data",,"Ja",,,,,,,"4","4","0","0",,"457","0","M1",,,"op bodemplaat by r. voorzitting","1910",,,"e11*98/14*0183*05","C","C02","0","0.07","268","Nee","Nee",,"Nee","3410","0",,"2023","Logisch","00","Ja","2025-01-04T00:00:00.000","2024-05-02T00:00:00.000","2006-08-01T00:00:00.000","2006-08-01T00:00:00.000",,,,,,,,,,,,,,,,,,,,,"E",,,,,,,"https://opendata.rdw.nl/resource/3huj-srit.json","https://opendata.rdw.nl/resource/8ys7-d773.json","https://opendata.rdw.nl/resource/vezc-m2t6.json","https://opendata.rdw.nl/resource/jhie-znh9.json","https://opendata.rdw.nl/resource/kmfi-hrps.json"
"01TFPF","Personenauto","NISSAN","NISSAN PRIMERA","20250430","20230428","5911","stationwagen","5","GRIJS","Niet geregistreerd","4","1769","1318","1880","1418","700","1500","20060808","20060808","Geen verstrekking in Open Data",,"Ja",,,,,,,"4","4","0","0",,"468","0","M1",,,"op bodemplaat by r. voorzitting","1880",,,"e11*98/14*0183*05","F","F02","0","0.06","268","Nee","Nee",,"Nee","3380","0",,"2024","Logisch","00","Ja","2025-04-30T00:00:00.000","2023-04-28T00:00:00.000","2006-08-08T00:00:00.000","2006-08-08T00:00:00.000",,,,,,,,,,,,,,,,,,,,,"C",,,,,,,"https://opendata.rdw.nl/resource/3huj-srit.json","https://opendata.rdw.nl/resource/8ys7-d773.json","https://opendata.rdw.nl/resource/vezc-m2t6.json","https://opendata.rdw.nl/resource/jhie-znh9.json","https://opendata.rdw.nl/resource/kmfi-hrps.json"
"01TPGH","Personenauto","NISSAN","NISSAN PRIMERA","20241031","20240117","5911","stationwagen","5","ZWART","Niet geregistreerd","4","1769","1318","1880","1418","700","1500","20061219","20061219","Geen verstrekking in Open Data",,"Ja",,,,,,,"4","4","0","0",,"468","0","M1",,,"op bodemplaat by r. voorzitting","1880",,,"e11*98/14*0183*05","F","F02","0","0.06","268","Nee","Nee",,"Nee","3380","0",,"2024","Logisch","00","Ja","2024-10-31T00:00:00.000","2024-01-17T00:00:00.000","2006-12-19T00:00:00.000","2006-12-19T00:00:00.000",,,,,,,,,,,,,,,,,,,,,"C",,,,,,,"https://opendata.rdw.nl/resource/3huj-srit.json","https://opendata.rdw.nl/resource/8ys7-d773.json","https://opendata.rdw.nl/resource/vezc-m2t6.json","https://opendata.rdw.nl/resource/jhie-znh9.json","https://opendata.rdw.nl/resource/kmfi-hrps.json"
"01XHFZ","Personenauto","NISSAN","NISSAN PRIMERA","20250613","20180529","6689","stationwagen","5","GRIJS","Niet geregistreerd","4","1998","1355","1940","1455","725","1500","20070531","20070531","Geen verstrekking in Open Data",,"Ja",,,,,,,"4","4","0","0",,"468","0","M1",,,"op bodemplaat by r. voorzitting","1940",,,"e11*98/14*0183*06","G","G03","0","0.07","268","Nee","Nee",,"Nee","3440","0",,"2024","Logisch","00","Ja","2025-06-13T00:00:00.000","2018-05-29T00:00:00.000","2007-05-31T00:00:00.000","2007-05-31T00:00:00.000",,,,,,,,,,,,,,,,,,,,,"E",,,,,,,"https://opendata.rdw.nl/resource/3huj-srit.json","https://opendata.rdw.nl/resource/8ys7-d773.json","https://opendata.rdw.nl/resource/vezc-m2t6.json","https://opendata.rdw.nl/resource/jhie-znh9.json","https://opendata.rdw.nl/resource/kmfi-hrps.json"
"02DNGN","Personenauto","NISSAN","NISSAN PRIMERA","20250425","20170420","4045","stationwagen","5","GRIJS","Niet geregistreerd","4","1597","1245","1750","1345","550","1075","20000331","20000331","Geen verstrekking in Open Data",,"Ja",,,,,,,"4","4","0","0",,"452","0","M1",,,"r. tegen schutbord onder motorkap","1750",,,"e11*93/81*0060*03","G","G20","1","0.05","260","Nee","Nee",,"Nee","2825","0",,"2024","Logisch","00","Ja","2025-04-25T00:00:00.000","2017-04-20T00:00:00.000","2000-03-31T00:00:00.000","2000-03-31T00:00:00.000",,,,,,,,,,,,,,,,,,,,,,,,,,,,"https://opendata.rdw.nl/resource/3huj-srit.json","https://opendata.rdw.nl/resource/8ys7-d773.json","https://opendata.rdw.nl/resource/vezc-m2t6.json","https://opendata.rdw.nl/resource/jhie-znh9.json","https://opendata.rdw.nl/resource/kmfi-hrps.json"
"02DZNP","Personenauto","NISSAN","NISSAN PRIMERA","20241018","20000120","5268","hatchback","5","ROOD","Niet geregistreerd","4","1998","1260","1770","1360","550","1325","20000120","20000120","Geen verstrekking in Open Data",,"Nee",,,,,,,"4","4","0","0",,"452","0","M1",,,"r. tegen schutbord onder motorkap","1770",,,"e11*93/81*0060*04","G","G01","1","0.08","260","Nee","Nee",,"Nee","3095","0",,"2023","Logisch","00","Ja","2024-10-18T00:00:00.000","2000-01-20T00:00:00.000","2000-01-20T00:00:00.000","2000-01-20T00:00:00.000",,,,,,,,,,,,,,,,,,,,,,,,,,,,"https://opendata.rdw.nl/resource/3huj-srit.json","https://opendata.rdw.nl/resource/8ys7-d773.json","https://opendata.rdw.nl/resource/vezc-m2t6.json","https://opendata.rdw.nl/resource/jhie-znh9.json","https://opendata.rdw.nl/resource/kmfi-hrps.json"
"02FLSZ","Personenauto","NISSAN","NISSAN PRIMERA","20241212","20200707","4492","sedan","5","GROEN","Niet geregistreerd","4","1769","1210","1725","1310","550","1300","20000428","20000428","Geen verstrekking in Open Data",,"Ja",,,,,,,"4","4","0","0",,"452","0","M1",,,"r. tegen schutbord onder motorkap","1725",,,"e11*93/81*0060*04","B","B02","1","0.06","260","Nee","Nee",,"Nee","3025","0",,"2023","Logisch","00","Ja","2024-12-12T00:00:00.000","2020-07-07T00:00:00.000","2000-04-28T00:00:00.000","2000-04-28T00:00:00.000",,,,,,,,,,,,,,,,,,,,,,,,,,,,"https://opendata.rdw.nl/resource/3huj-srit.json","https://opendata.rdw.nl/resource/8ys7-d773.json","https://opendata.rdw.nl/resource/vezc-m2t6.json","https://opendata.rdw.nl/resource/jhie-znh9.json","https://opendata.rdw.nl/resource/kmfi-hrps.json"