"kenteken","voertuigsoort","merk","handelsbenaming","vervaldatum_apk","datum_tenaamstelling","bruto_bpm","inrichting","aantal_zitplaatsen","eerste_kleur","tweede_kleur","aantal_cilinders","cilinderinhoud","massa_ledig_voertuig","toegestane_maximum_massa_voertuig","massa_rijklaar","maximum_massa_trekken_ongeremd","maximum_trekken_massa_geremd","datum_eerste_toelating","datum_eerste_tenaamstelling_in_nederland","wacht_op_keuren","catalogusprijs","wam_verzekerd","maximale_constructiesnelheid","laadvermogen","oplegger_geremd","aanhangwagen_autonoom_geremd","aanhangwagen_middenas_geremd","aantal_staanplaatsen","aantal_deuren","aantal_wielen","afstand_hart_koppeling_tot_achterzijde_voertuig","afstand_voorzijde_voertuig_tot_hart_koppeling","afwijkende_maximum_snelheid","lengte","breedte","europese_voertuigcategorie","europese_voertuigcategorie_toevoeging","europese_uitvoeringcategorie_toevoeging","plaats_chassisnummer","technische_max_massa_voertuig","type","type_gasinstallatie","typegoedkeuringsnummer","variant","uitvoering","volgnummer_wijziging_eu_typegoedkeuring","vermogen_massarijklaar","wielbasis","export_indicator","openstaande_terugroepactie_indicator","vervaldatum_tachograaf","taxi_indicator","maximum_massa_samenstelling","aantal_rolstoelplaatsen","maximum_ondersteunende_snelheid","jaar_laatste_registratie_tellerstand","tellerstandoordeel","code_toelichting_tellerstandoordeel","tenaamstellen_mogelijk","vervaldatum_apk_dt","datum_tenaamstelling_dt","datum_eerste_toelating_dt","datum_eerste_tenaamstelling_in_nederland_dt","vervaldatum_tachograaf_dt","maximum_last_onder_de_vooras_sen_tezamen_koppeling","type_remsysteem_voertuig_code","rupsonderstelconfiguratiecode","wielbasis_voertuig_minimum","wielbasis_voertuig_maximum","lengte_voertuig_minimum","lengte_voertuig_maximum","breedte_voertuig_minimum","breedte_voertuig_maximum","hoogte_voertuig","hoogte_voertuig_minimum","hoogte_voertuig_maximum","massa_bedrijfsklaar_minimaal","massa_bedrijfsklaar_maximaal","technisch_toelaatbaar_massa_koppelpunt","maximum_massa_technisch_maximaal","maximum_massa_technisch_minimaal","subcategorie_nederland","verticale_belasting_koppelpunt_getrokken_voertuig","zuinigheidsclassificatie","registratie_datum_goedkeuring_afschrijvingsmoment_bpm","registratie_datum_goedkeuring_afschrijvingsmoment_bpm_dt","gem_lading_wrde","aerodyn_voorz","massa_alt_aandr","verl_cab_ind","api_gekentekende_voertuigen_assen","api_gekentekende_voertuigen_brandstof","api_gekentekende_voertuigen_carrosserie","api_gekentekende_voertuigen_carrosserie_specifiek","api_gekentekende_voertuigen_voertuigklasse"
"1XRJ37","Personenauto","MERCEDES-BENZ","SPRINTER","20241020","20141020","16539","voor rolstoelen toegankelijk voertuig","9","WIT","Niet geregistreerd","4","1796","2561","3500","2661","750","2000","20141020","20141020","Geen verstrekking in Open Data","64961","Ja",,,,,,,"0","4","0","0",,"0","0","M1",,,"schutbord motorruimte","3500","906AC35G",,"e1*2007/46*0569*02","KMH71350E","MCE27VA9","0","0.04","367","Nee","Ja",,"Ja","5500","0","0.00","2023","Logisch","00","Ja","2024-10-20T00:00:00.000","2014-10-20T00:00:00.000","2014-10-20T00:00:00.000","2014-10-20T00:00:00.000",,"0",,,,,,,,,,,,,,,,,,,"B",,,,,,,"https://opendata.rdw.nl/resource/3huj-srit.json","https://opendata.rdw.nl/resource/8ys7-d773.json","https://opendata.rdw.nl/resource/vezc-m2t6.json","https://opendata.rdw.nl/resource/jhie-znh9.json","https://opendata.rdw.nl/resource/kmfi-hrps.json"
"1XRJ38","Personenauto","MERCEDES-BENZ","SPRINTER","20231027","20240122","16539","voor rolstoelen toegankelijk voertuig","9","WIT","Niet geregistreerd","4","1796","2561","3500","2661","750","2000","20141020","20141020","Geen verstrekking in Open Data","64961","Ja",,,,,,,"0","4","0","0",,"0","0","M1",,,"schutbord motorruimte","3500","906AC35G",,"e1*2007/46*0569*02","KMH71350E","MCE27VA9","0","0.04","367","Nee","Ja",,"Nee","5500","0","0.00","2024","Logisch","00","Ja","2023-10-27T00:00:00.000","2024-01-22T00:00:00.000","2014-10-20T00:00:00.000","2014-10-20T00:00:00.000",,,,,,,,,,,,,,,,,,,,,"B",,,,,,,"https://opendata.rdw.nl/resource/3huj-srit.json","https://opendata.rdw.nl/resource/8ys7-d773.json","https://opendata.rdw.nl/resource/vezc-m2t6.json","https://opendata.rdw.nl/resource/jhie-znh9.json","https://opendata.rdw.nl/resource/kmfi-hrps.json"
"1XRJ39","Personenauto","MERCEDES-BENZ","SPRINTER","20241022","20141020","16539","voor rolstoelen toegankelijk voertuig","9","WIT","Niet geregistreerd","4","1796","2561","3500","2661","750","2000","20141020","20141020","Geen verstrekking in Open Data","64961","Ja",,,,,,,"0","4","0","0",,"0","0","M1",,,"schutbord motorruimte","3500","906AC35G",,"e1*2007/46*0569*02","KMH71350E","MCE27VA9","0","0.04","367","Nee","Ja",,"Ja","5500","0","0.00","2023","Logisch","00","Ja","2024-10-22T00:00:00.000","2014-10-20T00:00:00.000","2014-10-20T00:00:00.000","2014-10-20T00:00:00.000",,"0",,,,,,,,,,,,,,,,,,,"B",,,,,,,"https://opendata.rdw.nl/resource/3huj-srit.json","https://opendata.rdw.nl/resource/8ys7-d773.json","https://opendata.rdw.nl/resource/vezc-m2t6.json","https://opendata.rdw.nl/resource/jhie-znh9.json","https://opendata.rdw.nl/resource/kmfi-hrps.json"
"3TNS16","Personenauto","MERCEDES-BENZ","SPRINTER","20241216","20201222","16539","voor rolstoelen toegankelijk voertuig","9","GRIJS","Niet geregistreerd","4","1796","2761","3500","2861","750","2000","20140422","20140422","Geen verstrekking in Open Data","64877","Ja",,,,,,,"3","4","0","0",,"0","0","M1",,,"schutbord motorruimte","3500","906AC35G",,"e1*2007/46*0569*01","KMG71350E","MCE27VA9","0","0.04","367","Nee","Ja",,"Nee","5500","4","0.00","2023","Logisch","00","Ja","2024-12-16T00:00:00.000","2020-12-22T00:00:00.000","2014-04-22T00:00:00.000","2014-04-22T00:00:00.000",,,,,,,,,,,,,,,,,,,,,"B",,,,,,,"https://opendata.rdw.nl/resource/3huj-srit.json","https://opendata.rdw.nl/resource/8ys7-d773.json","https://opendata.rdw.nl/resource/vezc-m2t6.json","https://opendata.rdw.nl/resource/jhie-znh9.json","https://opendata.rdw.nl/resource/kmfi-hrps.json"
"9TRG72","Personenauto","MERCEDES-BENZ","SPRINTER","20240810","20240503","16539","voor rolstoelen toegankelijk voertuig","9","GRIJS","Niet geregistreerd","4","1796","2761","3500","2861","750","2000","20140422","20140422","Geen verstrekking in Open Data","64877","Ja",,,,,,,"3","4","0","0",,"0","0","M1",,,"schutbord motorruimte","3500","906AC35G",,"e1*2007/46*0569*01","KMG71350E","MCE27VA9","0","0.04","367","Nee","Ja",,"Ja","5500","0","0.00","2024","Logisch","00","Ja","2024-08-10T00:00:00.000","2024-05-03T00:00:00.000","2014-04-22T00:00:00.000","2014-04-22T00:00:00.000",,,,,,,,,,,,,,,,,,,,,"B",,,,,,,"https://opendata.rdw.nl/resource/3huj-srit.json","https://opendata.rdw.nl/resource/8ys7-d773.json","https://opendata.rdw.nl/resource/vezc-m2t6.json","https://opendata.rdw.nl/resource/jhie-znh9.json","https://opendata.rdw.nl/resource/kmfi-hrps.json"
"PL583F","Personenauto","MERCEDES-BENZ","SPRINTER","20250719","20170719","30565","voor rolstoelen toegankelijk voertuig","9","WIT","Niet geregistreerd","4","1796","2797","3500","2897","750","2000","20170719","20170719","Geen verstrekking in Open Data","81231","Ja",,,,,,,"3","4",,,,,,"M1",,,"schutbord motorruimte","3500","906AC35G",,,,,,"0.04","367","Nee","Ja",,"Ja","5500","2",,"2024","Logisch","00","Ja","2025-07-19T00:00:00.000","2017-07-19T00:00:00.000","2017-07-19T00:00:00.000","2017-07-19T00:00:00.000",,,,,,,,,,,,,,,,,,,,,,,,,,,,"https://opendata.rdw.nl/resource/3huj-srit.json","https://opendata.rdw.nl/resource/8ys7-d773.json","https://opendata.rdw.nl/resource/vezc-m2t6.json","https://opendata.rdw.nl/resource/jhie-znh9.json","https://opendata.rdw.nl/resource/kmfi-hrps.json"
"GK622G","Personenauto","MERCEDES-BENZ","SPRINTER","20250303","20150618","22955","voor rolstoelen toegankelijk voertuig","9","WIT","Niet geregistreerd","4","1796","2711","3500","2811","750","2000","20150618","20150618","Geen verstrekking in Open Data","72016","Ja",,,,,,,"0","4","0","0",,"0","0","M1",,,"schutbord motorruimte","3500","906AC35G","Af-fabriek gasinstallatie","e1*2007/46*0569*02","KMH71350E","MCE27VA9","0","0.04","367","Nee","Ja",,"Ja","5500","0","0.00","2024","Logisch","00","Ja","2025-03-03T00:00:00.000","2015-06-18T00:00:00.000","2015-06-18T00:00:00.000","2015-06-18T00:00:00.000",,,,,,,,,,,,,,,,,,,,,"B",,,,,,,"https://opendata.rdw.nl/resource/3huj-srit.json","https://opendata.rdw.nl/resource/8ys7-d773.json","https://opendata.rdw.nl/resource/vezc-m2t6.json","https://opendata.rdw.nl/resource/jhie-znh9.json","https://opendata.rdw.nl/resource/kmfi-hrps.json"
"GK623G","Personenauto","MERCEDES-BENZ","SPRINTER","20250330","20150618","22955","voor rolstoelen toegankelijk voertuig","9","WIT","Niet geregistreerd","4","1796","2711","3500","2811","750","2000","20150618","20150618","Geen verstrekking in Open Data","72016","Ja",,,,,,,"0","4","0","0",,"0","0","M1",,,"schutbord motorruimte","3500","906AC35G","Af-fabriek gasinstallatie","e1*2007/46*0569*02","KMH71350E","MCE27VA9","0","0.04","367","Nee","Nee",,"Ja","5500","0","0.00","2024","Logisch","00","Ja","2025-03-30T00:00:00.000","2015-06-18T00:00:00.000","2015-06-18T00:00:00.000","2015-06-18T00:00:00.000",,,,,,,,,,,,,,,,,,,,,"B",,,,,,,"https://opendata.rdw.nl/resource/3huj-srit.json","https://opendata.rdw.nl/resource/8ys7-d773.json","https://opendata.rdw.nl/resource/vezc-m2t6.json","https://opendata.rdw.nl/resource/jhie-znh9.json","https://opendata.rdw.nl/resource/kmfi-hrps.json"
"GK626G","Personenauto","MERCEDES-BENZ","SPRINTER","20220618","20221107","22955","voor rolstoelen toegankelijk voertuig","9","WIT","Niet geregistreerd","4","1796","2711","3500","2811","750","2000","20150618","20150618","Geen verstrekking in Open Data","72016","Ja",,,,,,,"0","4","0","0",,"0","0","M1",,,"schutbord motorruimte","3500","906AC35G","Af-fabriek gasinstallatie","e1*2007/46*0569*02","KMH71350E","MCE27VA9","0","0.04","367","Nee","Ja",,"Ja","5500","0","0.00","2022","Logisch","00","Ja","2022-06-18T00:00:00.000","2022-11-07T00:00:00.000","2015-06-18T00:00:00.000","2015-06-18T00:00:00.000",,,,,,,,,,,,,,,,,,,,,"B",,,,,,,"https://opendata.rdw.nl/resource/3huj-srit.json","https://opendata.rdw.nl/resource/8ys7-d773.json","https://opendata.rdw.nl/resource/vezc-m2t6.json","https://opendata.rdw.nl/resource/jhie-znh9.json","https://opendata.rdw.nl/resource/kmfi-hrps.json"
"GK627G","Personenauto","MERCEDES-BENZ","SPRINTER","20250410","20150618","22955","voor rolstoelen toegankelijk voertuig","9","WIT","Niet geregistreerd","4","1796","2711","3500","2811","750","2000","20150618","20150618","Geen verstrekking in Open Data","72016","Ja",,,,,,,"0","4","0","0",,"0","0","M1",,,"schutbord motorruimte","3500","906AC35G","Af-fabriek gasinstallatie","e1*2007/46*0569*02","KMH71350E","MCE27VA9","0","0.04","367","Nee","Nee",,"Ja","5500","0","0.00","2024","Logisch","00","Ja","2025-04-10T00:00:00.000","2015-06-18T00:00:00.000","2015-06-18T00:00:00.000","2015-06-18T00:00:00.000",,,,,,,,,,,,,,,,,,,,,"B",,,,,,,"https://opendata.rdw.nl/resource/3huj-srit.json","https://opendata.rdw.nl/resource/8ys7-d773.json","https://opendata.rdw.nl/resource/vezc-m2t6.json","https://opendata.rdw.nl/resource/jhie-znh9.json","https://opendata.rdw.nl/resource/kmfi-hrps.json"
"GK628G","Personenauto","MERCEDES-BENZ","SPRINTER","20240619","20150618","22955","voor rolstoelen toegankelijk voertuig","9","WIT","Niet geregistreerd","4","1796","2711","3500","2811","750","2000","20150618","20150618","Geen verstrekking in Open Data","72016","Ja",,,,,,,"0","4","0","0",,"0","0","M1",,,"schutbord motorruimte","3500","906AC35G","Af-fabriek gasinstallatie","e1*2007/46*0569*02","KMH71350E","MCE27VA9","0","0.04","367","Nee","Ja",,"Ja","5500","0","0.00","2023","Logisch","00","Ja","2024-06-19T00:00:00.000","2015-06-18T00:00:00.000","2015-06-18T00:00:00.000","2015-06-18T00:00:00.000",,,,,,,,,,,,,,,,,,,,,"B",,,,,,,"https://opendata.rdw.nl/resource/3huj-srit.json","https://opendata.rdw.nl/resource/8ys7-d773.json","https://opendata.rdw.nl/resource/vezc-m2t6.json","https://opendata.rdw.nl/resource/jhie-znh9.json","https://opendata.rdw.nl/resource/kmfi-hrps.json"
"GK629G","Personenauto","MERCEDES-BENZ","SPRINTER","20250415","20150618","22955","voor rolstoelen toegankelijk voertuig","9","WIT","Niet geregistreerd","4","1796","2711","3500","2811","750","2000","20150618","20150618","Geen verstrekking in Open Data","72016","Ja",,,,,,,"0","4","0","0",,"0","0","M1",,,"schutbord motorruimte","3500","906AC35G","Af-fabriek gasinstallatie","e1*2007/46*0569*02","KMH71350E","MCE27VA9","0","0.04","367","Nee","Ja",,"Ja","5500","0","0.00","2024","Logisch","00","Ja","2025-04-15T00:00:00.000","2015-06-18T00:00:00.000","2015-06-18T00:00:00.000","2015-06-18T00:00:00.000",,,,,,,,,,,,,,,,,,,,,"B",,,,,,,"https://opendata.rdw.nl/resource/3huj-srit.json","https://opendata.rdw.nl/resource/8ys7-d773.json","https://opendata.rdw.nl/resource/vezc-m2t6.json","https://opendata.rdw.nl/resource/jhie-znh9.json","https://opendata.rdw.nl/resource/kmfi-hrps.json"
"GK630G","Personenauto","MERCEDES-BENZ","SPRINTER","20250618","20150618","22955","voor rolstoelen toegankelijk voertuig","9","WIT","Niet geregistreerd","4","1796","2711","3500","2811","750","2000","20150618","20150618","Geen verstrekking in Open Data","72016","Ja",,,,,,,"0","4","0","0",,"0","0","M1",,,"schutbord motorruimte","3500","906AC35G","Af-fabriek gasinstallatie","e1*2007/46*0569*02","KMH71350E","MCE27VA9","0","0.04","367","Nee","Nee",,"Ja","5500","0","0.00","2024","Logisch","00","Ja","2025-06-18T00:00:00.000","2015-06-18T00:00:00.000","2015-06-18T00:00:00.000","2015-06-18T00:00:00.000",,,,,,,,,,,,,,,,,,,,,"B",,,,,,,"https://opendata.rdw.nl/resource/3huj-srit.json","https://opendata.rdw.nl/resource/8ys7-d773.json","https://opendata.rdw.nl/resource/vezc-m2t6.json","https://opendata.rdw.nl/resource/jhie-znh9.json","https://opendata.rdw.nl/resource/kmfi-hrps.json"
"GK631G","Personenauto","MERCEDES-BENZ","SPRINTER","20250430","20150618","22955","voor rolstoelen toegankelijk voertuig","9","WIT","Niet geregistreerd","4","1796","2711","3500","2811","750","2000","20150618","20150618","Geen verstrekking in Open Data","72016","Ja",,,,,,,"0","4","0","0",,"0","0","M1",,,"schutbord motorruimte","3500","906AC35G","Af-fabriek gasinstallatie","e1*2007/46*0569*02","KMH71350E","MCE27VA9","0","0.04","367","Nee","Ja",,"Ja","5500","0","0.00","2024","Logisch","00","Ja","2025-04-30T00:00:00.000","2015-06-18T00:00:00.000","2015-06-18T00:00:00.000","2015-06-18T00:00:00.000",,,,,,,,,,,,,,,,,,,,,"B",,,,,,,"https://opendata.rdw.nl/resource/3huj-srit.json","https://opendata.rdw.nl/resource/8ys7-d773.json","https://opendata.rdw.nl/resource/vezc-m2t6.json","https://opendata.rdw.nl/resource/jhie-znh9.json","https://opendata.rdw.nl/resource/kmfi-hrps.json"
"GK632G","Personenauto","MERCEDES-BENZ","SPRINTER","20240704","20240318","22955","voor rolstoelen toegankelijk voertuig","9","WIT","Niet geregistreerd","4","1796","2711","3500","2811","750","2000","20150618","20150618","Geen verstrekking in Open Data","72016","Ja",,,,,,,"0","4","0","0",,"0","0","M1",,,"schutbord motorruimte","3500","906AC35G","Af-fabriek gasinstallatie","e1*2007/46*0569*02","KMH71350E","MCE27VA9","0","0.04","367","Nee","Nee",,"Nee","5500","0","0.00","2023","Logisch","00","Ja","2024-07-04T00:00:00.000","2024-03-18T00:00:00.000","2015-06-18T00:00:00.000","2015-06-18T00:00:00.000",,,,,,,,,,,,,,,,,,,,,"B",,,,,,,"https://opendata.rdw.nl/resource/3huj-srit.json","https://opendata.rdw.nl/resource/8ys7-d773.json","https://opendata.rdw.nl/resource/vezc-m2t6.json","https://opendata.rdw.nl/resource/jhie-znh9.json","https://opendata.rdw.nl/resource/kmfi-hrps.json"
"GK633G","Personenauto","MERCEDES-BENZ","SPRINTER","20250412","20150618","22955","voor rolstoelen toegankelijk voertuig","9","WIT","Niet geregistreerd","4","1796","2711","3500","2811","750","2000","20150618","20150618","Geen verstrekking in Open Data","72016","Ja",,,,,,,"0","4","0","0",,"0","0","M1",,,"schutbord motorruimte","3500","906AC35G","Af-fabriek gasinstallatie","e1*2007/46*0569*02","KMH71350E","MCE27VA9","0","0.04","367","Nee","Nee",,"Ja","5500","0","0.00","2024","Logisch","00","Ja","2025-04-12T00:00:00.000","2015-06-18T00:00:00.000","2015-06-18T00:00:00.000","2015-06-18T00:00:00.000",,,,,,,,,,,,,,,,,,,,,"B",,,,,,,"https://opendata.rdw.nl/resource/3huj-srit.json","https://opendata.rdw.nl/resource/8ys7-d773.json","https://opendata.rdw.nl/resource/vezc-m2t6.json","https://opendata.rdw.nl/resource/jhie-znh9.json","https://opendata.rdw.nl/resource/kmfi-hrps.json"
"GK635G","Personenauto","MERCEDES-BENZ","SPRINTER","20250620","20150618","22955","voor rolstoelen toegankelijk voertuig","9","WIT","Niet geregistreerd","4","1796","2711","3500","2811","750","2000","20150618","20150618","Geen verstrekking in Open Data","72016","Ja",,,,,,,"0","4","0","0",,"0","0","M1",,,"schutbord motorruimte","3500","906AC35G","Af-fabriek gasinstallatie","e1*2007/46*0569*02","KMH71350E","MCE27VA9","0","0.04","367","Nee","Ja",,"Ja","5500","0","0.00","2024","Logisch","00","Ja","2025-06-20T00:00:00.000","2015-06-18T00:00:00.000","2015-06-18T00:00:00.000","2015-06-18T00:00:00.000",,,,,,,,,,,,,,,,,,,,,"B",,,,,,,"https://opendata.rdw.nl/resource/3huj-srit.json","https://opendata.rdw.nl/resource/8ys7-d773.json","https://opendata.rdw.nl/resource/vezc-m2t6.json","https://opendata.rdw.nl/resource/jhie-znh9.json","https://opendata.rdw.nl/resource/kmfi-hrps.json"
"GK636G","Personenauto","MERCEDES-BENZ","SPRINTER","20250413","20150618","22955","voor rolstoelen toegankelijk voertuig","9","WIT","Niet geregistreerd","4","1796","2711","3500","2811","750","2000","20150618","20150618","Geen verstrekking in Open Data","72016","Ja",,,,,,,"0","4","0","0",,"0","0","M1",,,"schutbord motorruimte","3500","906AC35G","Af-fabriek gasinstallatie","e1*2007/46*0569*02","KMH71350E","MCE27VA9","0","0.04","367","Nee","Nee",,"Ja","5500","0","0.00","2024","Logisch","00","Ja","2025-04-13T00:00:00.000","2015-06-18T00:00:00.000","2015-06-18T00:00:00.000","2015-06-18T00:00:00.000",,,,,,,,,,,,,,,,,,,,,"B",,,,,,,"https://opendata.rdw.nl/resource/3huj-srit.json","https://opendata.rdw.nl/resource/8ys7-d773.json","https://opendata.rdw.nl/resource/vezc-m2t6.json","https://opendata.rdw.nl/resource/jhie-znh9.json","https://opendata.rdw.nl/resource/kmfi-hrps.json"
"GK637G","Personenauto","MERCEDES-BENZ","SPRINTER","20240618","20150618","22955","voor rolstoelen toegankelijk voertuig","9","WIT","Niet geregistreerd","4","1796","2711","3500","2811","750","2000","20150618","20150618","Geen verstrekking in Open Data","72016","Ja",,,,,,,"0","4","0","0",,"0","0","M1",,,"schutbord motorruimte","3500","906AC35G","Af-fabriek gasinstallatie","e1*2007/46*0569*02","KMH71350E","MCE27VA9","0","0.04","367","Nee","Nee",,"Ja","5500","0","0.00","2023","Logisch","00","Ja","2024-06-18T00:00:00.000","2015-06-18T00:00:00.000","2015-06-18T00:00:00.000","2015-06-18T00:00:00.000",,,,,,,,,,,,,,,,,,,,,"B",,,,,,,"https://opendata.rdw.nl/resource/3huj-srit.json","https://opendata.rdw.nl/resource/8ys7-d773.json","https://opendata.rdw.nl/resource/vezc-m2t6.json","https://opendata.rdw.nl/resource/jhie-znh9.json","https://opendata.rdw.nl/resource/kmfi-hrps.json"
"GK638G","Personenauto","MERCEDES-BENZ","SPRINTER","20250410","20150618","22955","voor rolstoelen toegankelijk voertuig","9","WIT","Niet geregistreerd","4","1796","2711","3500","2811","750","2000","20150618","20150618","Geen verstrekking in Open Data","72016","Ja",,,,,,,"0","4","0","0",,"0","0","M1",,,"schutbord motorruimte","3500","906AC35G","Af-fabriek gasinstallatie","e1*2007/46*0569*02","KMH71350E","MCE27VA9","0","0.04","367","Nee","Ja",,"Ja","5500","0","0.00","2024","Logisch","00","Ja","2025-04-10T00:00:00.000","2015-06-18T00:00:00.000","2015-06-18T00:00:00.000","2015-06-18T00:00:00.000",,,,,,,,,,,,,,,,,,,,,"B",,,,,,,"https://opendata.rdw.nl/resource/3huj-srit.json","https://opendata.rdw.nl/resource/8ys7-d773.json","https://opendata.rdw.nl/resource/vezc-m2t6.json","https://opendata.rdw.nl/resource/jhie-znh9.json","https://opendata.rdw.nl/resource/kmfi-hrps.json"
"GK639G","Personenauto","MERCEDES-BENZ","SPRINTER","20250628","20150618","22955","voor rolstoelen toegankelijk voertuig","9","WIT","Niet geregistreerd","4","1796","2711","3500","2811","750","2000","20150618","20150618","Geen verstrekking in Open Data","72016","Ja",,,,,,,"0","4","0","0",,"0","0","M1",,,"schutbord motorruimte","3500","906AC35G","Af-fabriek gasinstallatie","e1*2007/46*0569*02","KMH71350E","MCE27VA9","0","0.04","367","Nee","Ja",,"Ja","5500","0","0.00","2024","Logisch","00","Ja","2025-06-28T00:00:00.000","2015-06-18T00:00:00.000","2015-06-18T00:00:00.000","2015-06-18T00:00:00.000",,,,,,,,,,,,,,,,,,,,,"B",,,,,,,"https://opendata.rdw.nl/resource/3huj-srit.json","https://opendata.rdw.nl/resource/8ys7-d773.json","https://opendata.rdw.nl/resource/vezc-m2t6.json","https://opendata.rdw.nl/resource/jhie-znh9.json","https://opendata.rdw.nl/resource/kmfi-hrps.json"
"GK640G","Personenauto","MERCEDES-BENZ","SPRINTER","20240618","20150618","22955","voor rolstoelen toegankelijk voertuig","9","WIT","Niet geregistreerd","4","1796","2711","3500","2811","750","2000","20150618","20150618","Geen verstrekking in Open Data","72016","Ja",,,,,,,"0","4","0","0",,"0","0","M1",,,"schutbord motorruimte","3500","906AC35G","Af-fabriek gasinstallatie","e1*2007/46*0569*02","KMH71350E","MCE27VA9","0","0.04","367","Nee","Ja",,"Ja","5500","0","0.00","2024","Logisch","00","Ja","2024-06-18T00:00:00.000","2015-06-18T00:00:00.000","2015-06-18T00:00:00.000","2015-06-18T00:00:00.000",,,,,,,,,,,,,,,,,,,,,"B",,,,,,,"https://opendata.rdw.nl/resource/3huj-srit.json","https://opendata.rdw.nl/resource/8ys7-d773.json","https://opendata.rdw.nl/resource/vezc-m2t6.json","https://opendata.rdw.nl/resource/jhie-znh9.json","https://opendata.rdw.nl/resource/kmfi-hrps.json"
"GK651G","Personenauto","MERCEDES-BENZ","SPRINTER","20250417","20150618","22955","voor rolstoelen toegankelijk voertuig","9","WIT","Niet geregistreerd","4","1796","2711","3500","2811","750","2000","20150618","20150618","Geen verstrekking in Open Data","72016","Ja",,,,,,,"0","4","0","0",,"0","0","M1",,,"schutbord motorruimte","3500","906AC35G","Af-fabriek gasinstallatie","e1*2007/46*0569*02","KMH71350E","MCE27VA9","0","0.04","367","Nee","Nee",,"Ja","5500","0","0.00","2024","Logisch","00","Ja","2025-04-17T00:00:00.000","2015-06-18T00:00:00.000","2015-06-18T00:00:00.000","2015-06-18T00:00:00.000",,,,,,,,,,,,,,,,,,,,,"B",,,,,,,"https://opendata.rdw.nl/resource/3huj-srit.json","https://opendata.rdw.nl/resource/8ys7-d773.json","https://opendata.rdw.nl/resource/vezc-m2t6.json","https://opendata.rdw.nl/resource/jhie-znh9.json","https://opendata.rdw.nl/resource/kmfi-hrps.json"
"GK658G","Personenauto","MERCEDES-BENZ","SPRINTER","20250618","20150618","22955","voor rolstoelen toegankelijk voertuig","9","WIT","Niet geregistreerd","4","1796","2711","3500","2811","750","2000","20150618","20150618","Geen verstrekking in Open Data","72016","Ja",,,,,,,"0","4","0","0",,"0","0","M1",,,"schutbord motorruimte","3500","906AC35G","Af-fabriek gasinstallatie","e1*2007/46*0569*02","KMH71350E","MCE27VA9","0","0.04","367","Nee","Ja",,"Ja","5500","0","0.00","2024","Logisch","00","Ja","2025-06-18T00:00:00.000","2015-06-18T00:00:00.000","2015-06-18T00:00:00.000","2015-06-18T00:00:00.000",,,,,,,,,,,,,,,,,,,,,"B",,,,,,,"https://opendata.rdw.nl/resource/3huj-srit.json","https://opendata.rdw.nl/resource/8ys7-d773.json","https://opendata.rdw.nl/resource/vezc-m2t6.json","https://opendata.rdw.nl/resource/jhie-znh9.json","https://opendata.rdw.nl/resource/kmfi-hrps.json"