"kenteken","voertuigsoort","merk","handelsbenaming","vervaldatum_apk","datum_tenaamstelling","bruto_bpm","inrichting","aantal_zitplaatsen","eerste_kleur","tweede_kleur","aantal_cilinders","cilinderinhoud","massa_ledig_voertuig","toegestane_maximum_massa_voertuig","massa_rijklaar","maximum_massa_trekken_ongeremd","maximum_trekken_massa_geremd","datum_eerste_toelating","datum_eerste_tenaamstelling_in_nederland","wacht_op_keuren","catalogusprijs","wam_verzekerd","maximale_constructiesnelheid","laadvermogen","oplegger_geremd","aanhangwagen_autonoom_geremd","aanhangwagen_middenas_geremd","aantal_staanplaatsen","aantal_deuren","aantal_wielen","afstand_hart_koppeling_tot_achterzijde_voertuig","afstand_voorzijde_voertuig_tot_hart_koppeling","afwijkende_maximum_snelheid","lengte","breedte","europese_voertuigcategorie","europese_voertuigcategorie_toevoeging","europese_uitvoeringcategorie_toevoeging","plaats_chassisnummer","technische_max_massa_voertuig","type","type_gasinstallatie","typegoedkeuringsnummer","variant","uitvoering","volgnummer_wijziging_eu_typegoedkeuring","vermogen_massarijklaar","wielbasis","export_indicator","openstaande_terugroepactie_indicator","vervaldatum_tachograaf","taxi_indicator","maximum_massa_samenstelling","aantal_rolstoelplaatsen","maximum_ondersteunende_snelheid","jaar_laatste_registratie_tellerstand","tellerstandoordeel","code_toelichting_tellerstandoordeel","tenaamstellen_mogelijk","vervaldatum_apk_dt","datum_tenaamstelling_dt","datum_eerste_toelating_dt","datum_eerste_tenaamstelling_in_nederland_dt","vervaldatum_tachograaf_dt","maximum_last_onder_de_vooras_sen_tezamen_koppeling","type_remsysteem_voertuig_code","rupsonderstelconfiguratiecode","wielbasis_voertuig_minimum","wielbasis_voertuig_maximum","lengte_voertuig_minimum","lengte_voertuig_maximum","breedte_voertuig_minimum","breedte_voertuig_maximum","hoogte_voertuig","hoogte_voertuig_minimum","hoogte_voertuig_maximum","massa_bedrijfsklaar_minimaal","massa_bedrijfsklaar_maximaal","technisch_toelaatbaar_massa_koppelpunt","maximum_massa_technisch_maximaal","maximum_massa_technisch_minimaal","subcategorie_nederland","verticale_belasting_koppelpunt_getrokken_voertuig","zuinigheidsclassificatie","registratie_datum_goedkeuring_afschrijvingsmoment_bpm","registratie_datum_goedkeuring_afschrijvingsmoment_bpm_dt","gem_lading_wrde","aerodyn_voorz","massa_alt_aandr","verl_cab_ind","api_gekentekende_voertuigen_assen","api_gekentekende_voertuigen_brandstof","api_gekentekende_voertuigen_carrosserie","api_gekentekende_voertuigen_carrosserie_specifiek","api_gekentekende_voertuigen_voertuigklasse"
"HR537X","Personenauto","MERCEDES-BENZ","E 200 BLUETEC","20241007","20220905","16750","lijkwagen","2","ZWART","Niet geregistreerd","4","2143","1820","2410","1920","750","2100","20141007","20151216","Geen verstrekking in Open Data",,"Ja",,,,,,,"2","4",,,,,,"M1",,,"by dwarsbalk r. voorzitting","2410","212 K",,,,,,"0.05","353","Nee","Nee",,"Nee","4610",,,"2023","Geen oordeel","05","Ja","2024-10-07T00:00:00.000","2022-09-05T00:00:00.000","2014-10-07T00:00:00.000","2015-12-16T00:00:00.000",,,,,,,,,,,,,,,,,,,,,,,,,,,,"https://opendata.rdw.nl/resource/3huj-srit.json","https://opendata.rdw.nl/resource/8ys7-d773.json","https://opendata.rdw.nl/resource/vezc-m2t6.json","https://opendata.rdw.nl/resource/jhie-znh9.json","https://opendata.rdw.nl/resource/kmfi-hrps.json"
"HZ554Z","Personenauto","MERCEDES-BENZ","E 200 BLUETEC","20250319","20210617","14698","lijkwagen","2","ZWART","Niet geregistreerd","4","2143","1895","2410","1995","750","2100","20150513","20160127","Geen verstrekking in Open Data",,"Ja",,,,,,,"2","4",,,,,,"M1",,,"by dwarsbalk r. voorzitting","2410","212 K",,,,,,"0.05","351","Nee","Nee",,"Nee","4610",,,"2024","Geen oordeel","05","Ja","2025-03-19T00:00:00.000","2021-06-17T00:00:00.000","2015-05-13T00:00:00.000","2016-01-27T00:00:00.000",,,,,,,,,,,,,,,,,,,,,,,,,,,,"https://opendata.rdw.nl/resource/3huj-srit.json","https://opendata.rdw.nl/resource/8ys7-d773.json","https://opendata.rdw.nl/resource/vezc-m2t6.json","https://opendata.rdw.nl/resource/jhie-znh9.json","https://opendata.rdw.nl/resource/kmfi-hrps.json"
"JS307F","Personenauto","MERCEDES-BENZ","E 200 BLUETEC","20240721","20230721","14698","lijkwagen","2","GRIJS","Niet geregistreerd","4","2143","1895","2410","1995","750","2100","20151125","20160601","Geen verstrekking in Open Data",,"Ja",,,,,,,"3","4",,,,,,"M1",,,"by dwarsbalk r. voorzitting","2410","212 K",,,,,,"0.05","354","Nee","Nee",,"Nee","4610",,,"2023","Geen oordeel","05","Ja","2024-07-21T00:00:00.000","2023-07-21T00:00:00.000","2015-11-25T00:00:00.000","2016-06-01T00:00:00.000",,,,,,,,,,,,,,,,,,,,,,,,,,,,"https://opendata.rdw.nl/resource/3huj-srit.json","https://opendata.rdw.nl/resource/8ys7-d773.json","https://opendata.rdw.nl/resource/vezc-m2t6.json","https://opendata.rdw.nl/resource/jhie-znh9.json","https://opendata.rdw.nl/resource/kmfi-hrps.json"
"KG494F","Personenauto","MERCEDES-BENZ","E 200 BLUETEC","20250326","20230106","13379","lijkwagen","2","GRIJS","Niet geregistreerd","4","2143","2090","2710","2190","750","2100","20150325","20160901","Geen verstrekking in Open Data",,"Ja",,,,,,,"4","4",,,,,,"M1",,,"r. voorzitting by bodemplaat","2710","212",,,,,,"0.05","374","Nee","Nee",,"Nee",,,,"2024","Geen oordeel","05","Ja","2025-03-26T00:00:00.000","2023-01-06T00:00:00.000","2015-03-25T00:00:00.000","2016-09-01T00:00:00.000",,,,,,,,,,,,,,,,,,,,,,,,,,,,"https://opendata.rdw.nl/resource/3huj-srit.json","https://opendata.rdw.nl/resource/8ys7-d773.json","https://opendata.rdw.nl/resource/vezc-m2t6.json","https://opendata.rdw.nl/resource/jhie-znh9.json","https://opendata.rdw.nl/resource/kmfi-hrps.json"
"KH940D","Personenauto","MERCEDES-BENZ","E 200 BLUETEC","20241029","20221230","13379","lijkwagen","2","GRIJS","Niet geregistreerd","4","2143","2120","2710","2220","750","2100","20141029","20160905","Geen verstrekking in Open Data",,"Ja",,,,,,,"4","4",,,,,,"M1",,,"by dwarsbalk r. voorzitting","2710","212",,,,,,"0.05","375","Nee","Nee",,"Nee",,,,"2023","Geen oordeel","05","Ja","2024-10-29T00:00:00.000","2022-12-30T00:00:00.000","2014-10-29T00:00:00.000","2016-09-05T00:00:00.000",,,,,,,,,,,,,,,,,,,,,,,,,,,,"https://opendata.rdw.nl/resource/3huj-srit.json","https://opendata.rdw.nl/resource/8ys7-d773.json","https://opendata.rdw.nl/resource/vezc-m2t6.json","https://opendata.rdw.nl/resource/jhie-znh9.json","https://opendata.rdw.nl/resource/kmfi-hrps.json"
"KJ393X","Personenauto","MERCEDES-BENZ","E 200 BLUETEC","20241109","20221206","8912","lijkwagen","2","GRIJS","Niet geregistreerd","4","2143","2274","2574","2374",,,"20141106","20161006","Geen verstrekking in Open Data","72260","Ja",,,,,,,"4","4",,,,,,"M1",,,"r. bodemplaat by voorzitting","2574","212",,,,,,"0.04","360","Nee","Nee",,"Nee",,,,"2023","Geen oordeel","05","Ja","2024-11-09T00:00:00.000","2022-12-06T00:00:00.000","2014-11-06T00:00:00.000","2016-10-06T00:00:00.000",,,,,,,,,,,,,,,,,,,,,,,,,,,,"https://opendata.rdw.nl/resource/3huj-srit.json","https://opendata.rdw.nl/resource/8ys7-d773.json","https://opendata.rdw.nl/resource/vezc-m2t6.json","https://opendata.rdw.nl/resource/jhie-znh9.json","https://opendata.rdw.nl/resource/kmfi-hrps.json"
"NF627T","Personenauto","MERCEDES-BENZ","E 200 BLUETEC","20250119","20220124","15315","lijkwagen","2","GRIJS","Niet geregistreerd","4","2143","2170","2590","2270","750","2100","20150327","20170102","Geen verstrekking in Open Data",,"Ja",,,,,,,"2","4",,,,,,"M1",,,"by dwarsbalk r. voorzitting","2590","212 K",,,,,,"0.04","352","Nee","Nee",,"Nee","4610",,,"2024","Geen oordeel","05","Ja","2025-01-19T00:00:00.000","2022-01-24T00:00:00.000","2015-03-27T00:00:00.000","2017-01-02T00:00:00.000",,,,,,,,,,,,,,,,,,,,,,,,,,,,"https://opendata.rdw.nl/resource/3huj-srit.json","https://opendata.rdw.nl/resource/8ys7-d773.json","https://opendata.rdw.nl/resource/vezc-m2t6.json","https://opendata.rdw.nl/resource/jhie-znh9.json","https://opendata.rdw.nl/resource/kmfi-hrps.json"
"PB214S","Personenauto","MERCEDES-BENZ","E 200 BLUETEC","20241021","20230819","16222","lijkwagen","2","ZWART","Niet geregistreerd","4","2143","2170","2590","2270",,,"20151021","20170524","Geen verstrekking in Open Data",,"Ja",,,,,,,"2","4",,,,,,"M1",,,"r. voorzitting","2590",,,,,,,"0.04","352","Nee","Nee",,"Nee",,,,"2023","Geen oordeel","05","Ja","2024-10-21T00:00:00.000","2023-08-19T00:00:00.000","2015-10-21T00:00:00.000","2017-05-24T00:00:00.000",,,,,,,,,,,,,,,,,,,,,,,,,,,,"https://opendata.rdw.nl/resource/3huj-srit.json","https://opendata.rdw.nl/resource/8ys7-d773.json","https://opendata.rdw.nl/resource/vezc-m2t6.json","https://opendata.rdw.nl/resource/jhie-znh9.json","https://opendata.rdw.nl/resource/kmfi-hrps.json"
"PB781J","Personenauto","MERCEDES-BENZ","E 200 BLUETEC","20250312","20180625","15294","lijkwagen","2","ZWART","Niet geregistreerd","4","2143","2180","2710","2280",,,"20150617","20170703","Geen verstrekking in Open Data",,"Ja",,,,,,,"2","4",,,,,,"M1",,,"r. bodemplaat by voorzitting","2710","212",,,,,,"0.04","367","Nee","Nee",,"Nee",,,,"2024","Geen oordeel","05","Ja","2025-03-12T00:00:00.000","2018-06-25T00:00:00.000","2015-06-17T00:00:00.000","2017-07-03T00:00:00.000",,,,,,,,,,,,,,,,,,,,,,,,,,,,"https://opendata.rdw.nl/resource/3huj-srit.json","https://opendata.rdw.nl/resource/8ys7-d773.json","https://opendata.rdw.nl/resource/vezc-m2t6.json","https://opendata.rdw.nl/resource/jhie-znh9.json","https://opendata.rdw.nl/resource/kmfi-hrps.json"
"PD905P","Personenauto","MERCEDES-BENZ","E 200 BLUETEC","20250315","20170608","15409","lijkwagen","2","GRIJS","Niet geregistreerd","4","2143","2180","2720","2280","750","2100","20160315","20170608","Geen verstrekking in Open Data",,"Ja",,,,,,,"4","4",,,,,,"M1",,,"r. dwarsbalk onder voorzitting","2720","212",,,,,,"0.04","373","Nee","Nee",,"Nee",,,,"2024","Geen oordeel","05","Ja","2025-03-15T00:00:00.000","2017-06-08T00:00:00.000","2016-03-15T00:00:00.000","2017-06-08T00:00:00.000",,,,,,,,,,,,,,,,,,,,,,,,,,,,"https://opendata.rdw.nl/resource/3huj-srit.json","https://opendata.rdw.nl/resource/8ys7-d773.json","https://opendata.rdw.nl/resource/vezc-m2t6.json","https://opendata.rdw.nl/resource/jhie-znh9.json","https://opendata.rdw.nl/resource/kmfi-hrps.json"
"PF893X","Personenauto","MERCEDES-BENZ","E 200 BLUETEC","20250301","20170623","14179","lijkwagen","2","BLAUW","Niet geregistreerd","4","2143","2234","2534","2334","750","2100","20150701","20170623","Geen verstrekking in Open Data",,"Ja",,,,,,,"4","4",,,,,,"M1",,,"r. onder voorzitting","2534","212",,,,,,"0.04","361","Nee","Nee",,"Nee","4634",,,"2024","Geen oordeel","05","Ja","2025-03-01T00:00:00.000","2017-06-23T00:00:00.000","2015-07-01T00:00:00.000","2017-06-23T00:00:00.000",,,,,,,,,,,,,,,,,,,,,,,,,,,,"https://opendata.rdw.nl/resource/3huj-srit.json","https://opendata.rdw.nl/resource/8ys7-d773.json","https://opendata.rdw.nl/resource/vezc-m2t6.json","https://opendata.rdw.nl/resource/jhie-znh9.json","https://opendata.rdw.nl/resource/kmfi-hrps.json"
"PN660X","Personenauto","MERCEDES-BENZ","E 200 BLUETEC","20250310","20230311","14179","lijkwagen","2","ZWART","Niet geregistreerd","4","2143","2200","2539","2300","750","2100","20160307","20170824","Geen verstrekking in Open Data",,"Ja",,,,,,,"4","4",,,,,,"M1",,,"r. dwarsbalk onder voorzitting","2539","212",,,,,,"0.04","361","Nee","Nee",,"Nee","4639",,,"2024","Geen oordeel","05","Ja","2025-03-10T00:00:00.000","2023-03-11T00:00:00.000","2016-03-07T00:00:00.000","2017-08-24T00:00:00.000",,,,,,,,,,,,,,,,,,,,,,,,,,,,"https://opendata.rdw.nl/resource/3huj-srit.json","https://opendata.rdw.nl/resource/8ys7-d773.json","https://opendata.rdw.nl/resource/vezc-m2t6.json","https://opendata.rdw.nl/resource/jhie-znh9.json","https://opendata.rdw.nl/resource/kmfi-hrps.json"
"PR211S","Personenauto","MERCEDES-BENZ","E 200 BLUETEC","20250315","20170831","12147","lijkwagen","2","ZWART","Niet geregistreerd","4","2143","2100","2720","2200",,,"20160315","20170831","Geen verstrekking in Open Data","60729","Ja",,,,,,,"4","4",,,,,,"M1",,,"bodemplaat r. voorzitting","2720",,,,,,,"0.05","373","Nee","Nee",,"Nee",,,,"2024","Geen oordeel","05","Ja","2025-03-15T00:00:00.000","2017-08-31T00:00:00.000","2016-03-15T00:00:00.000","2017-08-31T00:00:00.000",,,,,,,,,,,,,,,,,,,,,,,,,,,,"https://opendata.rdw.nl/resource/3huj-srit.json","https://opendata.rdw.nl/resource/8ys7-d773.json","https://opendata.rdw.nl/resource/vezc-m2t6.json","https://opendata.rdw.nl/resource/jhie-znh9.json","https://opendata.rdw.nl/resource/kmfi-hrps.json"
"PR235S","Personenauto","MERCEDES-BENZ","E 200 BLUETEC","20250317","20170831","12147","lijkwagen","2","ZWART","Niet geregistreerd","4","2143","2100","2720","2200",,,"20160315","20170831","Geen verstrekking in Open Data","59725","Ja",,,,,,,"4","4",,,,,,"M1",,,"r. dwarsbalk by voorzitting","2720","212",,,,,,"0.05","373","Nee","Nee",,"Nee",,,,"2024","Geen oordeel","05","Ja","2025-03-17T00:00:00.000","2017-08-31T00:00:00.000","2016-03-15T00:00:00.000","2017-08-31T00:00:00.000",,,,,,,,,,,,,,,,,,,,,,,,,,,,"https://opendata.rdw.nl/resource/3huj-srit.json","https://opendata.rdw.nl/resource/8ys7-d773.json","https://opendata.rdw.nl/resource/vezc-m2t6.json","https://opendata.rdw.nl/resource/jhie-znh9.json","https://opendata.rdw.nl/resource/kmfi-hrps.json"
"PR988N","Personenauto","MERCEDES-BENZ","E 200 BLUETEC","20250308","20230220","14179","lijkwagen","2","GRIJS","Niet geregistreerd","4","2143","2200","2610","2300",,,"20160308","20170831","Geen verstrekking in Open Data",,"Ja",,,,,,,"4","4",,,,,,"M1",,,"r. bodemplaat by voorzitting","2610","212",,,,,,"0.04","362","Nee","Nee",,"Nee",,,,"2024","Geen oordeel","05","Ja","2025-03-08T00:00:00.000","2023-02-20T00:00:00.000","2016-03-08T00:00:00.000","2017-08-31T00:00:00.000",,,,,,,,,,,,,,,,,,,,,,,,,,,,"https://opendata.rdw.nl/resource/3huj-srit.json","https://opendata.rdw.nl/resource/8ys7-d773.json","https://opendata.rdw.nl/resource/vezc-m2t6.json","https://opendata.rdw.nl/resource/jhie-znh9.json","https://opendata.rdw.nl/resource/kmfi-hrps.json"
"PX702S","Personenauto","MERCEDES-BENZ","E 200 BLUETEC","20250429","20240429","11143","lijkwagen","2","GRIJS","Niet geregistreerd","4","2143","2324","2580","2424",,,"20160411","20171023","Geen verstrekking in Open Data","55777","Ja",,,,,,,"4","4",,,,,,"M1",,,"bodemplaat r. voorzitting","2580","212",,,,,,"0.04","362","Nee","Nee",,"Nee",,,,"2024","Geen oordeel","05","Ja","2025-04-29T00:00:00.000","2024-04-29T00:00:00.000","2016-04-11T00:00:00.000","2017-10-23T00:00:00.000",,,,,,,,,,,,,,,,,,,,,,,,,,,,"https://opendata.rdw.nl/resource/3huj-srit.json","https://opendata.rdw.nl/resource/8ys7-d773.json","https://opendata.rdw.nl/resource/vezc-m2t6.json","https://opendata.rdw.nl/resource/jhie-znh9.json","https://opendata.rdw.nl/resource/kmfi-hrps.json"
"RS215S","Personenauto","MERCEDES-BENZ","E 200 BLUETEC","20250209","20240402","14179","lijkwagen","2","GRIJS","Niet geregistreerd","4","2143","2180","2610","2280","750","2100","20160209","20180222","Geen verstrekking in Open Data",,"Ja",,,,,,,"4","4",,,,,,"M1",,,,"2610","212",,,,,,"0.04","362","Nee","Nee",,"Nee",,,,"2024","Geen oordeel","05","Ja","2025-02-09T00:00:00.000","2024-04-02T00:00:00.000","2016-02-09T00:00:00.000","2018-02-22T00:00:00.000",,,,,,,,,,,,,,,,,,,,,,,,,,,,"https://opendata.rdw.nl/resource/3huj-srit.json","https://opendata.rdw.nl/resource/8ys7-d773.json","https://opendata.rdw.nl/resource/vezc-m2t6.json","https://opendata.rdw.nl/resource/jhie-znh9.json","https://opendata.rdw.nl/resource/kmfi-hrps.json"
"RS276X","Personenauto","MERCEDES-BENZ","E 200 BLUETEC","20250412","20180126","12605","lijkwagen","2","GRIJS","Niet geregistreerd","4","2143","2000","2720","2100",,,"20160321","20180126","Geen verstrekking in Open Data","60728","Ja",,,,,,,"4","4",,,,,,"M1",,,"r. bodemplaat by voorzitting","2720","212",,,,,,"0.05","378","Nee","Nee",,"Nee",,,,"2024","Geen oordeel","05","Ja","2025-04-12T00:00:00.000","2018-01-26T00:00:00.000","2016-03-21T00:00:00.000","2018-01-26T00:00:00.000",,,,,,,,,,,,,,,,,,,,,,,,,,,,"https://opendata.rdw.nl/resource/3huj-srit.json","https://opendata.rdw.nl/resource/8ys7-d773.json","https://opendata.rdw.nl/resource/vezc-m2t6.json","https://opendata.rdw.nl/resource/jhie-znh9.json","https://opendata.rdw.nl/resource/kmfi-hrps.json"
"RT719T","Personenauto","MERCEDES-BENZ","E 200 BLUETEC","20250404","20220404","14179","lijkwagen","2","GRIJS","Niet geregistreerd","4","2143","2224","2524","2324",,,"20160530","20180206","Geen verstrekking in Open Data",,"Ja",,,,,,,"4","4",,,,,,"M1",,,"r. balk onder voorzitting","2524","212",,,,,,"0.04","361","Nee","Nee",,"Nee",,,,"2024","Geen oordeel","05","Ja","2025-04-04T00:00:00.000","2022-04-04T00:00:00.000","2016-05-30T00:00:00.000","2018-02-06T00:00:00.000",,,,,,,,,,,,,,,,,,,,,,,,,,,,"https://opendata.rdw.nl/resource/3huj-srit.json","https://opendata.rdw.nl/resource/8ys7-d773.json","https://opendata.rdw.nl/resource/vezc-m2t6.json","https://opendata.rdw.nl/resource/jhie-znh9.json","https://opendata.rdw.nl/resource/kmfi-hrps.json"
"SF454L","Personenauto","MERCEDES-BENZ","E 200 BLUETEC","20250531","20240304","1331","lijkwagen","2","ZWART","Niet geregistreerd","4","2143","2100","2410","2200",,,"20160321","20180330","Geen verstrekking in Open Data","68814","Ja","203",,,,,,"2","4",,,,,,"M1",,,"r. bodemplaat by voorzitting","2410","212",,,,,,"0.05","352","Nee","Nee",,"Nee",,,,"2024","Geen oordeel","05","Ja","2025-05-31T00:00:00.000","2024-03-04T00:00:00.000","2016-03-21T00:00:00.000","2018-03-30T00:00:00.000",,,,,,,,,,,,,,,,,,,,,,"20240225","2024-02-25T00:00:00.000",,,,,"https://opendata.rdw.nl/resource/3huj-srit.json","https://opendata.rdw.nl/resource/8ys7-d773.json","https://opendata.rdw.nl/resource/vezc-m2t6.json","https://opendata.rdw.nl/resource/jhie-znh9.json","https://opendata.rdw.nl/resource/kmfi-hrps.json"
"SG728Z","Personenauto","MERCEDES-BENZ","E 200 BLUETEC","20250523","20190405","14179","lijkwagen","2","GRIJS","Niet geregistreerd","4","2143","2210","2550","2310","750","2100","20160523","20180331","Geen verstrekking in Open Data",,"Ja",,,,,,,"4","4",,,,,,"M1",,,"r. bodemplaat by voorzitting","2550","212",,,,,,"0.04","374","Nee","Nee",,"Nee",,,,"2024","Geen oordeel","05","Ja","2025-05-23T00:00:00.000","2019-04-05T00:00:00.000","2016-05-23T00:00:00.000","2018-03-31T00:00:00.000",,,,,,,,,,,,,,,,,,,,,,,,,,,,"https://opendata.rdw.nl/resource/3huj-srit.json","https://opendata.rdw.nl/resource/8ys7-d773.json","https://opendata.rdw.nl/resource/vezc-m2t6.json","https://opendata.rdw.nl/resource/jhie-znh9.json","https://opendata.rdw.nl/resource/kmfi-hrps.json"
"TB256H","Personenauto","MERCEDES-BENZ","E 200 BLUETEC","20250614","20180702","14179","lijkwagen","2","GRIJS","Niet geregistreerd","4","2143","2060","2550","2160",,,"20160613","20180702","Geen verstrekking in Open Data",,"Ja",,,,,,,"4","4",,,,,,"M1",,,"r. dwarsbalk by pers.ruimte","2550","212",,,,,,"0.05","373","Nee","Nee",,"Nee",,,,"2024","Geen oordeel","05","Ja","2025-06-14T00:00:00.000","2018-07-02T00:00:00.000","2016-06-13T00:00:00.000","2018-07-02T00:00:00.000",,,,,,,,,,,,,,,,,,,,,,,,,,,,"https://opendata.rdw.nl/resource/3huj-srit.json","https://opendata.rdw.nl/resource/8ys7-d773.json","https://opendata.rdw.nl/resource/vezc-m2t6.json","https://opendata.rdw.nl/resource/jhie-znh9.json","https://opendata.rdw.nl/resource/kmfi-hrps.json"
"TL758D","Personenauto","MERCEDES-BENZ","E 200 BLUETEC","20240630","20210610","14179","lijkwagen","2","GRIJS","Niet geregistreerd","4","2143","2060","2550","2160",,,"20160629","20180831","Geen verstrekking in Open Data",,"Ja",,,,,,,"2","4",,,,,,"M1",,,"r. dwarsbalk by voorzitting","2550","212",,,,,,"0.05","375","Nee","Nee",,"Nee",,,,"2023","Geen oordeel","05","Ja","2024-06-30T00:00:00.000","2021-06-10T00:00:00.000","2016-06-29T00:00:00.000","2018-08-31T00:00:00.000",,,,,,,,,,,,,,,,,,,,,,,,,,,,"https://opendata.rdw.nl/resource/3huj-srit.json","https://opendata.rdw.nl/resource/8ys7-d773.json","https://opendata.rdw.nl/resource/vezc-m2t6.json","https://opendata.rdw.nl/resource/jhie-znh9.json","https://opendata.rdw.nl/resource/kmfi-hrps.json"
"TR382G","Personenauto","MERCEDES-BENZ","E 200 BLUETEC","20250607","20181129","14179","lijkwagen","2","ZWART","Niet geregistreerd","4","2143","2210","2650","2310",,,"20160607","20181129","Geen verstrekking in Open Data",,"Ja",,,,,,,"2","4",,,,,,"M1",,,"r. dwarsbalk by voorzitting","2650","212",,,,,,"0.04","374","Nee","Nee",,"Nee",,,,"2024","Geen oordeel","05","Ja","2025-06-07T00:00:00.000","2018-11-29T00:00:00.000","2016-06-07T00:00:00.000","2018-11-29T00:00:00.000",,,,,,,,,,,,,,,,,,,,,,,,,,,,"https://opendata.rdw.nl/resource/3huj-srit.json","https://opendata.rdw.nl/resource/8ys7-d773.json","https://opendata.rdw.nl/resource/vezc-m2t6.json","https://opendata.rdw.nl/resource/jhie-znh9.json","https://opendata.rdw.nl/resource/kmfi-hrps.json"
