"kenteken","voertuigsoort","merk","handelsbenaming","vervaldatum_apk","datum_tenaamstelling","bruto_bpm","inrichting","aantal_zitplaatsen","eerste_kleur","tweede_kleur","aantal_cilinders","cilinderinhoud","massa_ledig_voertuig","toegestane_maximum_massa_voertuig","massa_rijklaar","maximum_massa_trekken_ongeremd","maximum_trekken_massa_geremd","datum_eerste_toelating","datum_eerste_tenaamstelling_in_nederland","wacht_op_keuren","catalogusprijs","wam_verzekerd","maximale_constructiesnelheid","laadvermogen","oplegger_geremd","aanhangwagen_autonoom_geremd","aanhangwagen_middenas_geremd","aantal_staanplaatsen","aantal_deuren","aantal_wielen","afstand_hart_koppeling_tot_achterzijde_voertuig","afstand_voorzijde_voertuig_tot_hart_koppeling","afwijkende_maximum_snelheid","lengte","breedte","europese_voertuigcategorie","europese_voertuigcategorie_toevoeging","europese_uitvoeringcategorie_toevoeging","plaats_chassisnummer","technische_max_massa_voertuig","type","type_gasinstallatie","typegoedkeuringsnummer","variant","uitvoering","volgnummer_wijziging_eu_typegoedkeuring","vermogen_massarijklaar","wielbasis","export_indicator","openstaande_terugroepactie_indicator","vervaldatum_tachograaf","taxi_indicator","maximum_massa_samenstelling","aantal_rolstoelplaatsen","maximum_ondersteunende_snelheid","jaar_laatste_registratie_tellerstand","tellerstandoordeel","code_toelichting_tellerstandoordeel","tenaamstellen_mogelijk","vervaldatum_apk_dt","datum_tenaamstelling_dt","datum_eerste_toelating_dt","datum_eerste_tenaamstelling_in_nederland_dt","vervaldatum_tachograaf_dt","maximum_last_onder_de_vooras_sen_tezamen_koppeling","type_remsysteem_voertuig_code","rupsonderstelconfiguratiecode","wielbasis_voertuig_minimum","wielbasis_voertuig_maximum","lengte_voertuig_minimum","lengte_voertuig_maximum","breedte_voertuig_minimum","breedte_voertuig_maximum","hoogte_voertuig","hoogte_voertuig_minimum","hoogte_voertuig_maximum","massa_bedrijfsklaar_minimaal","massa_bedrijfsklaar_maximaal","technisch_toelaatbaar_massa_koppelpunt","maximum_massa_technisch_maximaal","maximum_massa_technisch_minimaal","subcategorie_nederland","verticale_belasting_koppelpunt_getrokken_voertuig","zuinigheidsclassificatie","registratie_datum_goedkeuring_afschrijvingsmoment_bpm","registratie_datum_goedkeuring_afschrijvingsmoment_bpm_dt","gem_lading_wrde","aerodyn_voorz","massa_alt_aandr","verl_cab_ind","api_gekentekende_voertuigen_assen","api_gekentekende_voertuigen_brandstof","api_gekentekende_voertuigen_carrosserie","api_gekentekende_voertuigen_carrosserie_specifiek","api_gekentekende_voertuigen_voertuigklasse"
"P177TD","Personenauto","MERCEDES-BENZ","EVITO TOURER","20250628","20220628",,"MPV","9","WIT","Niet geregistreerd",,,"2455","3500","2555",,,"20220628","20220628","Geen verstrekking in Open Data","74840","Ja","140",,,,,,"6","4","0","0",,"537","193","M1",,,,"3500","639/2",,"e1*2007/46*0457*32","KOE45350NXX","3EDE0XX9XXXX","0","0.03","343","Nee","Nee",,"Ja","0","0","0.00","2024","Logisch","00","Ja","2025-06-28T00:00:00.000","2022-06-28T00:00:00.000","2022-06-28T00:00:00.000","2022-06-28T00:00:00.000",,,,,,,,,,,"186",,,,,,,,,,,"20220629","2022-06-29T00:00:00.000",,,,,"https://opendata.rdw.nl/resource/3huj-srit.json","https://opendata.rdw.nl/resource/8ys7-d773.json","https://opendata.rdw.nl/resource/vezc-m2t6.json","https://opendata.rdw.nl/resource/jhie-znh9.json","https://opendata.rdw.nl/resource/kmfi-hrps.json"
"V54FND","Bedrijfsauto","MERCEDES-BENZ","EVITO VAN","20280523","20240523",,"gesloten opbouw","2","N.v.t.","N.v.t.",,,"2430","3500","2530",,,"20240523","20240523","Geen verstrekking in Open Data","79143","Ja","140","1070",,,,,,"4",,,,,"193","N1",,,,"3500","639/2",,"e4*2018/858*00181*00","639/2KOE45350NXXN1V","2EDE0XX8XXXX","0","0.03","320","Nee","Nee",,"Nee",,,,"2024","Logisch","00","Ja","2028-05-23T00:00:00.000","2024-05-23T00:00:00.000","2024-05-23T00:00:00.000","2024-05-23T00:00:00.000",,,,,,,,,,,,,,,,,,,,,,"20240503","2024-05-03T00:00:00.000",,,,,"https://opendata.rdw.nl/resource/3huj-srit.json","https://opendata.rdw.nl/resource/8ys7-d773.json","https://opendata.rdw.nl/resource/vezc-m2t6.json","https://opendata.rdw.nl/resource/jhie-znh9.json","https://opendata.rdw.nl/resource/kmfi-hrps.json"
"VPP52J","Bedrijfsauto","MERCEDES-BENZ","EVITO TOURER","20260622","20220622",,"gesloten opbouw","2","N.v.t.","N.v.t.",,,"2462","3500","2562",,,"20220622","20220622","Geen verstrekking in Open Data","72391","Ja","140","1038",,,,,"6","4",,,,"514","193","N1",,,,"3500","639/2",,,,,,"0.03","320","Nee","Nee",,"Nee",,,,"2024","Logisch","00","Ja","2026-06-22T00:00:00.000","2022-06-22T00:00:00.000","2022-06-22T00:00:00.000","2022-06-22T00:00:00.000",,,,,,,,,,,"186",,,,,,,,,,,"20220405","2022-04-05T00:00:00.000",,,,,"https://opendata.rdw.nl/resource/3huj-srit.json","https://opendata.rdw.nl/resource/8ys7-d773.json","https://opendata.rdw.nl/resource/vezc-m2t6.json","https://opendata.rdw.nl/resource/jhie-znh9.json","https://opendata.rdw.nl/resource/kmfi-hrps.json"
"V48FTH","Bedrijfsauto","MERCEDES-BENZ","EVITO","20261108",,,"gesloten opbouw","3","N.v.t.","N.v.t.",,,"2308","3200","2408",,,"20221108",,"Geen verstrekking in Open Data","57583","Nee",,"892",,,,,,"4",,,,"514","193","N1",,,,"3200","639/4",,"e1*2007/46*0458*26","KWE05320SXX","2EDR0XX3ZSXX","1","0.03","320","Nee","Nee",,"Nee",,,,"2024","Geen oordeel","05","Ja","2026-11-08T00:00:00.000",,"2022-11-08T00:00:00.000",,,,,,,,,,,,"191",,,,,,,,,,,"20240526","2024-05-26T00:00:00.000",,,,,"https://opendata.rdw.nl/resource/3huj-srit.json","https://opendata.rdw.nl/resource/8ys7-d773.json","https://opendata.rdw.nl/resource/vezc-m2t6.json","https://opendata.rdw.nl/resource/jhie-znh9.json","https://opendata.rdw.nl/resource/kmfi-hrps.json"
"P410TG","Personenauto","MERCEDES-BENZ","EVITO TOURER","20250628","20220628",,"MPV","9","WIT","Niet geregistreerd",,,"2455","3500","2555",,,"20220628","20220628","Geen verstrekking in Open Data","74840","Ja","140",,,,,,"6","4","0","0",,"537","193","M1",,,,"3500","639/2",,"e1*2007/46*0457*32","KOE45350NXX","3EDE0XX9XXXX","0","0.03","343","Nee","Nee",,"Ja","0","0","0.00","2024","Logisch","00","Ja","2025-06-28T00:00:00.000","2022-06-28T00:00:00.000","2022-06-28T00:00:00.000","2022-06-28T00:00:00.000",,,,,,,,,,,"186",,,,,,,,,,,"20220629","2022-06-29T00:00:00.000",,,,,"https://opendata.rdw.nl/resource/3huj-srit.json","https://opendata.rdw.nl/resource/8ys7-d773.json","https://opendata.rdw.nl/resource/vezc-m2t6.json","https://opendata.rdw.nl/resource/jhie-znh9.json","https://opendata.rdw.nl/resource/kmfi-hrps.json"
"VSN96R","Bedrijfsauto","MERCEDES-BENZ","EVITO","20251125","20221123",,"gesloten opbouw","3","N.v.t.","N.v.t.",,,"2197","3200","2297",,,"20191125","20221123","Geen verstrekking in Open Data","50807","Ja","120","1003",,,,,"4","4",,,,"514","193","N1",,,,"3200","639/4",,,,,,"0.03","320","Nee","Ja",,"Nee",,,,"2024","Geen oordeel","05","Ja","2025-11-25T00:00:00.000","2022-11-23T00:00:00.000","2019-11-25T00:00:00.000","2022-11-23T00:00:00.000",,,,,,,,,,,,,,,,,,,,,,"20221110","2022-11-10T00:00:00.000",,,,,"https://opendata.rdw.nl/resource/3huj-srit.json","https://opendata.rdw.nl/resource/8ys7-d773.json","https://opendata.rdw.nl/resource/vezc-m2t6.json","https://opendata.rdw.nl/resource/jhie-znh9.json","https://opendata.rdw.nl/resource/kmfi-hrps.json"
"S661KF","Personenauto","MERCEDES-BENZ","EVITO TOURER","20250327","20230327",,"MPV","9","WIT","Niet geregistreerd",,,"2455","3500","2555",,,"20230327","20230327","Geen verstrekking in Open Data","79135","Ja","140",,,,,,"6","4","0","0",,"537","193","M1",,,,"3500","639/2",,"e1*2007/46*0457*31","KOE45350NXX","3EDE0XX9XXXX","0","0.03","343","Nee","Nee",,"Ja","0","0","0.00","2024","Logisch","00","Ja","2025-03-27T00:00:00.000","2023-03-27T00:00:00.000","2023-03-27T00:00:00.000","2023-03-27T00:00:00.000",,,,,,,,,,,"186",,,,,,,,,,,"20230328","2023-03-28T00:00:00.000",,,,,"https://opendata.rdw.nl/resource/3huj-srit.json","https://opendata.rdw.nl/resource/8ys7-d773.json","https://opendata.rdw.nl/resource/vezc-m2t6.json","https://opendata.rdw.nl/resource/jhie-znh9.json","https://opendata.rdw.nl/resource/kmfi-hrps.json"
"Z236RF","Personenauto","MERCEDES-BENZ","EVITO TOURER","20250727",,,"MPV","8","BLAUW","Niet geregistreerd",,,"2430","3500","2530",,,"20210727",,"Geen verstrekking in Open Data","69647","Nee",,,,,,,"6","4","0","0",,"514","193","M1",,,,"3500","639/2",,"e1*2007/46*0457*28","KOE45350NXX","2EDE0XX8XXXX","0","0.03","320","Nee","Nee",,"Nee","0","0","0.00","2024","Geen oordeel","05","Ja","2025-07-27T00:00:00.000",,"2021-07-27T00:00:00.000",,,,,,,,,,,,"186",,,,,,,,,,,"20240527","2024-05-27T00:00:00.000",,,,,"https://opendata.rdw.nl/resource/3huj-srit.json","https://opendata.rdw.nl/resource/8ys7-d773.json","https://opendata.rdw.nl/resource/vezc-m2t6.json","https://opendata.rdw.nl/resource/jhie-znh9.json","https://opendata.rdw.nl/resource/kmfi-hrps.json"
"VVL64K","Bedrijfsauto","MERCEDES-BENZ","EVITO","20270515","20230515",,"gesloten opbouw","2","N.v.t.","N.v.t.",,,"2275","3200","2375",,,"20230515","20230515","Geen verstrekking in Open Data","66096","Ja","100","925",,,,,"6","4",,,,"537","193","N1",,,,"3200","639/4",,"e1*2007/46*0458*27","KWE05320SXX","3EDR0XX2ZSXX","0","0.03","343","Nee","Nee",,"Nee",,,,"2024","Logisch","00","Ja","2027-05-15T00:00:00.000","2023-05-15T00:00:00.000","2023-05-15T00:00:00.000","2023-05-15T00:00:00.000",,,,,,,,,,,"191",,,,,,,,,,,"20230501","2023-05-01T00:00:00.000",,"N",,"N","https://opendata.rdw.nl/resource/3huj-srit.json","https://opendata.rdw.nl/resource/8ys7-d773.json","https://opendata.rdw.nl/resource/vezc-m2t6.json","https://opendata.rdw.nl/resource/jhie-znh9.json","https://opendata.rdw.nl/resource/kmfi-hrps.json"
"G360DR","Personenauto","MERCEDES-BENZ","EVITO TOURER","20251017","20190910",,"MPV","9","WIT","Niet geregistreerd",,,"2160","3200","2260",,,"20190910","20190910","Geen verstrekking in Open Data","59149","Ja","120",,,,,,"6","4","0","0",,"514","193","M1",,,,"3200","639/2",,"e1*2007/46*0457*21","KOE05320VXX","2EER0XX9XXXX","0","0.03","320","Nee","Ja",,"Nee","0","0","0.00","2023","Logisch","00","Ja","2025-10-17T00:00:00.000","2019-09-10T00:00:00.000","2019-09-10T00:00:00.000","2019-09-10T00:00:00.000",,,,,,,,,,,"187",,,,,,,,,,,,,,,,,"https://opendata.rdw.nl/resource/3huj-srit.json","https://opendata.rdw.nl/resource/8ys7-d773.json","https://opendata.rdw.nl/resource/vezc-m2t6.json","https://opendata.rdw.nl/resource/jhie-znh9.json","https://opendata.rdw.nl/resource/kmfi-hrps.json"
"G402RX","Personenauto","MERCEDES-BENZ","EVITO TOURER","20251203","20191203",,"MPV","9","WIT","Niet geregistreerd",,,"2185","3200","2285",,,"20191203","20191203","Geen verstrekking in Open Data","61684","Ja","120",,,,,,"6","4","0","0",,"537","193","M1",,,,"3200","639/2",,"e1*2007/46*0457*21","KOE05320VXX","3EER0XX9XXXX","0","0.03","343","Nee","Ja",,"Nee","0","0","0.00","2023","Logisch","00","Ja","2025-12-03T00:00:00.000","2019-12-03T00:00:00.000","2019-12-03T00:00:00.000","2019-12-03T00:00:00.000",,,,,,,,,,,"188",,,,,,,,,,,,,,,,,"https://opendata.rdw.nl/resource/3huj-srit.json","https://opendata.rdw.nl/resource/8ys7-d773.json","https://opendata.rdw.nl/resource/vezc-m2t6.json","https://opendata.rdw.nl/resource/jhie-znh9.json","https://opendata.rdw.nl/resource/kmfi-hrps.json"
"G574TS","Personenauto","MERCEDES-BENZ","EVITO TOURER","20251206","20191206",,"MPV","9","GRIJS","Niet geregistreerd",,,"2185","3200","2285",,,"20191206","20191206","Geen verstrekking in Open Data","61685","Ja","120",,,,,,"6","4","0","0",,"537","193","M1",,,,"3200","639/2",,"e1*2007/46*0457*22","KOE05320VXX","3EER0XX9XXXX","0","0.03","343","Nee","Ja",,"Nee","0","0","0.00","2024","Logisch","00","Ja","2025-12-06T00:00:00.000","2019-12-06T00:00:00.000","2019-12-06T00:00:00.000","2019-12-06T00:00:00.000",,,,,,,,,,,"188",,,,,,,,,,,,,,,,,"https://opendata.rdw.nl/resource/3huj-srit.json","https://opendata.rdw.nl/resource/8ys7-d773.json","https://opendata.rdw.nl/resource/vezc-m2t6.json","https://opendata.rdw.nl/resource/jhie-znh9.json","https://opendata.rdw.nl/resource/kmfi-hrps.json"
"G618KB","Personenauto","MERCEDES-BENZ","EVITO TOURER","20240812","20231130",,"MPV","9","WIT","Niet geregistreerd",,,"2185","3200","2285",,,"20200120","20200120","Geen verstrekking in Open Data","61684","Ja","120",,,,,,"6","4","0","0",,"537","193","M1",,,,"3200","639/2",,"e1*2007/46*0457*21","KOE05320VXX","3EER0XX9XXXX","0","0.03","343","Nee","Ja",,"Nee","0","0","0.00","2023","Logisch","00","Ja","2024-08-12T00:00:00.000","2023-11-30T00:00:00.000","2020-01-20T00:00:00.000","2020-01-20T00:00:00.000",,,,,,,,,,,"188",,,,,,,,,,,,,,,,,"https://opendata.rdw.nl/resource/3huj-srit.json","https://opendata.rdw.nl/resource/8ys7-d773.json","https://opendata.rdw.nl/resource/vezc-m2t6.json","https://opendata.rdw.nl/resource/jhie-znh9.json","https://opendata.rdw.nl/resource/kmfi-hrps.json"
"G707FB","Personenauto","MERCEDES-BENZ","EVITO TOURER","20250912","20190912",,"MPV","9","WIT","Niet geregistreerd",,,"2160","3200","2260",,,"20190912","20190912","Geen verstrekking in Open Data","59149","Ja","120",,,,,,"6","4","0","0",,"514","193","M1",,,,"3200","639/2",,"e1*2007/46*0457*21","KOE05320VXX","2EER0XX9XXXX","0","0.03","320","Nee","Ja",,"Nee","0","0","0.00","2023","Logisch","00","Ja","2025-09-12T00:00:00.000","2019-09-12T00:00:00.000","2019-09-12T00:00:00.000","2019-09-12T00:00:00.000",,,,,,,,,,,"187",,,,,,,,,,,,,,,,,"https://opendata.rdw.nl/resource/3huj-srit.json","https://opendata.rdw.nl/resource/8ys7-d773.json","https://opendata.rdw.nl/resource/vezc-m2t6.json","https://opendata.rdw.nl/resource/jhie-znh9.json","https://opendata.rdw.nl/resource/kmfi-hrps.json"
"G708FB","Personenauto","MERCEDES-BENZ","EVITO TOURER","20250912","20190912",,"MPV","9","WIT","Niet geregistreerd",,,"2160","3200","2260",,,"20190912","20190912","Geen verstrekking in Open Data","59149","Ja","120",,,,,,"6","4","0","0",,"514","193","M1",,,,"3200","639/2",,"e1*2007/46*0457*21","KOE05320VXX","2EER0XX9XXXX","0","0.03","320","Nee","Ja",,"Nee","0","0","0.00","2023","Logisch","00","Ja","2025-09-12T00:00:00.000","2019-09-12T00:00:00.000","2019-09-12T00:00:00.000","2019-09-12T00:00:00.000",,,,,,,,,,,"187",,,,,,,,,,,,,,,,,"https://opendata.rdw.nl/resource/3huj-srit.json","https://opendata.rdw.nl/resource/8ys7-d773.json","https://opendata.rdw.nl/resource/vezc-m2t6.json","https://opendata.rdw.nl/resource/jhie-znh9.json","https://opendata.rdw.nl/resource/kmfi-hrps.json"
"G735RL","Personenauto","MERCEDES-BENZ","EVITO TOURER","20251202","20191202",,"MPV","9","WIT","Niet geregistreerd",,,"2185","3200","2285",,,"20191202","20191202","Geen verstrekking in Open Data","61684","Ja","120",,,,,,"6","4","0","0",,"537","193","M1",,,,"3200","639/2",,"e1*2007/46*0457*21","KOE05320VXX","3EER0XX9XXXX","0","0.03","343","Nee","Ja",,"Nee","0","0","0.00","2023","Logisch","00","Ja","2025-12-02T00:00:00.000","2019-12-02T00:00:00.000","2019-12-02T00:00:00.000","2019-12-02T00:00:00.000",,,,,,,,,,,"188",,,,,,,,,,,,,,,,,"https://opendata.rdw.nl/resource/3huj-srit.json","https://opendata.rdw.nl/resource/8ys7-d773.json","https://opendata.rdw.nl/resource/vezc-m2t6.json","https://opendata.rdw.nl/resource/jhie-znh9.json","https://opendata.rdw.nl/resource/kmfi-hrps.json"
"G910BS","Personenauto","MERCEDES-BENZ","EVITO TOURER","20250830","20190830",,"MPV","9","WIT","Niet geregistreerd",,,"2185","3200","2285",,,"20190830","20190830","Geen verstrekking in Open Data","57499","Ja","120",,,,,,"6","4","0","0",,"537","193","M1",,,,"3200","639/2",,"e1*2007/46*0457*21","KOE05320VXX","3EER0XX9XXXX","0","0.03","343","Nee","Ja",,"Nee","0","0","0.00","2023","Logisch","00","Ja","2025-08-30T00:00:00.000","2019-08-30T00:00:00.000","2019-08-30T00:00:00.000","2019-08-30T00:00:00.000",,,,,,,,,,,"188",,,,,,,,,,,,,,,,,"https://opendata.rdw.nl/resource/3huj-srit.json","https://opendata.rdw.nl/resource/8ys7-d773.json","https://opendata.rdw.nl/resource/vezc-m2t6.json","https://opendata.rdw.nl/resource/jhie-znh9.json","https://opendata.rdw.nl/resource/kmfi-hrps.json"
"G931VP","Personenauto","MERCEDES-BENZ","EVITO TOURER","20251006","20191220",,"MPV","9","GRIJS","Niet geregistreerd",,,"2185","3200","2285",,,"20191220","20191220","Geen verstrekking in Open Data","62345","Ja","120",,,,,,"6","4","0","0",,"537","193","M1",,,,"3200","639/2",,"e1*2007/46*0457*23","KOE05320VXX","3EER0XX9XXXX","0","0.03","343","Nee","Ja",,"Nee","0","0","0.00","2023","Logisch","00","Ja","2025-10-06T00:00:00.000","2019-12-20T00:00:00.000","2019-12-20T00:00:00.000","2019-12-20T00:00:00.000",,,,,,,,,,,"188",,,,,,,,,,,,,,,,,"https://opendata.rdw.nl/resource/3huj-srit.json","https://opendata.rdw.nl/resource/8ys7-d773.json","https://opendata.rdw.nl/resource/vezc-m2t6.json","https://opendata.rdw.nl/resource/jhie-znh9.json","https://opendata.rdw.nl/resource/kmfi-hrps.json"
"H032XZ","Personenauto","MERCEDES-BENZ","EVITO TOURER","20240619","20200619",,"MPV","8","GRIJS","Niet geregistreerd",,,"2160","3200","2260",,,"20200619","20200619","Geen verstrekking in Open Data","62433","Ja","120",,,,,,"6","4","0","0",,"514","193","M1",,,,"3200","639/2",,"e1*2007/46*0457*24","KOE05320VXX","2EER0XX8XXXX","0","0.03","320","Nee","Ja",,"Nee","0","0","0.00","2021","Logisch","00","Ja","2024-06-19T00:00:00.000","2020-06-19T00:00:00.000","2020-06-19T00:00:00.000","2020-06-19T00:00:00.000",,,,,,,,,,,"187",,,,,,,,,,,,,,,,,"https://opendata.rdw.nl/resource/3huj-srit.json","https://opendata.rdw.nl/resource/8ys7-d773.json","https://opendata.rdw.nl/resource/vezc-m2t6.json","https://opendata.rdw.nl/resource/jhie-znh9.json","https://opendata.rdw.nl/resource/kmfi-hrps.json"
"H366RL","Personenauto","MERCEDES-BENZ","EVITO TOURER","20260501","20200416",,"MPV","9","WIT","Niet geregistreerd",,,"2185","3200","2285",,,"20200416","20200416","Geen verstrekking in Open Data","60346","Ja","120",,,,,,"6","4","0","0",,"537","193","M1",,,,"3200","639/2",,"e1*2007/46*0457*23","KOE05320VXX","3EER0XX9XXXX","0","0.03","343","Nee","Ja",,"Nee","0","0","0.00","2024","Logisch","00","Ja","2026-05-01T00:00:00.000","2020-04-16T00:00:00.000","2020-04-16T00:00:00.000","2020-04-16T00:00:00.000",,,,,,,,,,,"188",,,,,,,,,,,,,,,,,"https://opendata.rdw.nl/resource/3huj-srit.json","https://opendata.rdw.nl/resource/8ys7-d773.json","https://opendata.rdw.nl/resource/vezc-m2t6.json","https://opendata.rdw.nl/resource/jhie-znh9.json","https://opendata.rdw.nl/resource/kmfi-hrps.json"
"VHS52N","Bedrijfsauto","MERCEDES-BENZ","EVITO","20241215","20201215",,"gesloten opbouw","3","N.v.t.","N.v.t.",,,"2136","3200","2236",,,"20201215","20201215","Geen verstrekking in Open Data","55977","Ja","120","1064",,,,,"6","4","0","0",,"514","193","N1",,,,"3200","639/4",,"e1*2007/46*0458*20","KWE05320VXX","2EER0XX3XXXX","0","0.03","320","Nee","Ja",,"Nee","0","0","0.00","2024","Logisch","00","Ja","2024-12-15T00:00:00.000","2020-12-15T00:00:00.000","2020-12-15T00:00:00.000","2020-12-15T00:00:00.000",,,,,,,,,,,"191",,,,,,,,,,,,,,,,,"https://opendata.rdw.nl/resource/3huj-srit.json","https://opendata.rdw.nl/resource/8ys7-d773.json","https://opendata.rdw.nl/resource/vezc-m2t6.json","https://opendata.rdw.nl/resource/jhie-znh9.json","https://opendata.rdw.nl/resource/kmfi-hrps.json"
"H602TJ","Personenauto","MERCEDES-BENZ","EVITO TOURER","20260525","20210429",,"MPV","9","BLAUW","Niet geregistreerd",,,"2160","3200","2260",,,"20200525","20200525","Geen verstrekking in Open Data","56216","Ja","120",,,,,,"6","4","0","0",,"514","193","M1",,,,"3200","639/2",,"e1*2007/46*0457*23","KOE05320VXX","2EER0XX9XXXX","0","0.03","320","Nee","Ja",,"Nee","0","0","0.00","2024","Logisch","00","Ja","2026-05-25T00:00:00.000","2021-04-29T00:00:00.000","2020-05-25T00:00:00.000","2020-05-25T00:00:00.000",,,,,,,,,,,"187",,,,,,,,,,,,,,,,,"https://opendata.rdw.nl/resource/3huj-srit.json","https://opendata.rdw.nl/resource/8ys7-d773.json","https://opendata.rdw.nl/resource/vezc-m2t6.json","https://opendata.rdw.nl/resource/jhie-znh9.json","https://opendata.rdw.nl/resource/kmfi-hrps.json"
"H651BS","Personenauto","MERCEDES-BENZ","EVITO TOURER","20260329","20240402",,"MPV","8","WIT","Niet geregistreerd",,,"2185","3200","2285",,,"20200221","20200221","Geen verstrekking in Open Data","64592","Ja","120",,,,,,"6","4","0","0",,"537","193","M1",,,,"3200","639/2",,"e1*2007/46*0457*23","KOE05320VXX","3EER0XX8XXXX","0","0.03","343","Nee","Ja",,"Nee","0","0","0.00","2024","Logisch","00","Ja","2026-03-29T00:00:00.000","2024-04-02T00:00:00.000","2020-02-21T00:00:00.000","2020-02-21T00:00:00.000",,,,,,,,,,,"188",,,,,,,,,,,,,,,,,"https://opendata.rdw.nl/resource/3huj-srit.json","https://opendata.rdw.nl/resource/8ys7-d773.json","https://opendata.rdw.nl/resource/vezc-m2t6.json","https://opendata.rdw.nl/resource/jhie-znh9.json","https://opendata.rdw.nl/resource/kmfi-hrps.json"
"J129XF","Personenauto","MERCEDES-BENZ","EVITO TOURER","20241102","20201102",,"MPV","8","ZWART","Niet geregistreerd",,,"2185","3200","2285",,,"20201102","20201102","Geen verstrekking in Open Data","63735","Ja","120",,,,,,"6","4","0","0",,"537","193","M1",,,,"3200","639/2",,"e1*2007/46*0457*22","KOE05320VXX","3EER0XX8XXXX","0","0.03","343","Nee","Ja",,"Nee","0","0","0.00","2023","Logisch","00","Ja","2024-11-02T00:00:00.000","2020-11-02T00:00:00.000","2020-11-02T00:00:00.000","2020-11-02T00:00:00.000",,,,,,,,,,,"188",,,,,,,,,,,,,,,,,"https://opendata.rdw.nl/resource/3huj-srit.json","https://opendata.rdw.nl/resource/8ys7-d773.json","https://opendata.rdw.nl/resource/vezc-m2t6.json","https://opendata.rdw.nl/resource/jhie-znh9.json","https://opendata.rdw.nl/resource/kmfi-hrps.json"
"J293GH","Personenauto","MERCEDES-BENZ","EVITO TOURER","20240729","20200729",,"MPV","9","WIT","Niet geregistreerd",,,"2185","3200","2285",,,"20200729","20200729","Geen verstrekking in Open Data","59607","Ja","120",,,,,,"6","4","0","0",,"537","193","M1",,,"r.","3200","639/2",,"e1*2007/46*0457*21","KOE05320VXX","3EER0XX9XXXX","0","0.03","343","Nee","Ja",,"Nee","0","0","0.00","2021","Logisch","00","Ja","2024-07-29T00:00:00.000","2020-07-29T00:00:00.000","2020-07-29T00:00:00.000","2020-07-29T00:00:00.000",,,,,,,,,,,"188",,,,,,,,,,,,,,,,,"https://opendata.rdw.nl/resource/3huj-srit.json","https://opendata.rdw.nl/resource/8ys7-d773.json","https://opendata.rdw.nl/resource/vezc-m2t6.json","https://opendata.rdw.nl/resource/jhie-znh9.json","https://opendata.rdw.nl/resource/kmfi-hrps.json"
"J504KK","Personenauto","MERCEDES-BENZ","EVITO TOURER","20241006","20201006",,"MPV","9","WIT","Niet geregistreerd",,,"2160","3200","2260",,,"20201006","20201006","Geen verstrekking in Open Data","57057","Ja","120",,,,,,"6","4","0","0",,"514","193","M1",,,,"3200","639/2",,"e1*2007/46*0457*21","KOE05320VXX","2EER0XX9XXXX","0","0.03","320","Nee","Ja",,"Nee","0","0","0.00","2021","Logisch","00","Ja","2024-10-06T00:00:00.000","2020-10-06T00:00:00.000","2020-10-06T00:00:00.000","2020-10-06T00:00:00.000",,,,,,,,,,,"187",,,,,,,,,,,,,,,,,"https://opendata.rdw.nl/resource/3huj-srit.json","https://opendata.rdw.nl/resource/8ys7-d773.json","https://opendata.rdw.nl/resource/vezc-m2t6.json","https://opendata.rdw.nl/resource/jhie-znh9.json","https://opendata.rdw.nl/resource/kmfi-hrps.json"
"J532JJ","Personenauto","MERCEDES-BENZ","EVITO TOURER","20240819","20200819",,"MPV","9","WIT","Niet geregistreerd",,,"2185","3200","2285",,,"20200819","20200819","Geen verstrekking in Open Data","57214","Ja","120",,,,,,"6","4","0","0",,"537","193","M1",,,,"3200","639/2",,"e1*2007/46*0457*22","KOE05320VXX","3EER0XX9XXXX","0","0.03","343","Nee","Ja",,"Nee","0","0","0.00","2024","Logisch","00","Ja","2024-08-19T00:00:00.000","2020-08-19T00:00:00.000","2020-08-19T00:00:00.000","2020-08-19T00:00:00.000",,,,,,,,,,,"188",,,,,,,,,,,,,,,,,"https://opendata.rdw.nl/resource/3huj-srit.json","https://opendata.rdw.nl/resource/8ys7-d773.json","https://opendata.rdw.nl/resource/vezc-m2t6.json","https://opendata.rdw.nl/resource/jhie-znh9.json","https://opendata.rdw.nl/resource/kmfi-hrps.json"