"kenteken","voertuigsoort","merk","handelsbenaming","vervaldatum_apk","datum_tenaamstelling","bruto_bpm","inrichting","aantal_zitplaatsen","eerste_kleur","tweede_kleur","aantal_cilinders","cilinderinhoud","massa_ledig_voertuig","toegestane_maximum_massa_voertuig","massa_rijklaar","maximum_massa_trekken_ongeremd","maximum_trekken_massa_geremd","datum_eerste_toelating","datum_eerste_tenaamstelling_in_nederland","wacht_op_keuren","catalogusprijs","wam_verzekerd","maximale_constructiesnelheid","laadvermogen","oplegger_geremd","aanhangwagen_autonoom_geremd","aanhangwagen_middenas_geremd","aantal_staanplaatsen","aantal_deuren","aantal_wielen","afstand_hart_koppeling_tot_achterzijde_voertuig","afstand_voorzijde_voertuig_tot_hart_koppeling","afwijkende_maximum_snelheid","lengte","breedte","europese_voertuigcategorie","europese_voertuigcategorie_toevoeging","europese_uitvoeringcategorie_toevoeging","plaats_chassisnummer","technische_max_massa_voertuig","type","type_gasinstallatie","typegoedkeuringsnummer","variant","uitvoering","volgnummer_wijziging_eu_typegoedkeuring","vermogen_massarijklaar","wielbasis","export_indicator","openstaande_terugroepactie_indicator","vervaldatum_tachograaf","taxi_indicator","maximum_massa_samenstelling","aantal_rolstoelplaatsen","maximum_ondersteunende_snelheid","jaar_laatste_registratie_tellerstand","tellerstandoordeel","code_toelichting_tellerstandoordeel","tenaamstellen_mogelijk","vervaldatum_apk_dt","datum_tenaamstelling_dt","datum_eerste_toelating_dt","datum_eerste_tenaamstelling_in_nederland_dt","vervaldatum_tachograaf_dt","maximum_last_onder_de_vooras_sen_tezamen_koppeling","type_remsysteem_voertuig_code","rupsonderstelconfiguratiecode","wielbasis_voertuig_minimum","wielbasis_voertuig_maximum","lengte_voertuig_minimum","lengte_voertuig_maximum","breedte_voertuig_minimum","breedte_voertuig_maximum","hoogte_voertuig","hoogte_voertuig_minimum","hoogte_voertuig_maximum","massa_bedrijfsklaar_minimaal","massa_bedrijfsklaar_maximaal","technisch_toelaatbaar_massa_koppelpunt","maximum_massa_technisch_maximaal","maximum_massa_technisch_minimaal","subcategorie_nederland","verticale_belasting_koppelpunt_getrokken_voertuig","zuinigheidsclassificatie","registratie_datum_goedkeuring_afschrijvingsmoment_bpm","registratie_datum_goedkeuring_afschrijvingsmoment_bpm_dt","gem_lading_wrde","aerodyn_voorz","massa_alt_aandr","verl_cab_ind","api_gekentekende_voertuigen_assen","api_gekentekende_voertuigen_brandstof","api_gekentekende_voertuigen_carrosserie","api_gekentekende_voertuigen_carrosserie_specifiek","api_gekentekende_voertuigen_voertuigklasse"
"2ZLL97","Personenauto","MERCEDES-BENZ","C 250 BLUETEC 4MATIC","20250129","20210402","10791","stationwagen","5","BEIGE","Niet geregistreerd","4","2143","1610","2285","1710","750","1800","20150122","20150122","Geen verstrekking in Open Data","79136","Ja",,,,,,,"5","4","0","0",,"0","0","M1",,,"op dwarsbalk v. r. voorzitting","2285","204 K",,"e1*2001/116*0457*27","R204P1","NLAAB573","0","0.09","284","Nee","Nee",,"Nee","4145","0","0.00","2024","Logisch","00","Ja","2025-01-29T00:00:00.000","2021-04-02T00:00:00.000","2015-01-22T00:00:00.000","2015-01-22T00:00:00.000",,,,,,,,,,,,,,,,,,,,,"E",,,,,,,"https://opendata.rdw.nl/resource/3huj-srit.json","https://opendata.rdw.nl/resource/8ys7-d773.json","https://opendata.rdw.nl/resource/vezc-m2t6.json","https://opendata.rdw.nl/resource/jhie-znh9.json","https://opendata.rdw.nl/resource/kmfi-hrps.json"
"7XZK17","Personenauto","MERCEDES-BENZ","C 250 BLUETEC 4MATIC","20240705","20230706","9111","sedan","5","GRIJS","Niet geregistreerd","4","2143","1560","2225","1660","750","1800","20141205","20141205","Geen verstrekking in Open Data","67223","Ja",,,,,,,"4","4","0","0",,"0","0","M1",,,"op dwarsbalk v. r. voorzitting","2225","204",,"e1*2001/116*0431*32","R004P1","NZAAB521","0","0.09","284","Nee","Nee",,"Nee","4090","0","0.00","2023","Logisch","00","Ja","2024-07-05T00:00:00.000","2023-07-06T00:00:00.000","2014-12-05T00:00:00.000","2014-12-05T00:00:00.000",,,,,,,,,,,,,,,,,,,,,"D",,,,,,,"https://opendata.rdw.nl/resource/3huj-srit.json","https://opendata.rdw.nl/resource/8ys7-d773.json","https://opendata.rdw.nl/resource/vezc-m2t6.json","https://opendata.rdw.nl/resource/jhie-znh9.json","https://opendata.rdw.nl/resource/kmfi-hrps.json"
"7ZTF47","Personenauto","MERCEDES-BENZ","C 250 BLUETEC 4MATIC","20250215","20200225","10791","stationwagen","5","GRIJS","Niet geregistreerd","4","2143","1610","2285","1710","750","1800","20150326","20150326","Geen verstrekking in Open Data","87624","Ja",,,,,,,"5","4","0","0",,"0","0","M1",,,"op dwarsbalk v. r. voorzitting","2285","204 K",,"e1*2001/116*0457*27","R204P1","NLAAB573","0","0.09","284","Nee","Nee",,"Nee","4145","0","0.00","2024","Logisch","00","Nee","2025-02-15T00:00:00.000","2020-02-25T00:00:00.000","2015-03-26T00:00:00.000","2015-03-26T00:00:00.000",,,,,,,,,,,,,,,,,,,,,"E",,,,,,,"https://opendata.rdw.nl/resource/3huj-srit.json","https://opendata.rdw.nl/resource/8ys7-d773.json","https://opendata.rdw.nl/resource/vezc-m2t6.json","https://opendata.rdw.nl/resource/jhie-znh9.json","https://opendata.rdw.nl/resource/kmfi-hrps.json"
"9ZLH87","Personenauto","MERCEDES-BENZ","C 250 BLUETEC 4MATIC","20241125","20200615","10791","stationwagen","5","ZWART","Niet geregistreerd","4","2143","1610","2200","1710","750","1800","20150121","20150121","Geen verstrekking in Open Data","76274","Ja",,,,,,,"5","4","0","0",,"0","0","M1",,,"op dwarsbalk v. r. voorzitting","2285","204 K",,"e1*2001/116*0457*27","R204P1","NLAAB573","0","0.09","284","Nee","Nee",,"Nee","4000","0","0.00","2023","Logisch","00","Ja","2024-11-25T00:00:00.000","2020-06-15T00:00:00.000","2015-01-21T00:00:00.000","2015-01-21T00:00:00.000",,,,,,,,,,,,,,,,,,,,,"E",,,,,,,"https://opendata.rdw.nl/resource/3huj-srit.json","https://opendata.rdw.nl/resource/8ys7-d773.json","https://opendata.rdw.nl/resource/vezc-m2t6.json","https://opendata.rdw.nl/resource/jhie-znh9.json","https://opendata.rdw.nl/resource/kmfi-hrps.json"
"G387HJ","Personenauto","MERCEDES-BENZ","C 250 BLUETEC 4MATIC","20250516","20190928","2432","sedan","5","GRIJS","Niet geregistreerd","4","2143","1560","2225","1660","750","1800","20150421","20190928","Geen verstrekking in Open Data","71101","Ja","240",,,,,,"4","4","0","0",,"0","0","M1",,,,"2225","204",,"e1*2001/116*0431*35","R004P1","NLAAB574","0","0.09","284","Nee","Nee",,"Nee","4090","0","0.00","2024","Geen oordeel","05","Ja","2025-05-16T00:00:00.000","2019-09-28T00:00:00.000","2015-04-21T00:00:00.000","2019-09-28T00:00:00.000",,,,,,,,,,,,,,,,,,,,,"E",,,,,,,"https://opendata.rdw.nl/resource/3huj-srit.json","https://opendata.rdw.nl/resource/8ys7-d773.json","https://opendata.rdw.nl/resource/vezc-m2t6.json","https://opendata.rdw.nl/resource/jhie-znh9.json","https://opendata.rdw.nl/resource/kmfi-hrps.json"
"H881SX","Personenauto","MERCEDES-BENZ","C 250 BLUETEC 4MATIC","20241103","20240515","1364","sedan","5","WIT","Niet geregistreerd","4","2143","1560","2225","1660","750","1800","20140929","20200620","Geen verstrekking in Open Data","62101","Ja","240",,,,,,"4","4",,,,,,"M1",,,"r. bodemplaat by voorzitting","2225","204",,,,,,"0.09","284","Nee","Ja",,"Nee","4090",,,"2024","Geen oordeel","05","Ja","2024-11-03T00:00:00.000","2024-05-15T00:00:00.000","2014-09-29T00:00:00.000","2020-06-20T00:00:00.000",,,,,,,,,,,,,,,,,,,,,"E",,,,,,,"https://opendata.rdw.nl/resource/3huj-srit.json","https://opendata.rdw.nl/resource/8ys7-d773.json","https://opendata.rdw.nl/resource/vezc-m2t6.json","https://opendata.rdw.nl/resource/jhie-znh9.json","https://opendata.rdw.nl/resource/kmfi-hrps.json"
"HK906P","Personenauto","MERCEDES-BENZ","C 250 BLUETEC 4MATIC","20250328","20211213","6680","stationwagen","5","ZWART","Niet geregistreerd","4","2143","1610","2285","1710","750","1800","20150225","20151121","Geen verstrekking in Open Data","68437","Ja",,,,,,,"5","4","0","0",,"0","0","M1",,,"r. dwarsbalk by voorzitting","2285","204 K",,"e1*2001/116*0457*27","R204P1","NLAAB521","0","0.09","284","Nee","Nee",,"Nee","4145","0","0.00","2024","Geen oordeel","05","Ja","2025-03-28T00:00:00.000","2021-12-13T00:00:00.000","2015-02-25T00:00:00.000","2015-11-21T00:00:00.000",,,,,,,,,,,,,,,,,,,,,"D",,,,,,,"https://opendata.rdw.nl/resource/3huj-srit.json","https://opendata.rdw.nl/resource/8ys7-d773.json","https://opendata.rdw.nl/resource/vezc-m2t6.json","https://opendata.rdw.nl/resource/jhie-znh9.json","https://opendata.rdw.nl/resource/kmfi-hrps.json"
"J563SG","Personenauto","MERCEDES-BENZ","C 250 BLUETEC 4MATIC","20241109","20220812","2578","sedan","5","GRIJS","Niet geregistreerd","4","2143","1560","2225","1660","750","1800","20141111","20201106","Geen verstrekking in Open Data","72315","Ja","240",,,,,,"4","4","0","0",,"0","0","M1",,,,"2225","204",,"e1*2001/116*0431*32","R004P1","NZAAB574","0","0.09","284","Nee","Nee",,"Nee","4090","0","0.00","2023","Geen oordeel","05","Ja","2024-11-09T00:00:00.000","2022-08-12T00:00:00.000","2014-11-11T00:00:00.000","2020-11-06T00:00:00.000",,,,,,,,,,,,,,,,,,,,,"E",,,,,,,"https://opendata.rdw.nl/resource/3huj-srit.json","https://opendata.rdw.nl/resource/8ys7-d773.json","https://opendata.rdw.nl/resource/vezc-m2t6.json","https://opendata.rdw.nl/resource/jhie-znh9.json","https://opendata.rdw.nl/resource/kmfi-hrps.json"
"JB048R","Personenauto","MERCEDES-BENZ","C 250 BLUETEC 4MATIC","20250501","20230131","6667","sedan","5","GRIJS","Niet geregistreerd","4","2143","1560","2225","1660","750","1800","20150313","20160303","Geen verstrekking in Open Data","72859","Ja",,,,,,,"4","4","0","0",,"0","0","M1",,,"op dwarsbalk v. r. voorzitting","2225","204",,"e1*2001/116*0431*35","R004P1","NLAAB522","0","0.09","284","Nee","Nee",,"Nee","4090","0","0.00","2024","Geen oordeel","05","Ja","2025-05-01T00:00:00.000","2023-01-31T00:00:00.000","2015-03-13T00:00:00.000","2016-03-03T00:00:00.000",,,,,,,,,,,,,,,,,,,,,"E",,,,,,,"https://opendata.rdw.nl/resource/3huj-srit.json","https://opendata.rdw.nl/resource/8ys7-d773.json","https://opendata.rdw.nl/resource/vezc-m2t6.json","https://opendata.rdw.nl/resource/jhie-znh9.json","https://opendata.rdw.nl/resource/kmfi-hrps.json"
"K016SL","Personenauto","MERCEDES-BENZ","C 250 BLUETEC 4MATIC","20240920","20240304","1912","sedan","5","WIT","Niet geregistreerd","4","2143","1560","2225","1660","750","1800","20150423","20210227","Geen verstrekking in Open Data","69855","Ja","240",,,,,,"4","4","0","0",,"0","0","M1",,,,"2225","204",,"e1*2001/116*0431*35","R004P1","NLAAB572","0","0.09","284","Nee","Nee",,"Nee","4090","0","0.00","2024","Geen oordeel","05","Ja","2024-09-20T00:00:00.000","2024-03-04T00:00:00.000","2015-04-23T00:00:00.000","2021-02-27T00:00:00.000",,,,,,,,,,,,,,,,,,,,,"E",,,,,,,"https://opendata.rdw.nl/resource/3huj-srit.json","https://opendata.rdw.nl/resource/8ys7-d773.json","https://opendata.rdw.nl/resource/vezc-m2t6.json","https://opendata.rdw.nl/resource/jhie-znh9.json","https://opendata.rdw.nl/resource/kmfi-hrps.json"
"K253VX","Personenauto","MERCEDES-BENZ","C 250 BLUETEC 4MATIC","20240821","20210317","1484","stationwagen","5","ZWART","Niet geregistreerd","4","2143","1610","2285","1710","750","1800","20150407","20210317","Geen verstrekking in Open Data","64131","Ja","235",,,,,,"5","4","0","0",,"0","0","M1",,,"r. dwarsbalk by voorzitting","2285","204 K",,"e1*2001/116*0457*28","R204P1","NLAAB572","0","0.09","284","Nee","Ja",,"Nee","4145","0","0.00","2023","Geen oordeel","05","Ja","2024-08-21T00:00:00.000","2021-03-17T00:00:00.000","2015-04-07T00:00:00.000","2021-03-17T00:00:00.000",,,,,,,,,,,,,,,,,,,,,"E",,,,,,,"https://opendata.rdw.nl/resource/3huj-srit.json","https://opendata.rdw.nl/resource/8ys7-d773.json","https://opendata.rdw.nl/resource/vezc-m2t6.json","https://opendata.rdw.nl/resource/jhie-znh9.json","https://opendata.rdw.nl/resource/kmfi-hrps.json"
"KP884S","Personenauto","MERCEDES-BENZ","C 250 BLUETEC 4MATIC","20240720","20161027","4742","stationwagen","5","GRIJS","Niet geregistreerd","4","2143","1610","2285","1710","750","1800","20150415","20161027","Geen verstrekking in Open Data","85604","Ja",,,,,,,"5","4","0","0",,"0","0","M1",,,"r. dwarsbalk by voorzitting","2285","204 K",,"e1*2001/116*0457*28","R204P1","NLAAB572","0","0.09","284","Nee","Ja",,"Nee","4145","0","0.00","2023","Geen oordeel","05","Ja","2024-07-20T00:00:00.000","2016-10-27T00:00:00.000","2015-04-15T00:00:00.000","2016-10-27T00:00:00.000",,,,,,,,,,,,,,,,,,,,,"E",,,,,,,"https://opendata.rdw.nl/resource/3huj-srit.json","https://opendata.rdw.nl/resource/8ys7-d773.json","https://opendata.rdw.nl/resource/vezc-m2t6.json","https://opendata.rdw.nl/resource/jhie-znh9.json","https://opendata.rdw.nl/resource/kmfi-hrps.json"
"L672DK","Personenauto","MERCEDES-BENZ","C 250 BLUETEC 4MATIC","20250116","20210706","10593","stationwagen","5","BLAUW","Niet geregistreerd","4","2143","1610","2285","1710","750","1800","20150522","20210706","Geen verstrekking in Open Data","58995","Ja","235",,,,,,"5","4","0","0",,"0","184","M1",,,"r. dwarsbalk by voorzitting","2285","204 K",,"e1*2001/116*0457*28","R204P1","NLAAB572","0","0.09","284","Nee","Ja",,"Nee","4145","0","0.00","2023","Geen oordeel","05","Ja","2025-01-16T00:00:00.000","2021-07-06T00:00:00.000","2015-05-22T00:00:00.000","2021-07-06T00:00:00.000",,,,,,,,,,,"147",,,,,,,,,,,,,,,,,"https://opendata.rdw.nl/resource/3huj-srit.json","https://opendata.rdw.nl/resource/8ys7-d773.json","https://opendata.rdw.nl/resource/vezc-m2t6.json","https://opendata.rdw.nl/resource/jhie-znh9.json","https://opendata.rdw.nl/resource/kmfi-hrps.json"
"NJ648Z","Personenauto","MERCEDES-BENZ","C 250 BLUETEC 4MATIC","20250224","20170419","2848","sedan","5","GRIJS","Niet geregistreerd","4","2143","1560","2225","1660","750","1800","20150224","20170213","Geen verstrekking in Open Data","72548","Ja",,,,,,,"4","4","0","0",,"0","0","M1",,,"op dwarsbalk v. r. voorzitting","2225","204",,"e1*2001/116*0431*34","R004P1","NLAAA501","0","0.09","284","Nee","Nee",,"Nee","4090","0","0.00","2024","Geen oordeel","05","Ja","2025-02-24T00:00:00.000","2017-04-19T00:00:00.000","2015-02-24T00:00:00.000","2017-02-13T00:00:00.000",,,,,,,,,,,,,,,,,,,,,"D",,,,,,,"https://opendata.rdw.nl/resource/3huj-srit.json","https://opendata.rdw.nl/resource/8ys7-d773.json","https://opendata.rdw.nl/resource/vezc-m2t6.json","https://opendata.rdw.nl/resource/jhie-znh9.json","https://opendata.rdw.nl/resource/kmfi-hrps.json"
"NN833T","Personenauto","MERCEDES-BENZ","C 250 BLUETEC 4MATIC","20250326","20181205","7316","stationwagen","5","ZWART","Niet geregistreerd","4","2143","1610","2285","1710","750","1800","20150326","20170316","Geen verstrekking in Open Data","73286","Ja",,,,,,,"5","4","0","0",,"0","0","M1",,,"r. dwarsbalk by voorzitting","2285","204 K",,"e1*2001/116*0457*28","R204P1","NLAAB514","0","0.09","284","Nee","Nee",,"Nee","4145","0","0.00","2024","Geen oordeel","05","Ja","2025-03-26T00:00:00.000","2018-12-05T00:00:00.000","2015-03-26T00:00:00.000","2017-03-16T00:00:00.000",,,,,,,,,,,,,,,,,,,,,"E",,,,,,,"https://opendata.rdw.nl/resource/3huj-srit.json","https://opendata.rdw.nl/resource/8ys7-d773.json","https://opendata.rdw.nl/resource/vezc-m2t6.json","https://opendata.rdw.nl/resource/jhie-znh9.json","https://opendata.rdw.nl/resource/kmfi-hrps.json"
"NZ485X","Personenauto","MERCEDES-BENZ","C 250 BLUETEC 4MATIC","20250215","20240227","1115","stationwagen","5","GRIJS","Niet geregistreerd","4","2143","1610","2285","1710","750","1800","20150512","20170606","Geen verstrekking in Open Data","71313","Ja",,,,,,,"5","4","0","0",,"0","0","M1",,,"r. dwarsbalk by voorzitting","2285","204 K",,"e1*2001/116*0457*28","R204P1","NLAAB522","0","0.09","284","Nee","Nee",,"Nee","4145","0","0.00","2024","Geen oordeel","05","Ja","2025-02-15T00:00:00.000","2024-02-27T00:00:00.000","2015-05-12T00:00:00.000","2017-06-06T00:00:00.000",,,,,,,,,,,,,,,,,,,,,"E",,,,,,,"https://opendata.rdw.nl/resource/3huj-srit.json","https://opendata.rdw.nl/resource/8ys7-d773.json","https://opendata.rdw.nl/resource/vezc-m2t6.json","https://opendata.rdw.nl/resource/jhie-znh9.json","https://opendata.rdw.nl/resource/kmfi-hrps.json"
"P470ZX","Personenauto","MERCEDES-BENZ","C 250 BLUETEC 4MATIC","20250426","20220715","5191","stationwagen","5","ZWART","Niet geregistreerd","4","2143","1610","2285","1710","750","1800","20150602","20220715","Geen verstrekking in Open Data","73684","Nee","235",,,,,,"5","4",,,,,,"M1",,,,"2285","204 K",,"e1*2001/116*0457*28","R204P1","NLAAB531","0","0.09","284","Nee","Nee",,"Nee","4145",,,"2024","Geen oordeel","05","Ja","2025-04-26T00:00:00.000","2022-07-15T00:00:00.000","2015-06-02T00:00:00.000","2022-07-15T00:00:00.000",,,,,,,,,,,,,,,,,,,,,,"20220705","2022-07-05T00:00:00.000",,,,,"https://opendata.rdw.nl/resource/3huj-srit.json","https://opendata.rdw.nl/resource/8ys7-d773.json","https://opendata.rdw.nl/resource/vezc-m2t6.json","https://opendata.rdw.nl/resource/jhie-znh9.json","https://opendata.rdw.nl/resource/kmfi-hrps.json"
"PG514G","Personenauto","MERCEDES-BENZ","C 250 BLUETEC 4MATIC","20250329","20190226","1140","sedan","5","ZWART","Niet geregistreerd","4","2143","1560","2225","1660","750","1800","20150422","20170616","Geen verstrekking in Open Data","74034","Ja",,,,,,,"4","4","0","0",,"0","0","M1",,,"r. bodemplaat by voorzitting","2225","204",,"e1*2001/116*0431*35","R004P1","NLAAB574","0","0.09","284","Nee","Nee",,"Nee","4090","0","0.00","2024","Geen oordeel","05","Ja","2025-03-29T00:00:00.000","2019-02-26T00:00:00.000","2015-04-22T00:00:00.000","2017-06-16T00:00:00.000",,,,,,,,,,,,,,,,,,,,,"E",,,,,,,"https://opendata.rdw.nl/resource/3huj-srit.json","https://opendata.rdw.nl/resource/8ys7-d773.json","https://opendata.rdw.nl/resource/vezc-m2t6.json","https://opendata.rdw.nl/resource/jhie-znh9.json","https://opendata.rdw.nl/resource/kmfi-hrps.json"
"PZ371N","Personenauto","MERCEDES-BENZ","C 250 BLUETEC 4MATIC","20240628","20171009","5325","stationwagen","5","ZWART","Niet geregistreerd","4","2143","1610","2285","1710","750","1800","20150528","20171009","Geen verstrekking in Open Data","71683","Ja",,,,,,,"5","4","0","0",,"0","0","M1",,,"r. dwarsbalk by voorzitting","2285","204 K",,"e1*2001/116*0457*28","R204P1","NLAAB521","0","0.09","284","Nee","Nee",,"Nee","4145","0","0.00","2023","Geen oordeel","05","Ja","2024-06-28T00:00:00.000","2017-10-09T00:00:00.000","2015-05-28T00:00:00.000","2017-10-09T00:00:00.000",,,,,,,,,,,,,,,,,,,,,"D",,,,,,,"https://opendata.rdw.nl/resource/3huj-srit.json","https://opendata.rdw.nl/resource/8ys7-d773.json","https://opendata.rdw.nl/resource/vezc-m2t6.json","https://opendata.rdw.nl/resource/jhie-znh9.json","https://opendata.rdw.nl/resource/kmfi-hrps.json"
"R404LG","Personenauto","MERCEDES-BENZ","C 250 BLUETEC 4MATIC","20250314","20220929","845","stationwagen","5","GRIJS","Niet geregistreerd","4","2143","1610","2285","1710","750","1800","20150226","20220929","Geen verstrekking in Open Data","74484","Ja","235",,,,,,"5","4","0","0",,"0","0","M1",,,"r. dwarsbalk by voorzitting","2285","204 K",,"e1*2001/116*0457*27","R204P1","NLAAB573","0","0.09","284","Nee","Nee",,"Ja","4145","0","0.00","2024","Geen oordeel","05","Ja","2025-03-14T00:00:00.000","2022-09-29T00:00:00.000","2015-02-26T00:00:00.000","2022-09-29T00:00:00.000",,,,,,,,,,,,,,,,,,,,,,"20220926","2022-09-26T00:00:00.000",,,,,"https://opendata.rdw.nl/resource/3huj-srit.json","https://opendata.rdw.nl/resource/8ys7-d773.json","https://opendata.rdw.nl/resource/vezc-m2t6.json","https://opendata.rdw.nl/resource/jhie-znh9.json","https://opendata.rdw.nl/resource/kmfi-hrps.json"
"RD801J","Personenauto","MERCEDES-BENZ","C 250 BLUETEC 4MATIC","20250524","20220407","6644","stationwagen","5","BLAUW","Niet geregistreerd","4","2143","1610","2285","1710","750","1800","20150514","20171028","Geen verstrekking in Open Data","72551","Ja",,,,,,,"5","4","0","0",,"0","0","M1",,,"r. dwarsbalk by voorzitting","2285","204 K",,"e1*2001/116*0457*27","R204P1","NLAAA543","0","0.09","284","Nee","Nee",,"Nee","4145","0","0.00","2024","Geen oordeel","05","Ja","2025-05-24T00:00:00.000","2022-04-07T00:00:00.000","2015-05-14T00:00:00.000","2017-10-28T00:00:00.000",,,,,,,,,,,,,,,,,,,,,"E",,,,,,,"https://opendata.rdw.nl/resource/3huj-srit.json","https://opendata.rdw.nl/resource/8ys7-d773.json","https://opendata.rdw.nl/resource/vezc-m2t6.json","https://opendata.rdw.nl/resource/jhie-znh9.json","https://opendata.rdw.nl/resource/kmfi-hrps.json"
"RS742R","Personenauto","MERCEDES-BENZ","C 250 BLUETEC 4MATIC","20250124","20180123","8541","stationwagen","5","ZWART","Niet geregistreerd","4","2143","1610","2285","1710","750","1800","20150106","20180123","Geen verstrekking in Open Data","73048","Ja",,,,,,,"5","4","0","0",,"0","0","M1",,,"op dwarsbalk v. r. voorzitting","2285","204 K",,"e1*2001/116*0457*27","R204P1","NLAAB574","0","0.09","284","Nee","Nee",,"Nee","4145","0","0.00","2024","Geen oordeel","05","Ja","2025-01-24T00:00:00.000","2018-01-23T00:00:00.000","2015-01-06T00:00:00.000","2018-01-23T00:00:00.000",,,,,,,,,,,,,,,,,,,,,"E",,,,,,,"https://opendata.rdw.nl/resource/3huj-srit.json","https://opendata.rdw.nl/resource/8ys7-d773.json","https://opendata.rdw.nl/resource/vezc-m2t6.json","https://opendata.rdw.nl/resource/jhie-znh9.json","https://opendata.rdw.nl/resource/kmfi-hrps.json"
"RV465N","Personenauto","MERCEDES-BENZ","C 250 BLUETEC 4MATIC","20250105","20211121","8478","sedan","5","ZWART","Niet geregistreerd","4","2143","1560","2225","1660","750","1800","20141111","20180209","Geen verstrekking in Open Data","72175","Ja",,,,,,,"4","4","0","0",,"0","0","M1",,,"r. bodemplaat by voorzitting","2225","204",,"e1*2001/116*0431*32","R004P1","NZAAB574","0","0.09","284","Nee","Nee",,"Nee","4090","0","0.00","2024","Geen oordeel","05","Ja","2025-01-05T00:00:00.000","2021-11-21T00:00:00.000","2014-11-11T00:00:00.000","2018-02-09T00:00:00.000",,,,,,,,,,,,,,,,,,,,,"E",,,,,,,"https://opendata.rdw.nl/resource/3huj-srit.json","https://opendata.rdw.nl/resource/8ys7-d773.json","https://opendata.rdw.nl/resource/vezc-m2t6.json","https://opendata.rdw.nl/resource/jhie-znh9.json","https://opendata.rdw.nl/resource/kmfi-hrps.json"
"RX487K","Personenauto","MERCEDES-BENZ","C 250 BLUETEC 4MATIC","20250411","20180404","1060","stationwagen","5","GRIJS","Niet geregistreerd","4","2143","1610","2285","1710","750","1800","20150320","20180404","Geen verstrekking in Open Data","63139","Ja",,,,,,,"5","4","0","0",,"0","0","M1",,,"op dwarsbalk v. r. voorzitting","2285","204 K",,"e1*2001/116*0457*28","R204P1","NLAAB521","0","0.09","284","Nee","Nee",,"Nee","4145","0","0.00","2024","Geen oordeel","05","Ja","2025-04-11T00:00:00.000","2018-04-04T00:00:00.000","2015-03-20T00:00:00.000","2018-04-04T00:00:00.000",,,,,,,,,,,,,,,,,,,,,"D",,,,,,,"https://opendata.rdw.nl/resource/3huj-srit.json","https://opendata.rdw.nl/resource/8ys7-d773.json","https://opendata.rdw.nl/resource/vezc-m2t6.json","https://opendata.rdw.nl/resource/jhie-znh9.json","https://opendata.rdw.nl/resource/kmfi-hrps.json"
"SG992L","Personenauto","MERCEDES-BENZ","C 250 BLUETEC 4MATIC","20250322","20240322","7059","stationwagen","5","GRIJS","Niet geregistreerd","4","2143","1610","2285","1710","750","1800","20150625","20180328","Geen verstrekking in Open Data","75329","Ja",,,,,,,"5","4","0","0",,"0","0","M1",,,"r. dwarsbalk by voorzitting","2285","204 K",,"e1*2001/116*0457*28","R204P1","NLAAB572","0","0.09","284","Nee","Nee",,"Nee","4145","0","0.00","2024","Geen oordeel","05","Ja","2025-03-22T00:00:00.000","2024-03-22T00:00:00.000","2015-06-25T00:00:00.000","2018-03-28T00:00:00.000",,,,,,,,,,,,,,,,,,,,,"E",,,,,,,"https://opendata.rdw.nl/resource/3huj-srit.json","https://opendata.rdw.nl/resource/8ys7-d773.json","https://opendata.rdw.nl/resource/vezc-m2t6.json","https://opendata.rdw.nl/resource/jhie-znh9.json","https://opendata.rdw.nl/resource/kmfi-hrps.json"