"kenteken","voertuigsoort","merk","handelsbenaming","vervaldatum_apk","datum_tenaamstelling","bruto_bpm","inrichting","aantal_zitplaatsen","eerste_kleur","tweede_kleur","aantal_cilinders","cilinderinhoud","massa_ledig_voertuig","toegestane_maximum_massa_voertuig","massa_rijklaar","maximum_massa_trekken_ongeremd","maximum_trekken_massa_geremd","datum_eerste_toelating","datum_eerste_tenaamstelling_in_nederland","wacht_op_keuren","catalogusprijs","wam_verzekerd","maximale_constructiesnelheid","laadvermogen","oplegger_geremd","aanhangwagen_autonoom_geremd","aanhangwagen_middenas_geremd","aantal_staanplaatsen","aantal_deuren","aantal_wielen","afstand_hart_koppeling_tot_achterzijde_voertuig","afstand_voorzijde_voertuig_tot_hart_koppeling","afwijkende_maximum_snelheid","lengte","breedte","europese_voertuigcategorie","europese_voertuigcategorie_toevoeging","europese_uitvoeringcategorie_toevoeging","plaats_chassisnummer","technische_max_massa_voertuig","type","type_gasinstallatie","typegoedkeuringsnummer","variant","uitvoering","volgnummer_wijziging_eu_typegoedkeuring","vermogen_massarijklaar","wielbasis","export_indicator","openstaande_terugroepactie_indicator","vervaldatum_tachograaf","taxi_indicator","maximum_massa_samenstelling","aantal_rolstoelplaatsen","maximum_ondersteunende_snelheid","jaar_laatste_registratie_tellerstand","tellerstandoordeel","code_toelichting_tellerstandoordeel","tenaamstellen_mogelijk","vervaldatum_apk_dt","datum_tenaamstelling_dt","datum_eerste_toelating_dt","datum_eerste_tenaamstelling_in_nederland_dt","vervaldatum_tachograaf_dt","maximum_last_onder_de_vooras_sen_tezamen_koppeling","type_remsysteem_voertuig_code","rupsonderstelconfiguratiecode","wielbasis_voertuig_minimum","wielbasis_voertuig_maximum","lengte_voertuig_minimum","lengte_voertuig_maximum","breedte_voertuig_minimum","breedte_voertuig_maximum","hoogte_voertuig","hoogte_voertuig_minimum","hoogte_voertuig_maximum","massa_bedrijfsklaar_minimaal","massa_bedrijfsklaar_maximaal","technisch_toelaatbaar_massa_koppelpunt","maximum_massa_technisch_maximaal","maximum_massa_technisch_minimaal","subcategorie_nederland","verticale_belasting_koppelpunt_getrokken_voertuig","zuinigheidsclassificatie","registratie_datum_goedkeuring_afschrijvingsmoment_bpm","registratie_datum_goedkeuring_afschrijvingsmoment_bpm_dt","gem_lading_wrde","aerodyn_voorz","massa_alt_aandr","verl_cab_ind","api_gekentekende_voertuigen_assen","api_gekentekende_voertuigen_brandstof","api_gekentekende_voertuigen_carrosserie","api_gekentekende_voertuigen_carrosserie_specifiek","api_gekentekende_voertuigen_voertuigklasse"
"5XZF87","Personenauto","MASERATI","QUATTROPORTE DIESEL","20250305","20240308","15875","sedan","5","GRIJS","Niet geregistreerd","6","2987","1920","2540","2020",,,"20141121","20141121","Geen verstrekking in Open Data","119561","Ja",,,,,,,"4","4","0","0",,"526","0","M1",,,"r. bodemplaat by voorzitting","2540","M156",,"e3*2007/46*0224*04","6D2","5H","0","0.10","317","Nee","Ja",,"Nee","0","0",,"2024","Logisch","00","Ja","2025-03-05T00:00:00.000","2024-03-08T00:00:00.000","2014-11-21T00:00:00.000","2014-11-21T00:00:00.000",,,,,,,,,,,,,,,,,,,,,"B",,,,,,,"https://opendata.rdw.nl/resource/3huj-srit.json","https://opendata.rdw.nl/resource/8ys7-d773.json","https://opendata.rdw.nl/resource/vezc-m2t6.json","https://opendata.rdw.nl/resource/jhie-znh9.json","https://opendata.rdw.nl/resource/kmfi-hrps.json"
"9THG65","Personenauto","MASERATI","QUATTROPORTE DIESEL","20250305","20230918","15875","sedan","5","BLAUW","Niet geregistreerd","6","2987","1920","2540","2020",,,"20140206","20140206","Geen verstrekking in Open Data","127758","Ja",,,,,,,"4","4","0","0",,"526","0","M1",,,"r. bodemplaat by voorzitting","2540","M156",,"e3*2007/46*0224*04","6D2","5H","0","0.10","317","Nee","Ja",,"Nee","0","0",,"2024","Logisch","00","Ja","2025-03-05T00:00:00.000","2023-09-18T00:00:00.000","2014-02-06T00:00:00.000","2014-02-06T00:00:00.000",,,,,,,,,,,,,,,,,,,,,"B",,,,,,,"https://opendata.rdw.nl/resource/3huj-srit.json","https://opendata.rdw.nl/resource/8ys7-d773.json","https://opendata.rdw.nl/resource/vezc-m2t6.json","https://opendata.rdw.nl/resource/jhie-znh9.json","https://opendata.rdw.nl/resource/kmfi-hrps.json"
"9XKB21","Personenauto","MASERATI","QUATTROPORTE DIESEL","20250202","20140829","15875","sedan","5","BLAUW","Niet geregistreerd","6","2987","1920","2540","2020",,,"20140829","20140829","Geen verstrekking in Open Data","115439","Ja",,,,,,,"4","4","0","0",,"526","0","M1",,,"r. bodemplaat by voorzitting","2540","M156",,"e3*2007/46*0224*04","6D2","5H","0","0.10","317","Nee","Ja",,"Nee","0","0",,"2024","Logisch","00","Ja","2025-02-02T00:00:00.000","2014-08-29T00:00:00.000","2014-08-29T00:00:00.000","2014-08-29T00:00:00.000",,,,,,,,,,,,,,,,,,,,,"B",,,,,,,"https://opendata.rdw.nl/resource/3huj-srit.json","https://opendata.rdw.nl/resource/8ys7-d773.json","https://opendata.rdw.nl/resource/vezc-m2t6.json","https://opendata.rdw.nl/resource/jhie-znh9.json","https://opendata.rdw.nl/resource/kmfi-hrps.json"
"9XNX21","Personenauto","MASERATI","QUATTROPORTE DIESEL","20240823","20240329","15875","sedan","5","ZWART","Niet geregistreerd","6","2987","1920","2540","2020",,,"20140925","20140925","Geen verstrekking in Open Data","135103","Nee",,,,,,,"4","4","0","0",,"526","0","M1",,,"r. bodemplaat by voorzitting","2540","M156",,"e3*2007/46*0224*04","6D2","5H","0","0.10","317","Nee","Ja",,"Nee","0","0",,"2024","Logisch","00","Ja","2024-08-23T00:00:00.000","2024-03-29T00:00:00.000","2014-09-25T00:00:00.000","2014-09-25T00:00:00.000",,,,,,,,,,,,,,,,,,,,,"B",,,,,,,"https://opendata.rdw.nl/resource/3huj-srit.json","https://opendata.rdw.nl/resource/8ys7-d773.json","https://opendata.rdw.nl/resource/vezc-m2t6.json","https://opendata.rdw.nl/resource/jhie-znh9.json","https://opendata.rdw.nl/resource/kmfi-hrps.json"
"9XTJ57","Personenauto","MASERATI","QUATTROPORTE DIESEL","20250121","20210604","11076","sedan","5","ZWART","Niet geregistreerd","6","2987","1920","2540","2020",,,"20140220","20141101","Geen verstrekking in Open Data","127147","Ja",,,,,,,"4","4","0","0",,"526","0","M1",,,"r. bodemplaat by voorzitting","2540","M156",,"e3*2007/46*0224*04","6D2","5H","0","0.10","317","Nee","Ja",,"Nee","0","0",,"2024","Geen oordeel","05","Ja","2025-01-21T00:00:00.000","2021-06-04T00:00:00.000","2014-02-20T00:00:00.000","2014-11-01T00:00:00.000",,"0",,,,,,,,,,,,,,,,,,,"B",,,,,,,"https://opendata.rdw.nl/resource/3huj-srit.json","https://opendata.rdw.nl/resource/8ys7-d773.json","https://opendata.rdw.nl/resource/vezc-m2t6.json","https://opendata.rdw.nl/resource/jhie-znh9.json","https://opendata.rdw.nl/resource/kmfi-hrps.json"
"G934KX","Personenauto","MASERATI","QUATTROPORTE DIESEL","20250624","20191018","10895","sedan","5","GRIJS","Niet geregistreerd","6","2987","1920","2540","2020",,,"20150930","20191018","Geen verstrekking in Open Data","117931","Ja","250",,,,,,"4","4",,,,"526","195","M1",,,"r. bodemplaat by voorzitting","2540","M156",,,,,,"0.10","317","Nee","Nee",,"Nee",,,,"2024","Onlogisch","04","Ja","2025-06-24T00:00:00.000","2019-10-18T00:00:00.000","2015-09-30T00:00:00.000","2019-10-18T00:00:00.000",,,,,,,,,,,"148",,,,,,,,,,,,,,,,,"https://opendata.rdw.nl/resource/3huj-srit.json","https://opendata.rdw.nl/resource/8ys7-d773.json","https://opendata.rdw.nl/resource/vezc-m2t6.json","https://opendata.rdw.nl/resource/jhie-znh9.json","https://opendata.rdw.nl/resource/kmfi-hrps.json"
"GF903Z","Personenauto","MASERATI","QUATTROPORTE DIESEL","20250508","20160518","16848","sedan","5","GRIJS","Niet geregistreerd","6","2987","1920","2540","2020",,,"20150508","20150508","Geen verstrekking in Open Data","79700","Ja",,,,,,,"4","4","0","0",,"526","0","M1",,,"r. bodemplaat by voorzitting","2540","M156",,"e3*2007/46*0224*04","6D2","5H","0","0.10","317","Nee","Ja",,"Nee","0","0",,"2024","Logisch","00","Ja","2025-05-08T00:00:00.000","2016-05-18T00:00:00.000","2015-05-08T00:00:00.000","2015-05-08T00:00:00.000",,,,,,,,,,,,,,,,,,,,,"B",,,,,,,"https://opendata.rdw.nl/resource/3huj-srit.json","https://opendata.rdw.nl/resource/8ys7-d773.json","https://opendata.rdw.nl/resource/vezc-m2t6.json","https://opendata.rdw.nl/resource/jhie-znh9.json","https://opendata.rdw.nl/resource/kmfi-hrps.json"
"H875VS","Personenauto","MASERATI","QUATTROPORTE DIESEL","20240719","20230810","1164","sedan","5","ZWART","Niet geregistreerd","6","2987","1920","2540","2020",,,"20150807","20200605","Geen verstrekking in Open Data","132209","Ja","250",,,,,,"4","4","0","0",,"526","195","M1",,,"r. bodemplaat by voorzitting","2540","M156",,"e3*2007/46*0224*04","6D2","5H","0","0.10","317","Nee","Nee",,"Nee","0","0",,"2023","Geen oordeel","05","Ja","2024-07-19T00:00:00.000","2023-08-10T00:00:00.000","2015-08-07T00:00:00.000","2020-06-05T00:00:00.000",,,,,,,,,,,"148",,,,,,,,,,"B",,,,,,,"https://opendata.rdw.nl/resource/3huj-srit.json","https://opendata.rdw.nl/resource/8ys7-d773.json","https://opendata.rdw.nl/resource/vezc-m2t6.json","https://opendata.rdw.nl/resource/jhie-znh9.json","https://opendata.rdw.nl/resource/kmfi-hrps.json"
"HT896X","Personenauto","MASERATI","QUATTROPORTE DIESEL","20250417","20221124","13591","sedan","5","ZWART","Niet geregistreerd","6","2987","1920","2540","2020",,,"20140910","20151230","Geen verstrekking in Open Data","127389","Ja",,,,,,,"4","4","0","0",,"526","0","M1",,,"r. bodemplaat by voorzitting","2540","M156",,"e3*2007/46*0224*04","6D2","5H","0","0.10","317","Nee","Ja",,"Nee","0","0",,"2024","Geen oordeel","05","Ja","2025-04-17T00:00:00.000","2022-11-24T00:00:00.000","2014-09-10T00:00:00.000","2015-12-30T00:00:00.000",,,,,,,,,,,,,,,,,,,,,"B",,,,,,,"https://opendata.rdw.nl/resource/3huj-srit.json","https://opendata.rdw.nl/resource/8ys7-d773.json","https://opendata.rdw.nl/resource/vezc-m2t6.json","https://opendata.rdw.nl/resource/jhie-znh9.json","https://opendata.rdw.nl/resource/kmfi-hrps.json"
"HV093T","Personenauto","MASERATI","QUATTROPORTE DIESEL","20250217","20210208","16848","sedan","5","GRIJS","Niet geregistreerd","6","2987","1960","2540","2060",,,"20160122","20160122","Geen verstrekking in Open Data","134155","Ja",,,,,,,"4","4","0","0",,"526","0","M1",,,"r. bodemplaat by voorzitting","2540","M156",,"e3*2007/46*0224*06","6D2","5HW","0","0.10","317","Nee","Ja",,"Nee","0","0","0.00","2024","Onlogisch","04","Ja","2025-02-17T00:00:00.000","2021-02-08T00:00:00.000","2016-01-22T00:00:00.000","2016-01-22T00:00:00.000",,,,,,,,,,,,,,,,,,,,,"B",,,,,,,"https://opendata.rdw.nl/resource/3huj-srit.json","https://opendata.rdw.nl/resource/8ys7-d773.json","https://opendata.rdw.nl/resource/vezc-m2t6.json","https://opendata.rdw.nl/resource/jhie-znh9.json","https://opendata.rdw.nl/resource/kmfi-hrps.json"
"J762KG","Personenauto","MASERATI","QUATTROPORTE DIESEL","20241223","20200821","11449","sedan","5","BLAUW","Niet geregistreerd","6","2987","1960","2540","2060",,,"20171221","20200821","Geen verstrekking in Open Data","139969","Ja","252",,,,,,"4","4",,,,"527","195","M1",,,,"2540","M156",,"e3*2007/46*0224*10","6D2","5HW","2","0.10","317","Nee","Nee",,"Nee",,,,"2024","Geen oordeel","05","Ja","2024-12-23T00:00:00.000","2020-08-21T00:00:00.000","2017-12-21T00:00:00.000","2020-08-21T00:00:00.000",,,,,,,,,,,"148",,,,,,,,,,"B",,,,,,,"https://opendata.rdw.nl/resource/3huj-srit.json","https://opendata.rdw.nl/resource/8ys7-d773.json","https://opendata.rdw.nl/resource/vezc-m2t6.json","https://opendata.rdw.nl/resource/jhie-znh9.json","https://opendata.rdw.nl/resource/kmfi-hrps.json"
"JG394L","Personenauto","MASERATI","QUATTROPORTE DIESEL","20240222","20230712","15875","sedan","4","ZWART","Niet geregistreerd","6","2987","1920","2540","2020",,,"20140508","20160308","Geen verstrekking in Open Data","133777","Ja",,,,,,,"4","4","0","0",,"526","0","M1",,,"r. bodemplaat by voorzitting","2540","M156",,"e3*2007/46*0224*04","6D2","4H","0","0.10","317","Nee","Nee",,"Nee","0","0","0.00","2023","Geen oordeel","05","Ja","2024-02-22T00:00:00.000","2023-07-12T00:00:00.000","2014-05-08T00:00:00.000","2016-03-08T00:00:00.000",,,,,,,,,,,,,,,,,,,,,"B",,,,,,,"https://opendata.rdw.nl/resource/3huj-srit.json","https://opendata.rdw.nl/resource/8ys7-d773.json","https://opendata.rdw.nl/resource/vezc-m2t6.json","https://opendata.rdw.nl/resource/jhie-znh9.json","https://opendata.rdw.nl/resource/kmfi-hrps.json"
"JK419H","Personenauto","MASERATI","QUATTROPORTE DIESEL","20250506","20220614","18797","sedan","5","ZWART","Niet geregistreerd","6","2987","1960","2540","2060",,,"20160409","20160409","Geen verstrekking in Open Data","131515","Ja",,,,,,,"4","4","0","0",,"526","195","M1",,,"onder r. voorzitting","2540","M156",,"e3*2007/46*0224*06","6D2","5HW","0","0.10","317","Nee","Ja",,"Nee","2540","0","0.00","2024","Logisch","00","Ja","2025-05-06T00:00:00.000","2022-06-14T00:00:00.000","2016-04-09T00:00:00.000","2016-04-09T00:00:00.000",,,,,,,,,,,"148",,,,,,,,,,"B",,,,,,,"https://opendata.rdw.nl/resource/3huj-srit.json","https://opendata.rdw.nl/resource/8ys7-d773.json","https://opendata.rdw.nl/resource/vezc-m2t6.json","https://opendata.rdw.nl/resource/jhie-znh9.json","https://opendata.rdw.nl/resource/kmfi-hrps.json"
"KL699R","Personenauto","MASERATI","QUATTROPORTE DIESEL","20241113","20200825","15757","sedan","5","BLAUW","Niet geregistreerd","6","2987","1920","2540","2020",,,"20151029","20161014","Geen verstrekking in Open Data","117848","Ja",,,,,,,"4","4","0","0",,"526","0","M1",,,"r. bodemplaat by voorzitting","2540","M156",,"e3*2007/46*0224*04","6D2","5H","0","0.10","317","Nee","Ja",,"Nee","0","0",,"2023","Geen oordeel","05","Ja","2024-11-13T00:00:00.000","2020-08-25T00:00:00.000","2015-10-29T00:00:00.000","2016-10-14T00:00:00.000",,,,,,,,,,,,,,,,,,,,,"B",,,,,,,"https://opendata.rdw.nl/resource/3huj-srit.json","https://opendata.rdw.nl/resource/8ys7-d773.json","https://opendata.rdw.nl/resource/vezc-m2t6.json","https://opendata.rdw.nl/resource/jhie-znh9.json","https://opendata.rdw.nl/resource/kmfi-hrps.json"
"N389PX","Personenauto","MASERATI","QUATTROPORTE DIESEL","20221213","20231110","1446","sedan","5","ZWART","Niet geregistreerd","6","2987","1920","2540","2020",,,"20140516","20211202","Geen verstrekking in Open Data","124327","Nee","250",,,,,,"4","4","0","0",,"526","195","M1",,,,"2540","M156",,"e3*2007/46*0224*04","6D2","4H","0","0.10","317","Nee","Nee",,"Nee","0","0","0.00","2021","Geen oordeel","05","Ja","2022-12-13T00:00:00.000","2023-11-10T00:00:00.000","2014-05-16T00:00:00.000","2021-12-02T00:00:00.000",,,,,,,,,,,"148",,,,,,,,,,,"20211201","2021-12-01T00:00:00.000",,,,,"https://opendata.rdw.nl/resource/3huj-srit.json","https://opendata.rdw.nl/resource/8ys7-d773.json","https://opendata.rdw.nl/resource/vezc-m2t6.json","https://opendata.rdw.nl/resource/jhie-znh9.json","https://opendata.rdw.nl/resource/kmfi-hrps.json"
"NF576B","Personenauto","MASERATI","QUATTROPORTE DIESEL","20240315","20230316","18797","sedan","5","BLAUW","Niet geregistreerd","6","2987","1960","2540","2060",,,"20170102","20170102","Geen verstrekking in Open Data","139005","Nee",,,,,,,"4","4","0","0",,"527","195","M1",,,"onder r. voorzitting","2540","M156",,"e3*2007/46*0224*09","6D2","5HW","0","0.10","317","Nee","Nee",,"Nee","0","0","0.00","2023","Logisch","00","Nee","2024-03-15T00:00:00.000","2023-03-16T00:00:00.000","2017-01-02T00:00:00.000","2017-01-02T00:00:00.000",,,,,,,,,,,"148",,,,,,,,,,"B",,,,,,,"https://opendata.rdw.nl/resource/3huj-srit.json","https://opendata.rdw.nl/resource/8ys7-d773.json","https://opendata.rdw.nl/resource/vezc-m2t6.json","https://opendata.rdw.nl/resource/jhie-znh9.json","https://opendata.rdw.nl/resource/kmfi-hrps.json"
"NZ640S","Personenauto","MASERATI","QUATTROPORTE DIESEL","20241221","20220111","15556","sedan","5","GRIJS","Niet geregistreerd","6","2987","1960","2540","2060",,,"20160509","20170518","Geen verstrekking in Open Data","124424","Ja",,,,,,,"4","4","0","0",,"526","0","M1",,,"r. bodemplaat by voorzitting","2540","M156",,"e3*2007/46*0224*06","6D2","5HW","0","0.10","317","Nee","Ja",,"Nee","0","0","0.00","2024","Geen oordeel","05","Ja","2024-12-21T00:00:00.000","2022-01-11T00:00:00.000","2016-05-09T00:00:00.000","2017-05-18T00:00:00.000",,,,,,,,,,,,,,,,,,,,,"B",,,,,,,"https://opendata.rdw.nl/resource/3huj-srit.json","https://opendata.rdw.nl/resource/8ys7-d773.json","https://opendata.rdw.nl/resource/vezc-m2t6.json","https://opendata.rdw.nl/resource/jhie-znh9.json","https://opendata.rdw.nl/resource/kmfi-hrps.json"
"RP645P","Personenauto","MASERATI","QUATTROPORTE DIESEL","20250102","20201231","20771","sedan","5","BLAUW","Niet geregistreerd","6","2987","1960","2540","2060",,,"20180102","20180102","Geen verstrekking in Open Data","146895","Ja",,,,,,,"4","4","0","0",,"527","195","M1",,,"onder r. voorzitting","2540","M156",,"e3*2007/46*0224*10","6D2","5HW","0","0.10","317","Nee","Nee",,"Nee","0","0","0.00","2024","Logisch","00","Ja","2025-01-02T00:00:00.000","2020-12-31T00:00:00.000","2018-01-02T00:00:00.000","2018-01-02T00:00:00.000",,,,,,,,,,,"148",,,,,,,,,,"D",,,,,,,"https://opendata.rdw.nl/resource/3huj-srit.json","https://opendata.rdw.nl/resource/8ys7-d773.json","https://opendata.rdw.nl/resource/vezc-m2t6.json","https://opendata.rdw.nl/resource/jhie-znh9.json","https://opendata.rdw.nl/resource/kmfi-hrps.json"
"RR829P","Personenauto","MASERATI","QUATTROPORTE DIESEL","20250116","20180102","20770","sedan","5","ZWART","Niet geregistreerd","6","2987","1960","2540","2060",,,"20171214","20180102","Geen verstrekking in Open Data","141362","Ja",,,,,,,"4","4","0","0",,"527","0","M1",,,,"2540","M156",,"e3*2007/46*0224*09","6D2","5HW","0","0.10","317","Nee","Nee",,"Nee","0","0","0.00","2024","Logisch","00","Ja","2025-01-16T00:00:00.000","2018-01-02T00:00:00.000","2017-12-14T00:00:00.000","2018-01-02T00:00:00.000",,,,,,,,,,,,,,,,,,,,,"B",,,,,,,"https://opendata.rdw.nl/resource/3huj-srit.json","https://opendata.rdw.nl/resource/8ys7-d773.json","https://opendata.rdw.nl/resource/vezc-m2t6.json","https://opendata.rdw.nl/resource/jhie-znh9.json","https://opendata.rdw.nl/resource/kmfi-hrps.json"
"RX160D","Personenauto","MASERATI","QUATTROPORTE DIESEL","20250303","20210528","21789","sedan","5","ZWART","Niet geregistreerd","6","2987","1960","2540","2060",,,"20180216","20180216","Geen verstrekking in Open Data","154122","Ja",,,,,,,"4","4","0","0",,"527","195","M1",,,"onder r. voorzitting","2540","M156",,"e3*2007/46*0224*10","6D2","5HW","0","0.10","317","Nee","Nee",,"Nee","0","0","0.00","2024","Logisch","00","Ja","2025-03-03T00:00:00.000","2021-05-28T00:00:00.000","2018-02-16T00:00:00.000","2018-02-16T00:00:00.000",,,,,,,,,,,"148",,,,,,,,,,"D",,,,,,,"https://opendata.rdw.nl/resource/3huj-srit.json","https://opendata.rdw.nl/resource/8ys7-d773.json","https://opendata.rdw.nl/resource/vezc-m2t6.json","https://opendata.rdw.nl/resource/jhie-znh9.json","https://opendata.rdw.nl/resource/kmfi-hrps.json"
"SF908P","Personenauto","MASERATI","QUATTROPORTE DIESEL","20250112","20240307","14382","sedan","5","ZWART","Niet geregistreerd","6","2987","1920","2540","2020",,,"20140514","20180316","Geen verstrekking in Open Data","128381","Ja",,,,,,,"4","4","0","0",,"526","0","M1",,,"r. bodemplaat by voorzitting","2540","M156",,"e3*2007/46*0224*04","6D2","5H","0","0.10","317","Nee","Nee",,"Nee","0","0",,"2024","Geen oordeel","05","Ja","2025-01-12T00:00:00.000","2024-03-07T00:00:00.000","2014-05-14T00:00:00.000","2018-03-16T00:00:00.000",,,,,,,,,,,,,,,,,,,,,"B",,,,,,,"https://opendata.rdw.nl/resource/3huj-srit.json","https://opendata.rdw.nl/resource/8ys7-d773.json","https://opendata.rdw.nl/resource/vezc-m2t6.json","https://opendata.rdw.nl/resource/jhie-znh9.json","https://opendata.rdw.nl/resource/kmfi-hrps.json"
"TN955R","Personenauto","MASERATI","QUATTROPORTE DIESEL","20240720","20230721","15029","sedan","5","ZWART","Niet geregistreerd","6","2987","1960","2540","2060",,,"20160707","20180913","Geen verstrekking in Open Data","126451","Ja",,,,,,,"4","4","0","0",,"526","0","M1",,,"r. bodemplaat by voorzitting","2540","M156",,"e3*2007/46*0224*06","6D2","5HW","0","0.10","317","Nee","Nee",,"Nee","0","0","0.00","2024","Geen oordeel","05","Ja","2024-07-20T00:00:00.000","2023-07-21T00:00:00.000","2016-07-07T00:00:00.000","2018-09-13T00:00:00.000",,,,,,,,,,,,,,,,,,,,,"B",,,,,,,"https://opendata.rdw.nl/resource/3huj-srit.json","https://opendata.rdw.nl/resource/8ys7-d773.json","https://opendata.rdw.nl/resource/vezc-m2t6.json","https://opendata.rdw.nl/resource/jhie-znh9.json","https://opendata.rdw.nl/resource/kmfi-hrps.json"
"XN964J","Personenauto","MASERATI","QUATTROPORTE DIESEL","20250302","20190214","13507","sedan","5","GRIJS","Niet geregistreerd","6","2987","1960","2540","2060",,,"20170509","20190214","Geen verstrekking in Open Data","153406","Ja",,,,,,,"4","4","0","0",,"527","0","M1",,,,"2540","M156",,"e3*2007/46*0224*09","6D2","5HW","0","0.10","317","Nee","Nee",,"Nee","0","0","0.00","2024","Geen oordeel","05","Ja","2025-03-02T00:00:00.000","2019-02-14T00:00:00.000","2017-05-09T00:00:00.000","2019-02-14T00:00:00.000",,,,,,,,,,,,,,,,,,,,,"B",,,,,,,"https://opendata.rdw.nl/resource/3huj-srit.json","https://opendata.rdw.nl/resource/8ys7-d773.json","https://opendata.rdw.nl/resource/vezc-m2t6.json","https://opendata.rdw.nl/resource/jhie-znh9.json","https://opendata.rdw.nl/resource/kmfi-hrps.json"
"HX034K","Personenauto","MASERATI","QUATTROPORTE DIESEL","20250528","20210331","16848","sedan","5","ZWART","Niet geregistreerd","6","2987","1920","2540","2020",,,"20160107","20160107","Geen verstrekking in Open Data","127225","Ja",,,,,,,"4","4","0","0",,"526","0","M1",,,"r. bodemplaat by voorzitting","2540","M156",,"e3*2007/46*0224*04","6D2","5H","0","0.10","317","Nee","Ja",,"Nee","0","0",,"2024","Onlogisch","04","Ja","2025-05-28T00:00:00.000","2021-03-31T00:00:00.000","2016-01-07T00:00:00.000","2016-01-07T00:00:00.000",,,,,,,,,,,,,,,,,,,,,"B",,,,,,,"https://opendata.rdw.nl/resource/3huj-srit.json","https://opendata.rdw.nl/resource/8ys7-d773.json","https://opendata.rdw.nl/resource/vezc-m2t6.json","https://opendata.rdw.nl/resource/jhie-znh9.json","https://opendata.rdw.nl/resource/kmfi-hrps.json"
"PH047Z","Personenauto","MASERATI","QUATTROPORTE DIESEL","20250531","20240529","8769","sedan","5","WIT","Niet geregistreerd","6","2987","1920","2540","2020",,,"20140228","20170628","Geen verstrekking in Open Data","135980","Ja",,,,,,,"4","4","0","0",,"526","0","M1",,,"r. bodemplaat by voorzitting","2540","M156",,"e3*2007/46*0224*04","6D2","5H","0","0.10","317","Nee","Ja",,"Nee","0","0",,"2024","Geen oordeel","05","Ja","2025-05-31T00:00:00.000","2024-05-29T00:00:00.000","2014-02-28T00:00:00.000","2017-06-28T00:00:00.000",,,,,,,,,,,,,,,,,,,,,"B",,,,,,,"https://opendata.rdw.nl/resource/3huj-srit.json","https://opendata.rdw.nl/resource/8ys7-d773.json","https://opendata.rdw.nl/resource/vezc-m2t6.json","https://opendata.rdw.nl/resource/jhie-znh9.json","https://opendata.rdw.nl/resource/kmfi-hrps.json"
