"kenteken","voertuigsoort","merk","handelsbenaming","vervaldatum_apk","datum_tenaamstelling","bruto_bpm","inrichting","aantal_zitplaatsen","eerste_kleur","tweede_kleur","aantal_cilinders","cilinderinhoud","massa_ledig_voertuig","toegestane_maximum_massa_voertuig","massa_rijklaar","maximum_massa_trekken_ongeremd","maximum_trekken_massa_geremd","datum_eerste_toelating","datum_eerste_tenaamstelling_in_nederland","wacht_op_keuren","catalogusprijs","wam_verzekerd","maximale_constructiesnelheid","laadvermogen","oplegger_geremd","aanhangwagen_autonoom_geremd","aanhangwagen_middenas_geremd","aantal_staanplaatsen","aantal_deuren","aantal_wielen","afstand_hart_koppeling_tot_achterzijde_voertuig","afstand_voorzijde_voertuig_tot_hart_koppeling","afwijkende_maximum_snelheid","lengte","breedte","europese_voertuigcategorie","europese_voertuigcategorie_toevoeging","europese_uitvoeringcategorie_toevoeging","plaats_chassisnummer","technische_max_massa_voertuig","type","type_gasinstallatie","typegoedkeuringsnummer","variant","uitvoering","volgnummer_wijziging_eu_typegoedkeuring","vermogen_massarijklaar","wielbasis","export_indicator","openstaande_terugroepactie_indicator","vervaldatum_tachograaf","taxi_indicator","maximum_massa_samenstelling","aantal_rolstoelplaatsen","maximum_ondersteunende_snelheid","jaar_laatste_registratie_tellerstand","tellerstandoordeel","code_toelichting_tellerstandoordeel","tenaamstellen_mogelijk","vervaldatum_apk_dt","datum_tenaamstelling_dt","datum_eerste_toelating_dt","datum_eerste_tenaamstelling_in_nederland_dt","vervaldatum_tachograaf_dt","maximum_last_onder_de_vooras_sen_tezamen_koppeling","type_remsysteem_voertuig_code","rupsonderstelconfiguratiecode","wielbasis_voertuig_minimum","wielbasis_voertuig_maximum","lengte_voertuig_minimum","lengte_voertuig_maximum","breedte_voertuig_minimum","breedte_voertuig_maximum","hoogte_voertuig","hoogte_voertuig_minimum","hoogte_voertuig_maximum","massa_bedrijfsklaar_minimaal","massa_bedrijfsklaar_maximaal","technisch_toelaatbaar_massa_koppelpunt","maximum_massa_technisch_maximaal","maximum_massa_technisch_minimaal","subcategorie_nederland","verticale_belasting_koppelpunt_getrokken_voertuig","zuinigheidsclassificatie","registratie_datum_goedkeuring_afschrijvingsmoment_bpm","registratie_datum_goedkeuring_afschrijvingsmoment_bpm_dt","gem_lading_wrde","aerodyn_voorz","massa_alt_aandr","verl_cab_ind","api_gekentekende_voertuigen_assen","api_gekentekende_voertuigen_brandstof","api_gekentekende_voertuigen_carrosserie","api_gekentekende_voertuigen_carrosserie_specifiek","api_gekentekende_voertuigen_voertuigklasse"
"2SFK98","Personenauto","JAGUAR LAND ROVER","FREELANDER 2","20250426","20210703","14033","stationwagen","5","ZWART","Niet geregistreerd","4","2179","1745","2505","1845","750","2000","20130426","20130906","Geen verstrekking in Open Data","73368","Ja",,,,,,,"4","4","0","0",,"0","0","M1",,,"r. bodemplaat by achterzitting","2505","LF",,"e11*2001/116*0300*11","S4FU2F","D5H2","0","0.08","266","Nee","Nee",,"Nee","4505","0","0.00","2024","Geen oordeel","05","Ja","2025-04-26T00:00:00.000","2021-07-03T00:00:00.000","2013-04-26T00:00:00.000","2013-09-06T00:00:00.000",,"0",,,,,,,,,,,,,,,,,,,"E",,,,,,,"https://opendata.rdw.nl/resource/3huj-srit.json","https://opendata.rdw.nl/resource/8ys7-d773.json","https://opendata.rdw.nl/resource/vezc-m2t6.json","https://opendata.rdw.nl/resource/jhie-znh9.json","https://opendata.rdw.nl/resource/kmfi-hrps.json"
"GD962H","Personenauto","JAGUAR LAND ROVER","FREELANDER 2","20250522","20200602","12371","stationwagen","5","BLAUW","Niet geregistreerd","4","1999","1715","2505","1815","750","2000","20130411","20150523","Geen verstrekking in Open Data","67670","Ja",,,,,,,"4","4","0","0",,"0","0","M1",,,"r. op bodemplaat onder achterzitting","2505","LF",,"e11*2001/116*0300*11","S4MV2F","D5H1","0","0.10","266","Nee","Nee",,"Nee","4505","0","0.00","2024","Geen oordeel","05","Ja","2025-05-22T00:00:00.000","2020-06-02T00:00:00.000","2013-04-11T00:00:00.000","2015-05-23T00:00:00.000",,,,,,,,,,,,,,,,,,,,,"E",,,,,,,"https://opendata.rdw.nl/resource/3huj-srit.json","https://opendata.rdw.nl/resource/8ys7-d773.json","https://opendata.rdw.nl/resource/vezc-m2t6.json","https://opendata.rdw.nl/resource/jhie-znh9.json","https://opendata.rdw.nl/resource/kmfi-hrps.json"
"K128ZT","Personenauto","JAGUAR LAND ROVER","FREELANDER 2","20250413","20210402","18003","stationwagen","5","GRIJS","Niet geregistreerd","4","2179","1745","2505","1845","750","2000","20131218","20210402","Geen verstrekking in Open Data","72456","Ja","190",,,,,,"4","4","0","0",,"0","0","M1",,,,"2505","LF",,"e11*2001/116*0300*11","S4FU2F","D5H2","0","0.08","266","Nee","Nee",,"Nee","4505","0","0.00","2024","Geen oordeel","05","Ja","2025-04-13T00:00:00.000","2021-04-02T00:00:00.000","2013-12-18T00:00:00.000","2021-04-02T00:00:00.000",,,,,,,,,,,,,,,,,,,,,"E",,,,,,,"https://opendata.rdw.nl/resource/3huj-srit.json","https://opendata.rdw.nl/resource/8ys7-d773.json","https://opendata.rdw.nl/resource/vezc-m2t6.json","https://opendata.rdw.nl/resource/jhie-znh9.json","https://opendata.rdw.nl/resource/kmfi-hrps.json"
"KS943X","Personenauto","JAGUAR LAND ROVER","FREELANDER 2","20241126","20161125","13210","stationwagen","5","ZWART","Niet geregistreerd","4","2179","1735","2505","1835","750","2000","20130424","20161125","Geen verstrekking in Open Data","52110","Ja",,,,,,,"4","4","0","0",,"0","0","M1",,,"r. op bodemplaat onder achterzitting","2505","LF",,"e11*2001/116*0300*11","S4FF2F","B5H8","0","0.06","266","Nee","Nee",,"Nee","4505","0","0.00","2023","Geen oordeel","05","Ja","2024-11-26T00:00:00.000","2016-11-25T00:00:00.000","2013-04-24T00:00:00.000","2016-11-25T00:00:00.000",,,,,,,,,,,,,,,,,,,,,"D",,,,,,,"https://opendata.rdw.nl/resource/3huj-srit.json","https://opendata.rdw.nl/resource/8ys7-d773.json","https://opendata.rdw.nl/resource/vezc-m2t6.json","https://opendata.rdw.nl/resource/jhie-znh9.json","https://opendata.rdw.nl/resource/kmfi-hrps.json"
"L663SR","Personenauto","JAGUAR LAND ROVER","FREELANDER 2","20250116","20231123","2078","stationwagen","5","ZWART","Niet geregistreerd","4","2179","1867","2505","1967","750","2000","20130822","20210720","Geen verstrekking in Open Data","71328","Nee","190",,,,,,"4","4",,,,,,"M1",,,"r. op bodemplaat onder achterzitting","2505","LF",,,,,,"0.07","266","Nee","Nee",,"Nee","4505",,,"2023","Geen oordeel","05","Ja","2025-01-16T00:00:00.000","2023-11-23T00:00:00.000","2013-08-22T00:00:00.000","2021-07-20T00:00:00.000",,,,,,,,,,,,,,,,,,,,,,,,,,,,"https://opendata.rdw.nl/resource/3huj-srit.json","https://opendata.rdw.nl/resource/8ys7-d773.json","https://opendata.rdw.nl/resource/vezc-m2t6.json","https://opendata.rdw.nl/resource/jhie-znh9.json","https://opendata.rdw.nl/resource/kmfi-hrps.json"
"NG242H","Personenauto","JAGUAR LAND ROVER","FREELANDER 2","20250209","20170110","13095","stationwagen","5","ZWART","Niet geregistreerd","4","2179","1745","2505","1845","750","2000","20130514","20170110","Geen verstrekking in Open Data","69467","Ja",,,,,,,"4","4","0","0",,"0","0","M1",,,"r. op bodemplaat onder achterzitting","2505","LF",,"e11*2001/116*0300*11","S4FU2F","D5H2","0","0.08","266","Nee","Nee",,"Nee","4505","0","0.00","2024","Geen oordeel","05","Ja","2025-02-09T00:00:00.000","2017-01-10T00:00:00.000","2013-05-14T00:00:00.000","2017-01-10T00:00:00.000",,,,,,,,,,,,,,,,,,,,,"E",,,,,,,"https://opendata.rdw.nl/resource/3huj-srit.json","https://opendata.rdw.nl/resource/8ys7-d773.json","https://opendata.rdw.nl/resource/vezc-m2t6.json","https://opendata.rdw.nl/resource/jhie-znh9.json","https://opendata.rdw.nl/resource/kmfi-hrps.json"
"R178BB","Personenauto","JAGUAR LAND ROVER","FREELANDER 2","20240822","20240123","20105","stationwagen","5","GRIJS","Niet geregistreerd","4","1999","1715","2505","1815","750","2000","20130619","20220712","Geen verstrekking in Open Data","60200","Ja","200",,,,,,"4","4","0","0",,"0","0","M1",,,"r. op bodemplaat onder achterzitting","2505","LF",,"e11*2001/116*0300*11","S4MV2F","D5H1","0","0.10","266","Nee","Nee",,"Nee","4505","0","0.00","2024","Geen oordeel","05","Ja","2024-08-22T00:00:00.000","2024-01-23T00:00:00.000","2013-06-19T00:00:00.000","2022-07-12T00:00:00.000",,,,,,,,,,,,,,,,,,,,,,"20220712","2022-07-12T00:00:00.000",,,,,"https://opendata.rdw.nl/resource/3huj-srit.json","https://opendata.rdw.nl/resource/8ys7-d773.json","https://opendata.rdw.nl/resource/vezc-m2t6.json","https://opendata.rdw.nl/resource/jhie-znh9.json","https://opendata.rdw.nl/resource/kmfi-hrps.json"
"RB930G","Personenauto","JAGUAR LAND ROVER","FREELANDER 2","20250202","20171016","22300","stationwagen","5","ZWART","Niet geregistreerd","4","2179","1867","2505","1967","750","2000","20150123","20171016","Geen verstrekking in Open Data","72697","Ja",,,,,,,"4","4","0","0",,"0","0","M1",,,"r. motorruimte","2505","LF",,"e11*2001/116*0300*14","S4FU2F","D5H2","0","0.07","266","Nee","Nee",,"Nee","4505","0","0.00","2024","Geen oordeel","05","Ja","2025-02-02T00:00:00.000","2017-10-16T00:00:00.000","2015-01-23T00:00:00.000","2017-10-16T00:00:00.000",,,,,,,,,,,,,,,,,,,,,"G",,,,,,,"https://opendata.rdw.nl/resource/3huj-srit.json","https://opendata.rdw.nl/resource/8ys7-d773.json","https://opendata.rdw.nl/resource/vezc-m2t6.json","https://opendata.rdw.nl/resource/jhie-znh9.json","https://opendata.rdw.nl/resource/kmfi-hrps.json"
"RK147H","Personenauto","JAGUAR LAND ROVER","FREELANDER 2","20250422","20210430","19821","stationwagen","5","ZWART","Niet geregistreerd","4","2179","1867","2250","1967","750","2000","20130425","20171212","Geen verstrekking in Open Data","66528","Ja",,,,,,,"4","4","0","0",,"0","0","M1",,,"r. op bodemplaat onder achterzitting","2505","LF",,"e11*2001/116*0300*11","S4FU2F","D5H2","0","0.07","266","Nee","Nee",,"Nee","4250","0","0.00","2024","Geen oordeel","05","Ja","2025-04-22T00:00:00.000","2021-04-30T00:00:00.000","2013-04-25T00:00:00.000","2017-12-12T00:00:00.000",,,,,,,,,,,,,,,,,,,,,"E",,,,,,,"https://opendata.rdw.nl/resource/3huj-srit.json","https://opendata.rdw.nl/resource/8ys7-d773.json","https://opendata.rdw.nl/resource/vezc-m2t6.json","https://opendata.rdw.nl/resource/jhie-znh9.json","https://opendata.rdw.nl/resource/kmfi-hrps.json"
"SL811V","Personenauto","JAGUAR LAND ROVER","FREELANDER 2","20241031","20191105","14035","stationwagen","5","ZWART","Niet geregistreerd","4","2179","1795","2505","1895","750","2000","20140521","20191105","Geen verstrekking in Open Data","46479","Ja",,,,,,,"4","4","0","0",,"0","0","M1",,,"r. op bodemplaat onder achterzitting","2505","LF",,"e11*2001/116*0300*13","S4FFFF","B5H2","0","0.06","266","Nee","Nee",,"Nee","4505","0","0.00","2023","Geen oordeel","05","Ja","2024-10-31T00:00:00.000","2019-11-05T00:00:00.000","2014-05-21T00:00:00.000","2019-11-05T00:00:00.000",,,,,,,,,,,,,,,,,,,,,"E",,,,,,,"https://opendata.rdw.nl/resource/3huj-srit.json","https://opendata.rdw.nl/resource/8ys7-d773.json","https://opendata.rdw.nl/resource/vezc-m2t6.json","https://opendata.rdw.nl/resource/jhie-znh9.json","https://opendata.rdw.nl/resource/kmfi-hrps.json"
"SX471P","Personenauto","JAGUAR LAND ROVER","FREELANDER 2","20250305","20180620","19821","stationwagen","5","GRIJS","Niet geregistreerd","4","2179","1745","2505","1845","750","2000","20130924","20180620","Geen verstrekking in Open Data","64229","Ja",,,,,,,"4","4","0","0",,"0","0","M1",,,"r. bodemplaat by achterzitting","2505","LF",,"e11*2001/116*0300*12","S4FF2F","D5H8","0","0.06","266","Nee","Nee",,"Nee","4505","0","0.00","2024","Geen oordeel","05","Ja","2025-03-05T00:00:00.000","2018-06-20T00:00:00.000","2013-09-24T00:00:00.000","2018-06-20T00:00:00.000",,,,,,,,,,,,,,,,,,,,,"E",,,,,,,"https://opendata.rdw.nl/resource/3huj-srit.json","https://opendata.rdw.nl/resource/8ys7-d773.json","https://opendata.rdw.nl/resource/vezc-m2t6.json","https://opendata.rdw.nl/resource/jhie-znh9.json","https://opendata.rdw.nl/resource/kmfi-hrps.json"
"TG855D","Personenauto","JAGUAR LAND ROVER","FREELANDER 2","20250505","20180728","11542","stationwagen","5","BRUIN","Niet geregistreerd","4","1999","1715","2505","1815","750","2000","20120614","20180728","Geen verstrekking in Open Data","72827","Ja",,,,,,,"4","4","0","0",,"0","0","M1",,,"r. in kofferruimte","2505","LF",,"e11*2001/116*0300*11","S4MV2F","D5H1","0","0.10","266","Nee","Nee",,"Nee","4505","0","0.00","2024","Geen oordeel","05","Ja","2025-05-05T00:00:00.000","2018-07-28T00:00:00.000","2012-06-14T00:00:00.000","2018-07-28T00:00:00.000",,,,,,,,,,,,,,,,,,,,,"E",,,,,,,"https://opendata.rdw.nl/resource/3huj-srit.json","https://opendata.rdw.nl/resource/8ys7-d773.json","https://opendata.rdw.nl/resource/vezc-m2t6.json","https://opendata.rdw.nl/resource/jhie-znh9.json","https://opendata.rdw.nl/resource/kmfi-hrps.json"
"TN331S","Personenauto","JAGUAR LAND ROVER","FREELANDER 2","20250414","20180911","21361","stationwagen","5","GROEN","Niet geregistreerd","4","2179","1745","2505","1845","750","2000","20140630","20180911","Geen verstrekking in Open Data","77261","Ja",,,,,,,"4","4","0","0",,"0","0","M1",,,"r. motorruimte","2505","LF",,"e11*2001/116*0300*14","S4FU2F","D5H2","0","0.08","266","Nee","Nee",,"Nee","4505","0","0.00","2024","Geen oordeel","05","Ja","2025-04-14T00:00:00.000","2018-09-11T00:00:00.000","2014-06-30T00:00:00.000","2018-09-11T00:00:00.000",,,,,,,,,,,,,,,,,,,,,"G",,,,,,,"https://opendata.rdw.nl/resource/3huj-srit.json","https://opendata.rdw.nl/resource/8ys7-d773.json","https://opendata.rdw.nl/resource/vezc-m2t6.json","https://opendata.rdw.nl/resource/jhie-znh9.json","https://opendata.rdw.nl/resource/kmfi-hrps.json"
"TN429P","Personenauto","JAGUAR LAND ROVER","FREELANDER 2","20240816","20230420","13278","stationwagen","5","GRIJS","Niet geregistreerd","4","2179","1745","2505","1845","750","2000","20130813","20180910","Geen verstrekking in Open Data","65090","Ja",,,,,,,"4","4","0","0",,"0","0","M1",,,"r. op bodemplaat onder achterzitting","2505","LF",,"e11*2001/116*0300*11","S4FF2F","D5H8","0","0.06","266","Nee","Nee",,"Nee","4505","0","0.00","2023","Geen oordeel","05","Ja","2024-08-16T00:00:00.000","2023-04-20T00:00:00.000","2013-08-13T00:00:00.000","2018-09-10T00:00:00.000",,,,,,,,,,,,,,,,,,,,,"E",,,,,,,"https://opendata.rdw.nl/resource/3huj-srit.json","https://opendata.rdw.nl/resource/8ys7-d773.json","https://opendata.rdw.nl/resource/vezc-m2t6.json","https://opendata.rdw.nl/resource/jhie-znh9.json","https://opendata.rdw.nl/resource/kmfi-hrps.json"
"TP586T","Personenauto","JAGUAR LAND ROVER","FREELANDER 2","20240913","20180921","21361","stationwagen","5","BLAUW","Niet geregistreerd","4","2179","1745","2505","1845","750","2000","20140630","20180921","Geen verstrekking in Open Data","58357","Ja",,,,,,,"4","4","0","0",,"0","0","M1",,,"r. op bodemplaat onder achterzitting","2505","LF",,"e11*2001/116*0300*12","S4FF2F","D5H8","0","0.06","266","Nee","Nee",,"Nee","4505","0","0.00","2023","Geen oordeel","05","Ja","2024-09-13T00:00:00.000","2018-09-21T00:00:00.000","2014-06-30T00:00:00.000","2018-09-21T00:00:00.000",,,,,,,,,,,,,,,,,,,,,"G",,,,,,,"https://opendata.rdw.nl/resource/3huj-srit.json","https://opendata.rdw.nl/resource/8ys7-d773.json","https://opendata.rdw.nl/resource/vezc-m2t6.json","https://opendata.rdw.nl/resource/jhie-znh9.json","https://opendata.rdw.nl/resource/kmfi-hrps.json"
"P092DG","Personenauto","JAGUAR LAND ROVER","FREELANDER 2","20250531","20220204","18855","stationwagen","5","GROEN","Niet geregistreerd","4","2179","1867","2505","1967","750","2000","20140407","20220204","Geen verstrekking in Open Data","66498","Ja","190",,,,,,"4","4",,,,,,"M1",,,"r. op bodemplaat onder achterzitting","2505","LF",,"e11*2001/116*0300*12","S4FU2F","D5H2","0","0.07","266","Nee","Nee",,"Nee","4505",,,"2024","Geen oordeel","05","Ja","2025-05-31T00:00:00.000","2022-02-04T00:00:00.000","2014-04-07T00:00:00.000","2022-02-04T00:00:00.000",,,,,,,,,,,,,,,,,,,,,,"20220128","2022-01-28T00:00:00.000",,,,,"https://opendata.rdw.nl/resource/3huj-srit.json","https://opendata.rdw.nl/resource/8ys7-d773.json","https://opendata.rdw.nl/resource/vezc-m2t6.json","https://opendata.rdw.nl/resource/jhie-znh9.json","https://opendata.rdw.nl/resource/kmfi-hrps.json"
"8XHS73","Personenauto","JAGUAR LAND ROVER","FREELANDER 2","20250530","20240414","14689","stationwagen","5","GRIJS","Niet geregistreerd","4","2179","1745","2505","1845","750","2000","20130809","20140806","Geen verstrekking in Open Data","62280","Ja",,,,,,,"4","4","0","0",,"0","0","M1",,,"r. op bodemplaat onder achterzitting","2505","LF",,"e11*2001/116*0300*11","S4FU2F","D5H2","0","0.08","266","Nee","Nee",,"Nee","4505","0","0.00","2024","Geen oordeel","05","Ja","2025-05-30T00:00:00.000","2024-04-14T00:00:00.000","2013-08-09T00:00:00.000","2014-08-06T00:00:00.000",,"0",,,,,,,,,,,,,,,,,,,"E",,,,,,,"https://opendata.rdw.nl/resource/3huj-srit.json","https://opendata.rdw.nl/resource/8ys7-d773.json","https://opendata.rdw.nl/resource/vezc-m2t6.json","https://opendata.rdw.nl/resource/jhie-znh9.json","https://opendata.rdw.nl/resource/kmfi-hrps.json"
