"kenteken","voertuigsoort","merk","handelsbenaming","vervaldatum_apk","datum_tenaamstelling","bruto_bpm","inrichting","aantal_zitplaatsen","eerste_kleur","tweede_kleur","aantal_cilinders","cilinderinhoud","massa_ledig_voertuig","toegestane_maximum_massa_voertuig","massa_rijklaar","maximum_massa_trekken_ongeremd","maximum_trekken_massa_geremd","datum_eerste_toelating","datum_eerste_tenaamstelling_in_nederland","wacht_op_keuren","catalogusprijs","wam_verzekerd","maximale_constructiesnelheid","laadvermogen","oplegger_geremd","aanhangwagen_autonoom_geremd","aanhangwagen_middenas_geremd","aantal_staanplaatsen","aantal_deuren","aantal_wielen","afstand_hart_koppeling_tot_achterzijde_voertuig","afstand_voorzijde_voertuig_tot_hart_koppeling","afwijkende_maximum_snelheid","lengte","breedte","europese_voertuigcategorie","europese_voertuigcategorie_toevoeging","europese_uitvoeringcategorie_toevoeging","plaats_chassisnummer","technische_max_massa_voertuig","type","type_gasinstallatie","typegoedkeuringsnummer","variant","uitvoering","volgnummer_wijziging_eu_typegoedkeuring","vermogen_massarijklaar","wielbasis","export_indicator","openstaande_terugroepactie_indicator","vervaldatum_tachograaf","taxi_indicator","maximum_massa_samenstelling","aantal_rolstoelplaatsen","maximum_ondersteunende_snelheid","jaar_laatste_registratie_tellerstand","tellerstandoordeel","code_toelichting_tellerstandoordeel","tenaamstellen_mogelijk","vervaldatum_apk_dt","datum_tenaamstelling_dt","datum_eerste_toelating_dt","datum_eerste_tenaamstelling_in_nederland_dt","vervaldatum_tachograaf_dt","maximum_last_onder_de_vooras_sen_tezamen_koppeling","type_remsysteem_voertuig_code","rupsonderstelconfiguratiecode","wielbasis_voertuig_minimum","wielbasis_voertuig_maximum","lengte_voertuig_minimum","lengte_voertuig_maximum","breedte_voertuig_minimum","breedte_voertuig_maximum","hoogte_voertuig","hoogte_voertuig_minimum","hoogte_voertuig_maximum","massa_bedrijfsklaar_minimaal","massa_bedrijfsklaar_maximaal","technisch_toelaatbaar_massa_koppelpunt","maximum_massa_technisch_maximaal","maximum_massa_technisch_minimaal","subcategorie_nederland","verticale_belasting_koppelpunt_getrokken_voertuig","zuinigheidsclassificatie","registratie_datum_goedkeuring_afschrijvingsmoment_bpm","registratie_datum_goedkeuring_afschrijvingsmoment_bpm_dt","gem_lading_wrde","aerodyn_voorz","massa_alt_aandr","verl_cab_ind","api_gekentekende_voertuigen_assen","api_gekentekende_voertuigen_brandstof","api_gekentekende_voertuigen_carrosserie","api_gekentekende_voertuigen_carrosserie_specifiek","api_gekentekende_voertuigen_voertuigklasse"
"00HFS1","Personenauto","FIAT","CROMA CHT","20230929","20201003","1788","hatchback","5","GRIJS","Niet geregistreerd","4","1995","1185","1710","1285","592","1300","19890410","20100904","Geen verstrekking in Open Data",,"Ja",,,,,,,"4","4","0","0",,"0","0","M1",,,"op r. voorwielscherm onder motorkap","1710",,,,,,"0","0.06","266","Nee","Nee",,"Nee","0",,,"2021","Geen oordeel","05","Ja","2023-09-29T00:00:00.000","2020-10-03T00:00:00.000","1989-04-10T00:00:00.000","2010-09-04T00:00:00.000",,"0",,,,,,,,,,,,,,,,,,,,,,,,,,"https://opendata.rdw.nl/resource/3huj-srit.json","https://opendata.rdw.nl/resource/8ys7-d773.json","https://opendata.rdw.nl/resource/vezc-m2t6.json","https://opendata.rdw.nl/resource/jhie-znh9.json","https://opendata.rdw.nl/resource/kmfi-hrps.json"
"00HT16","Personenauto","FIAT","500",,"20200616",,"hatchback","4","BLAUW","Niet geregistreerd","2","500","560",,"660",,,"19660630","19751212","Geen verstrekking in Open Data",,"Ja",,,,,,,"2","4",,,,,,"M1",,,"r. tegen schutbord in kofferruimte",,,,,,,,"0.02","184","Nee","Nee",,"Nee",,,,"2024","Geen oordeel","05","Ja",,"2020-06-16T00:00:00.000","1966-06-30T00:00:00.000","1975-12-12T00:00:00.000",,,,,,,,,,,,,,,,,,,,,,,,,,,,"https://opendata.rdw.nl/resource/3huj-srit.json","https://opendata.rdw.nl/resource/8ys7-d773.json","https://opendata.rdw.nl/resource/vezc-m2t6.json","https://opendata.rdw.nl/resource/jhie-znh9.json","https://opendata.rdw.nl/resource/kmfi-hrps.json"
"00HVD9","Personenauto","FIAT","FIAT PUNTO","20250126","20230217","3006","hatchback","5","ROOD","Niet geregistreerd","4","1242","895","1430","995","400","1000","20020410","20090226","Geen verstrekking in Open Data",,"Ja",,,,,,,"2","4","0","0",,"380","0","M1",,,"r. op bodemplaat v. r. voorzitting","1430",,,"e3*98/14*0048*02","AXB1A","02F","0","0.06","246","Nee","Nee",,"Nee","2430","0",,"2024","Onlogisch","04","Ja","2025-01-26T00:00:00.000","2023-02-17T00:00:00.000","2002-04-10T00:00:00.000","2009-02-26T00:00:00.000",,,,,,,,,,,,,,,,,,,,,"B",,,,,,,"https://opendata.rdw.nl/resource/3huj-srit.json","https://opendata.rdw.nl/resource/8ys7-d773.json","https://opendata.rdw.nl/resource/vezc-m2t6.json","https://opendata.rdw.nl/resource/jhie-znh9.json","https://opendata.rdw.nl/resource/kmfi-hrps.json"
"00NSK1","Personenauto","FIAT","FIAT PUNTO","20250331","20240411","1904","hatchback","5","GRIJS","Niet geregistreerd","4","1242","835","1370","935","400","1000","20020430","20101113","Geen verstrekking in Open Data",,"Ja",,,,,,,"2","4",,,,,,"M1",,,"r. op bodemplaat v. r. voorzitting","1370",,,,,,,"0.05","246","Nee","Nee",,"Nee",,,,"2024","Geen oordeel","05","Ja","2025-03-31T00:00:00.000","2024-04-11T00:00:00.000","2002-04-30T00:00:00.000","2010-11-13T00:00:00.000",,"0",,,,,,,,,,,,,,,,,,,,,,,,,,"https://opendata.rdw.nl/resource/3huj-srit.json","https://opendata.rdw.nl/resource/8ys7-d773.json","https://opendata.rdw.nl/resource/vezc-m2t6.json","https://opendata.rdw.nl/resource/jhie-znh9.json","https://opendata.rdw.nl/resource/kmfi-hrps.json"
"00YE84","Personenauto","FIAT","500R","20241027","20221020",,"hatchback","4","GEEL","Niet geregistreerd","2","594","520",,"620",,,"19750228","20221020","Geen verstrekking in Open Data",,"Ja",,,,,,,"2","4",,,,,,"M1",,,,,"110F",,,,,,"0.02","184","Nee","Nee",,"Nee",,,,"2022","Geen oordeel","05","Ja","2024-10-27T00:00:00.000","2022-10-20T00:00:00.000","1975-02-28T00:00:00.000","2022-10-20T00:00:00.000",,,,,,,,,,,,,,,,,,,,,,"20221020","2022-10-20T00:00:00.000",,,,,"https://opendata.rdw.nl/resource/3huj-srit.json","https://opendata.rdw.nl/resource/8ys7-d773.json","https://opendata.rdw.nl/resource/vezc-m2t6.json","https://opendata.rdw.nl/resource/jhie-znh9.json","https://opendata.rdw.nl/resource/kmfi-hrps.json"
"01DBJS","Personenauto","FIAT","FIAT PUNTO","20240629","19990618","2055","hatchback","5","GROEN","Niet geregistreerd","4","1242","840","1325","940","400","900","19990618","19990618","Geen verstrekking in Open Data",,"Ja",,,,,,,"2","4","0","0",,"0","0","M1",,,"r. op bodemplaat v. r. voorzitting","1325",,,"e3*96/27*0022*03","AR53A","05D","1","0.05","245","Nee","Nee",,"Nee","2225","0",,"2023","Logisch","00","Ja","2024-06-29T00:00:00.000","1999-06-18T00:00:00.000","1999-06-18T00:00:00.000","1999-06-18T00:00:00.000",,,,,,,,,,,,,,,,,,,,,,,,,,,,"https://opendata.rdw.nl/resource/3huj-srit.json","https://opendata.rdw.nl/resource/8ys7-d773.json","https://opendata.rdw.nl/resource/vezc-m2t6.json","https://opendata.rdw.nl/resource/jhie-znh9.json","https://opendata.rdw.nl/resource/kmfi-hrps.json"
"01DFTD","Personenauto","FIAT","FIAT PUNTO","20210724",,"2181","hatchback","5","GRIJS","Niet geregistreerd","4","1242","855","1340","955","400","900","19990723","19990723","Geen verstrekking in Open Data",,"Nee",,,,,,,"4","4","0","0",,"0","0","M1",,,"r. op bodemplaat v. r. voorzitting","1340",,,"e3*96/27*0022*00","AR55A","06","1","0.05","245","Nee","Nee",,"Nee","2240","0",,"2020","Logisch","00","Ja","2021-07-24T00:00:00.000",,"1999-07-23T00:00:00.000","1999-07-23T00:00:00.000",,,,,,,,,,,,,,,,,,,,,,,,,,,,"https://opendata.rdw.nl/resource/3huj-srit.json","https://opendata.rdw.nl/resource/8ys7-d773.json","https://opendata.rdw.nl/resource/vezc-m2t6.json","https://opendata.rdw.nl/resource/jhie-znh9.json","https://opendata.rdw.nl/resource/kmfi-hrps.json"
"01DLDP","Personenauto","FIAT","FIAT SEICENTO","20240708","20110916","1557","hatchback","5","BLAUW","Niet geregistreerd","4","1108","710","1200","810","350","400","19990915","19990915","Geen verstrekking in Open Data",,"Ja",,,,,,,"2","4","0","0",,"333","0","M1",,,"r. in kofferruimte op bodemplaat","1200",,,"e3*96/79*0036*00","AXB1A","01C","0","0.05","220","Nee","Nee",,"Nee","1600","0",,"2023","Logisch","00","Ja","2024-07-08T00:00:00.000","2011-09-16T00:00:00.000","1999-09-15T00:00:00.000","1999-09-15T00:00:00.000",,,,,,,,,,,,,,,,,,,,,,,,,,,,"https://opendata.rdw.nl/resource/3huj-srit.json","https://opendata.rdw.nl/resource/8ys7-d773.json","https://opendata.rdw.nl/resource/vezc-m2t6.json","https://opendata.rdw.nl/resource/jhie-znh9.json","https://opendata.rdw.nl/resource/kmfi-hrps.json"
"01DPXN","Personenauto","FIAT","FIAT SEICENTO","20241109","20120914","914","hatchback","5","BLAUW","Niet geregistreerd","4","1108","710","1200","810","350","400","19991101","19991101","Geen verstrekking in Open Data",,"Ja",,,,,,,"2","4","0","0",,"332","0","M1",,,"r. in kofferruimte op bodemplaat","1200",,,"e3*96/79*0036*03","AXB1A","01P","0","0.05","220","Nee","Nee",,"Nee","1600","0",,"2023","Logisch","00","Ja","2024-11-09T00:00:00.000","2012-09-14T00:00:00.000","1999-11-01T00:00:00.000","1999-11-01T00:00:00.000",,,,,,,,,,,,,,,,,,,,,,,,,,,,"https://opendata.rdw.nl/resource/3huj-srit.json","https://opendata.rdw.nl/resource/8ys7-d773.json","https://opendata.rdw.nl/resource/vezc-m2t6.json","https://opendata.rdw.nl/resource/jhie-znh9.json","https://opendata.rdw.nl/resource/kmfi-hrps.json"
"01DRVS","Personenauto","FIAT","(FIAT PANDA)","20250409","20211015","399","hatchback","5","ZWART","Niet geregistreerd","4","899","690","1150","790","350","800","19991105","19991105","Geen verstrekking in Open Data",,"Ja",,,,,,,"2","4","0","0",,"341","0","M1",,,"op r. schroefveerkoker onder motorkap","1150",,,"e3*96/27*0012*01","GT53A","02C","1","0.04","216","Nee","Nee",,"Nee","1950","0",,"2024","Logisch","00","Ja","2025-04-09T00:00:00.000","2021-10-15T00:00:00.000","1999-11-05T00:00:00.000","1999-11-05T00:00:00.000",,,,,,,,,,,,,,,,,,,,,,,,,,,,"https://opendata.rdw.nl/resource/3huj-srit.json","https://opendata.rdw.nl/resource/8ys7-d773.json","https://opendata.rdw.nl/resource/vezc-m2t6.json","https://opendata.rdw.nl/resource/jhie-znh9.json","https://opendata.rdw.nl/resource/kmfi-hrps.json"
"01DXLH","Personenauto","FIAT","FIAT SEICENTO","20150409","20170515","879","hatchback","5","ZWART","Niet geregistreerd","4","1108","710","1200","810","350","400","20000107","20000107","Geen verstrekking in Open Data",,"Ja",,,,,,,"2","4","0","0",,"332","0","M1",,,"r. in kofferruimte op bodemplaat","1200",,,"e3*96/79*0036*03","AXB1A","01P","0","0.05","220","Nee","Nee",,"Nee","1600","0",,"2015","Logisch","00","Ja","2015-04-09T00:00:00.000","2017-05-15T00:00:00.000","2000-01-07T00:00:00.000","2000-01-07T00:00:00.000",,,,,,,,,,,,,,,,,,,,,,,,,,,,"https://opendata.rdw.nl/resource/3huj-srit.json","https://opendata.rdw.nl/resource/8ys7-d773.json","https://opendata.rdw.nl/resource/vezc-m2t6.json","https://opendata.rdw.nl/resource/jhie-znh9.json","https://opendata.rdw.nl/resource/kmfi-hrps.json"
"01FHXD","Personenauto","FIAT","FIAT PUNTO","20170504","20170418","2117","hatchback","5","GRIJS","Niet geregistreerd","4","1242","835","1370","935","400","1000","20000331","20000331","Geen verstrekking in Open Data",,"Nee",,,,,,,"2","4","0","0",,"380","0","M1",,,"r. op bodemplaat v. r. voorzitting","1370",,,"e3*98/14*0048*00","AXA1A","00C","0","0.05","246","Nee","Nee",,"Nee","2370","0",,"2017","Logisch","00","Ja","2017-05-04T00:00:00.000","2017-04-18T00:00:00.000","2000-03-31T00:00:00.000","2000-03-31T00:00:00.000",,,,,,,,,,,,,,,,,,,,,,,,,,,,"https://opendata.rdw.nl/resource/3huj-srit.json","https://opendata.rdw.nl/resource/8ys7-d773.json","https://opendata.rdw.nl/resource/vezc-m2t6.json","https://opendata.rdw.nl/resource/jhie-znh9.json","https://opendata.rdw.nl/resource/kmfi-hrps.json"
"01FJLJ","Personenauto","FIAT","FIAT SEICENTO","20250417","20210228","1021","hatchback","5","GRIJS","Niet geregistreerd","4","1108","710","1200","810","350","400","20000407","20000407","Geen verstrekking in Open Data",,"Ja",,,,,,,"2","4","0","0",,"332","0","M1",,,"r. in kofferruimte op bodemplaat","1200",,,"e3*96/79*0036*03","AXB1A","01P","0","0.05","220","Nee","Nee",,"Nee","1600","0",,"2024","Logisch","00","Ja","2025-04-17T00:00:00.000","2021-02-28T00:00:00.000","2000-04-07T00:00:00.000","2000-04-07T00:00:00.000",,,,,,,,,,,,,,,,,,,,,,,,,,,,"https://opendata.rdw.nl/resource/3huj-srit.json","https://opendata.rdw.nl/resource/8ys7-d773.json","https://opendata.rdw.nl/resource/vezc-m2t6.json","https://opendata.rdw.nl/resource/jhie-znh9.json","https://opendata.rdw.nl/resource/kmfi-hrps.json"
"01FLRD","Personenauto","FIAT","FIAT PUNTO","20241009","20231009","2117","hatchback","5","GEEL","Niet geregistreerd","4","1242","835","1370","935","400","1000","20000503","20000503","Geen verstrekking in Open Data",,"Ja",,,,,,,"2","4","0","0",,"380","0","M1",,,"r. op bodemplaat v. r. voorzitting","1370",,,"e3*98/14*0048*00","AXA1A","00C","0","0.05","246","Nee","Nee",,"Nee","2370","0",,"2023","Logisch","00","Ja","2024-10-09T00:00:00.000","2023-10-09T00:00:00.000","2000-05-03T00:00:00.000","2000-05-03T00:00:00.000",,,,,,,,,,,,,,,,,,,,,,,,,,,,"https://opendata.rdw.nl/resource/3huj-srit.json","https://opendata.rdw.nl/resource/8ys7-d773.json","https://opendata.rdw.nl/resource/vezc-m2t6.json","https://opendata.rdw.nl/resource/jhie-znh9.json","https://opendata.rdw.nl/resource/kmfi-hrps.json"
"01FRGL","Personenauto","FIAT","FIAT SEICENTO","20241029","20181030","1131","hatchback","5","ZWART","Niet geregistreerd","4","1108","710","1200","810","350","400","20000531","20000531","Geen verstrekking in Open Data",,"Ja",,,,,,,"2","4","0","0",,"332","0","M1",,,"r. in kofferruimte op bodemplaat","1200",,,"e3*96/79*0036*00","AXB1A","01","0","0.05","220","Nee","Nee",,"Nee","1600","0",,"2023","Logisch","00","Ja","2024-10-29T00:00:00.000","2018-10-30T00:00:00.000","2000-05-31T00:00:00.000","2000-05-31T00:00:00.000",,,,,,,,,,,,,,,,,,,,,,,,,,,,"https://opendata.rdw.nl/resource/3huj-srit.json","https://opendata.rdw.nl/resource/8ys7-d773.json","https://opendata.rdw.nl/resource/vezc-m2t6.json","https://opendata.rdw.nl/resource/jhie-znh9.json","https://opendata.rdw.nl/resource/kmfi-hrps.json"
"01FRJG","Personenauto","FIAT","FIAT SEICENTO","20220122","20180102","1191","hatchback","5","ROOD","Niet geregistreerd","4","1108","710","1200","810","350","400","20000531","20000531","Geen verstrekking in Open Data",,"Nee",,,,,,,"2","4","0","0",,"332","0","M1",,,"r. in kofferruimte op bodemplaat","1200",,,"e3*96/79*0036*00","AXB1A","01","0","0.05","220","Nee","Nee",,"Nee","1600","0",,"2021","Logisch","00","Ja","2022-01-22T00:00:00.000","2018-01-02T00:00:00.000","2000-05-31T00:00:00.000","2000-05-31T00:00:00.000",,,,,,,,,,,,,,,,,,,,,,,,,,,,"https://opendata.rdw.nl/resource/3huj-srit.json","https://opendata.rdw.nl/resource/8ys7-d773.json","https://opendata.rdw.nl/resource/vezc-m2t6.json","https://opendata.rdw.nl/resource/jhie-znh9.json","https://opendata.rdw.nl/resource/kmfi-hrps.json"
"01FVXH","Personenauto","FIAT","FIAT SEICENTO","20241229","20220624","1068","hatchback","5","GEEL","Niet geregistreerd","4","1108","710","1200","810","350","400","20000727","20000727","Geen verstrekking in Open Data",,"Ja",,,,,,,"2","4","0","0",,"332","0","M1",,,"r. in kofferruimte op bodemplaat","1200",,,"e3*96/79*0036*03","AXB1A","01P","0","0.05","220","Nee","Nee",,"Nee","1600","0",,"2023","Logisch","00","Ja","2024-12-29T00:00:00.000","2022-06-24T00:00:00.000","2000-07-27T00:00:00.000","2000-07-27T00:00:00.000",,,,,,,,,,,,,,,,,,,,,,,,,,,,"https://opendata.rdw.nl/resource/3huj-srit.json","https://opendata.rdw.nl/resource/8ys7-d773.json","https://opendata.rdw.nl/resource/vezc-m2t6.json","https://opendata.rdw.nl/resource/jhie-znh9.json","https://opendata.rdw.nl/resource/kmfi-hrps.json"
"01GDZH","Personenauto","FIAT","FIAT SEICENTO","20181215","20070718","879","hatchback","5","BLAUW","Niet geregistreerd","4","1108","710","1200","810","350","400","20000930","20000930","Geen verstrekking in Open Data",,"Nee",,,,,,,"2","4","0","0",,"332","0","M1",,,"r. in kofferruimte op bodemplaat","1200",,,"e3*96/79*0036*03","AXB1A","01P","0","0.05","220","Nee","Nee",,"Nee","1600","0",,"2017","Logisch","00","Ja","2018-12-15T00:00:00.000","2007-07-18T00:00:00.000","2000-09-30T00:00:00.000","2000-09-30T00:00:00.000",,,,,,,,,,,,,,,,,,,,,,,,,,,,"https://opendata.rdw.nl/resource/3huj-srit.json","https://opendata.rdw.nl/resource/8ys7-d773.json","https://opendata.rdw.nl/resource/vezc-m2t6.json","https://opendata.rdw.nl/resource/jhie-znh9.json","https://opendata.rdw.nl/resource/kmfi-hrps.json"
"01GGG4","Personenauto","FIAT","FIAT PUNTO","20231115","20240310","2262","hatchback","5","GROEN","Niet geregistreerd","4","1242","950","1385","1050","400","1000","20020701","20090108","Geen verstrekking in Open Data",,"Nee",,,,,,,"4","4",,,,,,"M1",,,"by r. voorzitting","1385",,,,,,,"0.04","246","Nee","Nee",,"Nee",,,,"2024","Geen oordeel","05","Ja","2023-11-15T00:00:00.000","2024-03-10T00:00:00.000","2002-07-01T00:00:00.000","2009-01-08T00:00:00.000",,"0",,,,,,,,,,,,,,,,,,,,,,,,,,"https://opendata.rdw.nl/resource/3huj-srit.json","https://opendata.rdw.nl/resource/8ys7-d773.json","https://opendata.rdw.nl/resource/vezc-m2t6.json","https://opendata.rdw.nl/resource/jhie-znh9.json","https://opendata.rdw.nl/resource/kmfi-hrps.json"
"01GGJZ","Personenauto","FIAT","FIAT PUNTO","20250514","20220420","2760","hatchback","5","GEEL","Niet geregistreerd","4","1242","905","1440","1005","400","1000","20001027","20001027","Geen verstrekking in Open Data",,"Ja",,,,,,,"2","4","0","0",,"380","0","M1",,,"r. op bodemplaat v. r. voorzitting","1440",,,"e3*98/14*0048*00","AXB1B","06B","0","0.06","246","Nee","Nee",,"Nee","2440","0",,"2024","Logisch","00","Ja","2025-05-14T00:00:00.000","2022-04-20T00:00:00.000","2000-10-27T00:00:00.000","2000-10-27T00:00:00.000",,,,,,,,,,,,,,,,,,,,,,,,,,,,"https://opendata.rdw.nl/resource/3huj-srit.json","https://opendata.rdw.nl/resource/8ys7-d773.json","https://opendata.rdw.nl/resource/vezc-m2t6.json","https://opendata.rdw.nl/resource/jhie-znh9.json","https://opendata.rdw.nl/resource/kmfi-hrps.json"
"01GVLG","Personenauto","FIAT","FIAT SEICENTO","20241122","20180120","1012","hatchback","5","BLAUW","Niet geregistreerd","4","1108","710","1200","810","350","400","20010331","20010331","Geen verstrekking in Open Data",,"Ja",,,,,,,"2","4","0","0",,"334","0","M1",,,"r. in kofferruimte op bodemplaat","1200",,,"e3*96/79*0036*04","AXC1A","02","1","0.05","220","Nee","Nee",,"Nee","1600","0",,"2023","Logisch","00","Ja","2024-11-22T00:00:00.000","2018-01-20T00:00:00.000","2001-03-31T00:00:00.000","2001-03-31T00:00:00.000",,,,,,,,,,,,,,,,,,,,,"C",,,,,,,"https://opendata.rdw.nl/resource/3huj-srit.json","https://opendata.rdw.nl/resource/8ys7-d773.json","https://opendata.rdw.nl/resource/vezc-m2t6.json","https://opendata.rdw.nl/resource/jhie-znh9.json","https://opendata.rdw.nl/resource/kmfi-hrps.json"
"01GVPF","Personenauto","FIAT","FIAT SEICENTO","20240828","20240610","1231","hatchback","5","BLAUW","Niet geregistreerd","4","1108","710","1200","810","350","400","20010330","20010330","Geen verstrekking in Open Data",,"Ja",,,,,,,"2","4","0","0",,"334","0","M1",,,"r. in kofferruimte op bodemplaat","1200",,,"e3*96/79*0036*04","AXC1A","02","1","0.05","220","Nee","Nee",,"Nee","1600","0",,"2023","Onlogisch","04","Ja","2024-08-28T00:00:00.000","2024-06-10T00:00:00.000","2001-03-30T00:00:00.000","2001-03-30T00:00:00.000",,,,,,,,,,,,,,,,,,,,,"C",,,,,,,"https://opendata.rdw.nl/resource/3huj-srit.json","https://opendata.rdw.nl/resource/8ys7-d773.json","https://opendata.rdw.nl/resource/vezc-m2t6.json","https://opendata.rdw.nl/resource/jhie-znh9.json","https://opendata.rdw.nl/resource/kmfi-hrps.json"
"01GZRT","Personenauto","FIAT","FIAT SEICENTO","20250117","20220214","1250","hatchback","5","ROOD","Niet geregistreerd","4","1108","710","1200","810","350","400","20010504","20010504","Geen verstrekking in Open Data",,"Ja",,,,,,,"2","4","0","0",,"334","0","M1",,,"r. in kofferruimte op bodemplaat","1200",,,"e3*96/79*0036*04","AXC1A","02","1","0.05","220","Nee","Nee",,"Nee","1600","0",,"2024","Logisch","00","Ja","2025-01-17T00:00:00.000","2022-02-14T00:00:00.000","2001-05-04T00:00:00.000","2001-05-04T00:00:00.000",,,,,,,,,,,,,,,,,,,,,"C",,,,,,,"https://opendata.rdw.nl/resource/3huj-srit.json","https://opendata.rdw.nl/resource/8ys7-d773.json","https://opendata.rdw.nl/resource/vezc-m2t6.json","https://opendata.rdw.nl/resource/jhie-znh9.json","https://opendata.rdw.nl/resource/kmfi-hrps.json"
"01HBNT","Personenauto","FIAT","FIAT PUNTO","20241207","20221010","3254","hatchback","5","ZWART","Niet geregistreerd","4","1242","905","1440","1005","400","1000","20010516","20010516","Geen verstrekking in Open Data",,"Ja",,,,,,,"2","4","0","0",,"380","0","M1",,,"r. op bodemplaat v. r. voorzitting","1440",,,"e3*98/14*0048*01","AXB1B","06D","0","0.06","246","Nee","Nee",,"Nee","2440","0",,"2024","Onlogisch","04","Ja","2024-12-07T00:00:00.000","2022-10-10T00:00:00.000","2001-05-16T00:00:00.000","2001-05-16T00:00:00.000",,,,,,,,,,,,,,,,,,,,,"C",,,,,,,"https://opendata.rdw.nl/resource/3huj-srit.json","https://opendata.rdw.nl/resource/8ys7-d773.json","https://opendata.rdw.nl/resource/vezc-m2t6.json","https://opendata.rdw.nl/resource/jhie-znh9.json","https://opendata.rdw.nl/resource/kmfi-hrps.json"
"01HFTX","Personenauto","FIAT","FIAT SEICENTO","20241117","20051103","1226","hatchback","5","ROOD","Niet geregistreerd","4","1108","710","1200","810","350","400","20010618","20010618","Geen verstrekking in Open Data",,"Ja",,,,,,,"2","4","0","0",,"332","0","M1",,,"r. in kofferruimte op bodemplaat","1200",,,"e3*96/79*0036*00","AXB1A","01","0","0.05","220","Nee","Nee",,"Nee","1600","0",,"2023","Logisch","00","Ja","2024-11-17T00:00:00.000","2005-11-03T00:00:00.000","2001-06-18T00:00:00.000","2001-06-18T00:00:00.000",,,,,,,,,,,,,,,,,,,,,"C",,,,,,,"https://opendata.rdw.nl/resource/3huj-srit.json","https://opendata.rdw.nl/resource/8ys7-d773.json","https://opendata.rdw.nl/resource/vezc-m2t6.json","https://opendata.rdw.nl/resource/jhie-znh9.json","https://opendata.rdw.nl/resource/kmfi-hrps.json"
"01HGNB","Personenauto","FIAT","FIAT SEICENTO","20240916","20220523","1106","hatchback","5","BLAUW","Niet geregistreerd","4","1108","710","1200","810","350","400","20010628","20010628","Geen verstrekking in Open Data",,"Ja",,,,,,,"2","4","0","0",,"334","0","M1",,,"r. in kofferruimte op bodemplaat","1200",,,"e3*96/79*0036*04","AXC1A","02","1","0.05","220","Nee","Nee",,"Nee","1600","0",,"2023","Logisch","00","Ja","2024-09-16T00:00:00.000","2022-05-23T00:00:00.000","2001-06-28T00:00:00.000","2001-06-28T00:00:00.000",,,,,,,,,,,,,,,,,,,,,"C",,,,,,,"https://opendata.rdw.nl/resource/3huj-srit.json","https://opendata.rdw.nl/resource/8ys7-d773.json","https://opendata.rdw.nl/resource/vezc-m2t6.json","https://opendata.rdw.nl/resource/jhie-znh9.json","https://opendata.rdw.nl/resource/kmfi-hrps.json"
"01HGVS","Personenauto","FIAT","PANDA","20250524","20210304","523","hatchback","5","BLAUW","Niet geregistreerd","4","1108","690","1150","790","200","800","20010710","20010710","Geen verstrekking in Open Data",,"Ja",,,,,,,"2","4","0","0",,"341","0","M1",,,"op r. schroefveerkoker onder motorkap","1150",,,"e3*96/27*0012*03","AW53A","04","1","0.05","216","Nee","Nee",,"Nee","1950","0",,"2024","Onlogisch","04","Ja","2025-05-24T00:00:00.000","2021-03-04T00:00:00.000","2001-07-10T00:00:00.000","2001-07-10T00:00:00.000",,,,,,,,,,,,,,,,,,,,,"D",,,,,,,"https://opendata.rdw.nl/resource/3huj-srit.json","https://opendata.rdw.nl/resource/8ys7-d773.json","https://opendata.rdw.nl/resource/vezc-m2t6.json","https://opendata.rdw.nl/resource/jhie-znh9.json","https://opendata.rdw.nl/resource/kmfi-hrps.json"