"kenteken","voertuigsoort","merk","handelsbenaming","vervaldatum_apk","datum_tenaamstelling","bruto_bpm","inrichting","aantal_zitplaatsen","eerste_kleur","tweede_kleur","aantal_cilinders","cilinderinhoud","massa_ledig_voertuig","toegestane_maximum_massa_voertuig","massa_rijklaar","maximum_massa_trekken_ongeremd","maximum_trekken_massa_geremd","datum_eerste_toelating","datum_eerste_tenaamstelling_in_nederland","wacht_op_keuren","catalogusprijs","wam_verzekerd","maximale_constructiesnelheid","laadvermogen","oplegger_geremd","aanhangwagen_autonoom_geremd","aanhangwagen_middenas_geremd","aantal_staanplaatsen","aantal_deuren","aantal_wielen","afstand_hart_koppeling_tot_achterzijde_voertuig","afstand_voorzijde_voertuig_tot_hart_koppeling","afwijkende_maximum_snelheid","lengte","breedte","europese_voertuigcategorie","europese_voertuigcategorie_toevoeging","europese_uitvoeringcategorie_toevoeging","plaats_chassisnummer","technische_max_massa_voertuig","type","type_gasinstallatie","typegoedkeuringsnummer","variant","uitvoering","volgnummer_wijziging_eu_typegoedkeuring","vermogen_massarijklaar","wielbasis","export_indicator","openstaande_terugroepactie_indicator","vervaldatum_tachograaf","taxi_indicator","maximum_massa_samenstelling","aantal_rolstoelplaatsen","maximum_ondersteunende_snelheid","jaar_laatste_registratie_tellerstand","tellerstandoordeel","code_toelichting_tellerstandoordeel","tenaamstellen_mogelijk","vervaldatum_apk_dt","datum_tenaamstelling_dt","datum_eerste_toelating_dt","datum_eerste_tenaamstelling_in_nederland_dt","vervaldatum_tachograaf_dt","maximum_last_onder_de_vooras_sen_tezamen_koppeling","type_remsysteem_voertuig_code","rupsonderstelconfiguratiecode","wielbasis_voertuig_minimum","wielbasis_voertuig_maximum","lengte_voertuig_minimum","lengte_voertuig_maximum","breedte_voertuig_minimum","breedte_voertuig_maximum","hoogte_voertuig","hoogte_voertuig_minimum","hoogte_voertuig_maximum","massa_bedrijfsklaar_minimaal","massa_bedrijfsklaar_maximaal","technisch_toelaatbaar_massa_koppelpunt","maximum_massa_technisch_maximaal","maximum_massa_technisch_minimaal","subcategorie_nederland","verticale_belasting_koppelpunt_getrokken_voertuig","zuinigheidsclassificatie","registratie_datum_goedkeuring_afschrijvingsmoment_bpm","registratie_datum_goedkeuring_afschrijvingsmoment_bpm_dt","gem_lading_wrde","aerodyn_voorz","massa_alt_aandr","verl_cab_ind","api_gekentekende_voertuigen_assen","api_gekentekende_voertuigen_brandstof","api_gekentekende_voertuigen_carrosserie","api_gekentekende_voertuigen_carrosserie_specifiek","api_gekentekende_voertuigen_voertuigklasse"
"VHR55T","Bedrijfsauto","DODGE","DODGE RAM 1500 LIMITED","20241222","20231103","20904","pick-up truck","5","N.v.t.","N.v.t.","8","5654","2600","3500","2700","750",,"20201222","20201222","Geen verstrekking in Open Data","92116","Ja",,"900",,"3500","3500",,"4","4",,,,,"209","N1",,,,"3500",,,,,,,"0.11","368","Nee","Nee",,"Nee","7000",,,"2023","Logisch","00","Ja","2024-12-22T00:00:00.000","2023-11-03T00:00:00.000","2020-12-22T00:00:00.000","2020-12-22T00:00:00.000",,,,,,,,,,,,,,,,,,,,,,,,,,,,"https://opendata.rdw.nl/resource/3huj-srit.json","https://opendata.rdw.nl/resource/8ys7-d773.json","https://opendata.rdw.nl/resource/vezc-m2t6.json","https://opendata.rdw.nl/resource/jhie-znh9.json","https://opendata.rdw.nl/resource/kmfi-hrps.json"
"VN479G","Bedrijfsauto","DODGE","DODGE RAM 1500 LIMITED","20250403","20200125","11529","pick-up truck","5","N.v.t.","N.v.t.","8","5654","2659","3500","2759","750",,"20150317","20150317","Geen verstrekking in Open Data","52651","Ja",,"841",,"3500","3500",,,"4",,,,,"202","N1",,,"r. balk a. vooras","3500",,"115R gasinstallatie",,,,,"0.11","355","Nee","Ja",,"Nee","7000",,,"2024","Logisch","00","Ja","2025-04-03T00:00:00.000","2020-01-25T00:00:00.000","2015-03-17T00:00:00.000","2015-03-17T00:00:00.000",,"0",,,,,,,,,,,,,,,,,,,,,,,,,,"https://opendata.rdw.nl/resource/3huj-srit.json","https://opendata.rdw.nl/resource/8ys7-d773.json","https://opendata.rdw.nl/resource/vezc-m2t6.json","https://opendata.rdw.nl/resource/jhie-znh9.json","https://opendata.rdw.nl/resource/kmfi-hrps.json"
"VPS70V","Bedrijfsauto","DODGE","DODGE RAM 1500 LIMITED","20250417","20220524","25267","pick-up truck","5","N.v.t.","N.v.t.","8","5654","2612","3500","2712","750",,"20210417","20220524","Geen verstrekking in Open Data","110482","Ja","170","888",,"3500","3500",,"4","4",,,,,"209","N1",,,,"3500","E-TORQUE","115R gasinstallatie",,,,,"0.11","368","Nee","Nee",,"Nee","7000",,,"2024","Geen oordeel","05","Ja","2025-04-17T00:00:00.000","2022-05-24T00:00:00.000","2021-04-17T00:00:00.000","2022-05-24T00:00:00.000",,,,,,,,,,,,,,,,,,,,,,"20220414","2022-04-14T00:00:00.000",,,,,"https://opendata.rdw.nl/resource/3huj-srit.json","https://opendata.rdw.nl/resource/8ys7-d773.json","https://opendata.rdw.nl/resource/vezc-m2t6.json","https://opendata.rdw.nl/resource/jhie-znh9.json","https://opendata.rdw.nl/resource/kmfi-hrps.json"
"VPX22R","Bedrijfsauto","DODGE","DODGE RAM 1500 LIMITED","20250223","20221202","27687","pick-up truck","5","N.v.t.","N.v.t.","8","5654","2612","3500","2712","750",,"20210223","20221202","Geen verstrekking in Open Data","120668","Ja","170","888",,"3500","3500",,,"4",,,,"592","209","N1",,,,"3500","RAM 1500","115R gasinstallatie",,,,,"0.11","368","Nee","Nee",,"Nee","7000",,,"2024","Geen oordeel","05","Ja","2025-02-23T00:00:00.000","2022-12-02T00:00:00.000","2021-02-23T00:00:00.000","2022-12-02T00:00:00.000",,,,,,,,,,,"197",,,,,,,,,,,"20220506","2022-05-06T00:00:00.000",,,,,"https://opendata.rdw.nl/resource/3huj-srit.json","https://opendata.rdw.nl/resource/8ys7-d773.json","https://opendata.rdw.nl/resource/vezc-m2t6.json","https://opendata.rdw.nl/resource/jhie-znh9.json","https://opendata.rdw.nl/resource/kmfi-hrps.json"
"VRD54K","Bedrijfsauto","DODGE","DODGE RAM 1500 LIMITED","20250312","20220617","25861","pick-up truck","5","N.v.t.","N.v.t.","8","5654","2524","3500","2624","750",,"20200312","20220617","Geen verstrekking in Open Data","112982","Ja","170","976",,"3500","3500",,,"4",,,,"592","209","N1",,,,"3500",,,,,,,"0.11","368","Nee","Nee",,"Nee","7000",,,"2024","Geen oordeel","05","Ja","2025-03-12T00:00:00.000","2022-06-17T00:00:00.000","2020-03-12T00:00:00.000","2022-06-17T00:00:00.000",,,,,,,,,,,"197",,,,,,,,,,,"20220519","2022-05-19T00:00:00.000",,,,,"https://opendata.rdw.nl/resource/3huj-srit.json","https://opendata.rdw.nl/resource/8ys7-d773.json","https://opendata.rdw.nl/resource/vezc-m2t6.json","https://opendata.rdw.nl/resource/jhie-znh9.json","https://opendata.rdw.nl/resource/kmfi-hrps.json"
"VS337D","Bedrijfsauto","DODGE","DODGE RAM 1500 LIMITED","20240805","20210727","7535","pick-up truck","5","N.v.t.","N.v.t.","8","5654","2659","3500","2759","750",,"20151103","20151103","Geen verstrekking in Open Data","35885","Ja",,"841",,"3500","3500",,,"4",,,,,"202","N1",,,"onderop r. balk 125 cm a. vooras","3500",,"115R gasinstallatie",,,,,"0.11","356","Nee","Nee",,"Nee","7000",,,"2023","Logisch","00","Ja","2024-08-05T00:00:00.000","2021-07-27T00:00:00.000","2015-11-03T00:00:00.000","2015-11-03T00:00:00.000",,"0",,,,,,,,,,,,,,,,,,,,,,,,,,"https://opendata.rdw.nl/resource/3huj-srit.json","https://opendata.rdw.nl/resource/8ys7-d773.json","https://opendata.rdw.nl/resource/vezc-m2t6.json","https://opendata.rdw.nl/resource/jhie-znh9.json","https://opendata.rdw.nl/resource/kmfi-hrps.json"
"VS433J","Bedrijfsauto","DODGE","DODGE RAM 1500 LIMITED","20240720","20210702","7535","pick-up truck","5","N.v.t.","N.v.t.","8","5654","2659","3500","2759","750",,"20160101","20160101","Geen verstrekking in Open Data","35837","Ja",,"841",,"3500","3500",,,"4",,,,,"202","N1",,,"r. balk","3500",,"115R gasinstallatie",,,,,"0.11","357","Nee","Ja",,"Nee","7000",,,"2024","Logisch","00","Ja","2024-07-20T00:00:00.000","2021-07-02T00:00:00.000","2016-01-01T00:00:00.000","2016-01-01T00:00:00.000",,"0",,,,,,,,,,,,,,,,,,,,,,,,,,"https://opendata.rdw.nl/resource/3huj-srit.json","https://opendata.rdw.nl/resource/8ys7-d773.json","https://opendata.rdw.nl/resource/vezc-m2t6.json","https://opendata.rdw.nl/resource/jhie-znh9.json","https://opendata.rdw.nl/resource/kmfi-hrps.json"
"VS435J","Bedrijfsauto","DODGE","DODGE RAM 1500 LIMITED","20250124","20151211","7535","pick-up truck","5","N.v.t.","N.v.t.","8","5654","2563","3500","2663","750",,"20151211","20151211","Geen verstrekking in Open Data","35837","Ja",,"937",,"3500","3500",,,"4",,,,,"202","N1",,,"r. balk","3500",,,,,,,"0.11","357","Nee","Ja",,"Nee","7000",,,"2024","Logisch","00","Ja","2025-01-24T00:00:00.000","2015-12-11T00:00:00.000","2015-12-11T00:00:00.000","2015-12-11T00:00:00.000",,"0",,,,,,,,,,,,,,,,,,,,,,,,,,"https://opendata.rdw.nl/resource/3huj-srit.json","https://opendata.rdw.nl/resource/8ys7-d773.json","https://opendata.rdw.nl/resource/vezc-m2t6.json","https://opendata.rdw.nl/resource/jhie-znh9.json","https://opendata.rdw.nl/resource/kmfi-hrps.json"
"VS449J","Bedrijfsauto","DODGE","DODGE RAM 1500 LIMITED","20250101","20211222","7535","pick-up truck","5","N.v.t.","N.v.t.","8","5654","2723","3500","2823","750",,"20160101","20160101","Geen verstrekking in Open Data","35837","Ja",,"777",,"3500","3500",,,"4",,,,,"202","N1",,,"r. balk","3500",,,,,,,"0.10","357","Nee","Ja",,"Nee","7000",,,"2023","Logisch","00","Ja","2025-01-01T00:00:00.000","2021-12-22T00:00:00.000","2016-01-01T00:00:00.000","2016-01-01T00:00:00.000",,,,,,,,,,,,,,,,,,,,,,,,,,,,"https://opendata.rdw.nl/resource/3huj-srit.json","https://opendata.rdw.nl/resource/8ys7-d773.json","https://opendata.rdw.nl/resource/vezc-m2t6.json","https://opendata.rdw.nl/resource/jhie-znh9.json","https://opendata.rdw.nl/resource/kmfi-hrps.json"
"VS672D","Bedrijfsauto","DODGE","DODGE RAM 1500 LIMITED","20241208","20180316","7535","pick-up truck","5","N.v.t.","N.v.t.","8","5654","2723","3500","2823","750",,"20151119","20151119","Geen verstrekking in Open Data","35885","Ja",,"777",,"3500","3500",,,"4",,,,,"202","N1",,,"onderop r. balk 125 cm a. vooras","3500",,"115R gasinstallatie",,,,,"0.10","356","Nee","Ja",,"Nee","7000",,,"2023","Logisch","00","Ja","2024-12-08T00:00:00.000","2018-03-16T00:00:00.000","2015-11-19T00:00:00.000","2015-11-19T00:00:00.000",,"0",,,,,,,,,,,,,,,,,,,,,,,,,,"https://opendata.rdw.nl/resource/3huj-srit.json","https://opendata.rdw.nl/resource/8ys7-d773.json","https://opendata.rdw.nl/resource/vezc-m2t6.json","https://opendata.rdw.nl/resource/jhie-znh9.json","https://opendata.rdw.nl/resource/kmfi-hrps.json"
"VS683D","Bedrijfsauto","DODGE","DODGE RAM 1500 LIMITED","20241228","20230707","7535","pick-up truck","5","N.v.t.","N.v.t.","8","5654","2659","3500","2759","750",,"20151130","20151130","Geen verstrekking in Open Data","35885","Ja",,"841",,"3500","3500",,,"4",,,,,"202","N1",,,"onderop r. balk 125 cm a. vooras","3500",,"115R gasinstallatie",,,,,"0.11","356","Nee","Ja",,"Nee","7000",,,"2023","Logisch","00","Ja","2024-12-28T00:00:00.000","2023-07-07T00:00:00.000","2015-11-30T00:00:00.000","2015-11-30T00:00:00.000",,"0",,,,,,,,,,,,,,,,,,,,,,,,,,"https://opendata.rdw.nl/resource/3huj-srit.json","https://opendata.rdw.nl/resource/8ys7-d773.json","https://opendata.rdw.nl/resource/vezc-m2t6.json","https://opendata.rdw.nl/resource/jhie-znh9.json","https://opendata.rdw.nl/resource/kmfi-hrps.json"
"VS697D","Bedrijfsauto","DODGE","DODGE RAM 1500 LIMITED","20241103","20221031","7535","pick-up truck","5","N.v.t.","N.v.t.","8","5654","2659","3500","2759","750",,"20160108","20160108","Geen verstrekking in Open Data","35885","Ja",,"841",,"3500","3500",,,"4",,,,,"202","N1",,,"onderop r. balk 125 cm a. vooras","3500",,"115R gasinstallatie",,,,,"0.11","356","Nee","Ja",,"Nee","7000",,,"2023","Logisch","00","Ja","2024-11-03T00:00:00.000","2022-10-31T00:00:00.000","2016-01-08T00:00:00.000","2016-01-08T00:00:00.000",,"0",,,,,,,,,,,,,,,,,,,,,,,,,,"https://opendata.rdw.nl/resource/3huj-srit.json","https://opendata.rdw.nl/resource/8ys7-d773.json","https://opendata.rdw.nl/resource/vezc-m2t6.json","https://opendata.rdw.nl/resource/jhie-znh9.json","https://opendata.rdw.nl/resource/kmfi-hrps.json"
"VS825F","Bedrijfsauto","DODGE","DODGE RAM 1500 LIMITED","20241113","20221117","7535","pick-up truck","5","N.v.t.","N.v.t.","8","5654","2659","3500","2759","750",,"20151113","20151113","Geen verstrekking in Open Data","35885","Ja",,"841",,"3500","3500",,,"4",,,,,"202","N1",,,"onderop r. balk 125 cm a. vooras","3500",,"115R gasinstallatie",,,,,"0.11","356","Nee","Ja",,"Nee","7000",,,"2023","Logisch","00","Ja","2024-11-13T00:00:00.000","2022-11-17T00:00:00.000","2015-11-13T00:00:00.000","2015-11-13T00:00:00.000",,"0",,,,,,,,,,,,,,,,,,,,,,,,,,"https://opendata.rdw.nl/resource/3huj-srit.json","https://opendata.rdw.nl/resource/8ys7-d773.json","https://opendata.rdw.nl/resource/vezc-m2t6.json","https://opendata.rdw.nl/resource/jhie-znh9.json","https://opendata.rdw.nl/resource/kmfi-hrps.json"
"VS828F","Bedrijfsauto","DODGE","DODGE RAM 1500 LIMITED","20240614","20220212","7535","pick-up truck","5","N.v.t.","N.v.t.","8","5654","2659","3500","2759","750",,"20151113","20151113","Geen verstrekking in Open Data","35885","Ja",,"841",,"3500","3500",,"4","4",,,,,"202","N1",,,"onderop r. balk 125 cm a. vooras","3500",,,,,,,"0.11","356","Nee","Ja",,"Nee","7000",,,"2023","Logisch","00","Ja","2024-06-14T00:00:00.000","2022-02-12T00:00:00.000","2015-11-13T00:00:00.000","2015-11-13T00:00:00.000",,,,,,,,,,,,,,,,,,,,,,"20230614","2023-06-14T00:00:00.000",,,,,"https://opendata.rdw.nl/resource/3huj-srit.json","https://opendata.rdw.nl/resource/8ys7-d773.json","https://opendata.rdw.nl/resource/vezc-m2t6.json","https://opendata.rdw.nl/resource/jhie-znh9.json","https://opendata.rdw.nl/resource/kmfi-hrps.json"
"VS966S","Bedrijfsauto","DODGE","DODGE RAM 1500 LIMITED","20250410","20221119","7535","pick-up truck","5","N.v.t.","N.v.t.","8","5654","2659","3500","2759","750",,"20160104","20160104","Geen verstrekking in Open Data","35837","Ja",,"841",,"3500","3500",,,"4",,,,,"202","N1",,,"onderop r. balk 120 cm a. vooras","3500",,"115R gasinstallatie",,,,,"0.11","358","Nee","Nee",,"Nee","7000",,,"2024","Logisch","00","Ja","2025-04-10T00:00:00.000","2022-11-19T00:00:00.000","2016-01-04T00:00:00.000","2016-01-04T00:00:00.000",,"0",,,,,,,,,,,,,,,,,,,,,,,,,,"https://opendata.rdw.nl/resource/3huj-srit.json","https://opendata.rdw.nl/resource/8ys7-d773.json","https://opendata.rdw.nl/resource/vezc-m2t6.json","https://opendata.rdw.nl/resource/jhie-znh9.json","https://opendata.rdw.nl/resource/kmfi-hrps.json"
"VX592R","Bedrijfsauto","DODGE","DODGE RAM 1500 LIMITED","20240808","20160702","7535","pick-up truck","5","N.v.t.","N.v.t.","8","5654","2661","3500","2761","750",,"20160702","20160702","Geen verstrekking in Open Data","35836","Ja",,"839",,"3500","3500",,,"4",,,,,"202","N1",,,"r. balk a. vooras","3500",,"115R gasinstallatie",,,,,"0.11","355","Nee","Ja",,"Nee","7000",,,"2023","Logisch","00","Ja","2024-08-08T00:00:00.000","2016-07-02T00:00:00.000","2016-07-02T00:00:00.000","2016-07-02T00:00:00.000",,"0",,,,,,,,,,,,,,,,,,,,,,,,,,"https://opendata.rdw.nl/resource/3huj-srit.json","https://opendata.rdw.nl/resource/8ys7-d773.json","https://opendata.rdw.nl/resource/vezc-m2t6.json","https://opendata.rdw.nl/resource/jhie-znh9.json","https://opendata.rdw.nl/resource/kmfi-hrps.json"
"VX620R","Bedrijfsauto","DODGE","DODGE RAM 1500 LIMITED","20240903","20210823","7535","pick-up truck","5","N.v.t.","N.v.t.","8","5654","2661","3500","2761","750",,"20160902","20160902","Geen verstrekking in Open Data","35836","Ja",,"839",,"3500","3500",,,"4",,,,,"202","N1",,,"r. balk a. vooras","3500",,"115R gasinstallatie",,,,,"0.11","355","Nee","Ja",,"Nee","7000",,,"2023","Logisch","00","Ja","2024-09-03T00:00:00.000","2021-08-23T00:00:00.000","2016-09-02T00:00:00.000","2016-09-02T00:00:00.000",,"0",,,,,,,,,,,,,,,,,,,,,,,,,,"https://opendata.rdw.nl/resource/3huj-srit.json","https://opendata.rdw.nl/resource/8ys7-d773.json","https://opendata.rdw.nl/resource/vezc-m2t6.json","https://opendata.rdw.nl/resource/jhie-znh9.json","https://opendata.rdw.nl/resource/kmfi-hrps.json"
"VPJ48B","Bedrijfsauto","DODGE","DODGE RAM 1500 LIMITED","20250701","20220325","22091","pick-up truck","5","N.v.t.","N.v.t.","8","5654","2652","3500","2752","750",,"20200701","20220325","Geen verstrekking in Open Data","97111","Ja","170","848",,"3500","3500",,,"4",,,,"592","209","N1",,,,"3500","RAM 1500","115R gasinstallatie",,,,,"0.11","368","Nee","Ja",,"Nee","7000",,,"2024","Geen oordeel","05","Ja","2025-07-01T00:00:00.000","2022-03-25T00:00:00.000","2020-07-01T00:00:00.000","2022-03-25T00:00:00.000",,,,,,,,,,,"197",,,,,,,,,,,"20220315","2022-03-15T00:00:00.000",,,,,"https://opendata.rdw.nl/resource/3huj-srit.json","https://opendata.rdw.nl/resource/8ys7-d773.json","https://opendata.rdw.nl/resource/vezc-m2t6.json","https://opendata.rdw.nl/resource/jhie-znh9.json","https://opendata.rdw.nl/resource/kmfi-hrps.json"
"VS338D","Bedrijfsauto","DODGE","DODGE RAM 1500 LIMITED","20250614","20220529","7535","pick-up truck","5","N.v.t.","N.v.t.","8","5654","2747","3500","2847","750",,"20151103","20151103","Geen verstrekking in Open Data","35837","Ja",,"753",,"3500","3500",,,"4",,,,,"202","N1",,,"onderop r. balk 125 cm a. vooras","3500",,"115R gasinstallatie",,,,,"0.10","356","Nee","Nee",,"Nee","7000",,,"2024","Logisch","00","Ja","2025-06-14T00:00:00.000","2022-05-29T00:00:00.000","2015-11-03T00:00:00.000","2015-11-03T00:00:00.000",,"0",,,,,,,,,,,,,,,,,,,,,,,,,,"https://opendata.rdw.nl/resource/3huj-srit.json","https://opendata.rdw.nl/resource/8ys7-d773.json","https://opendata.rdw.nl/resource/vezc-m2t6.json","https://opendata.rdw.nl/resource/jhie-znh9.json","https://opendata.rdw.nl/resource/kmfi-hrps.json"
"VS679D","Bedrijfsauto","DODGE","DODGE RAM 1500 LIMITED","20250201","20240614","7535","pick-up truck","5","N.v.t.","N.v.t.","8","5654","2659","3500","2759","750",,"20160102","20160102","Geen verstrekking in Open Data","35885","Nee",,"841",,"3500","3500",,,"4",,,,,"202","N1",,,"onderop r. balk 125 cm a. vooras","3500",,"115R gasinstallatie",,,,,"0.11","356","Nee","Ja",,"Nee","7000",,,"2024","Logisch","00","Ja","2025-02-01T00:00:00.000","2024-06-14T00:00:00.000","2016-01-02T00:00:00.000","2016-01-02T00:00:00.000",,"0",,,,,,,,,,,,,,,,,,,,,,,,,,"https://opendata.rdw.nl/resource/3huj-srit.json","https://opendata.rdw.nl/resource/8ys7-d773.json","https://opendata.rdw.nl/resource/vezc-m2t6.json","https://opendata.rdw.nl/resource/jhie-znh9.json","https://opendata.rdw.nl/resource/kmfi-hrps.json"
