"kenteken","voertuigsoort","merk","handelsbenaming","vervaldatum_apk","datum_tenaamstelling","bruto_bpm","inrichting","aantal_zitplaatsen","eerste_kleur","tweede_kleur","aantal_cilinders","cilinderinhoud","massa_ledig_voertuig","toegestane_maximum_massa_voertuig","massa_rijklaar","maximum_massa_trekken_ongeremd","maximum_trekken_massa_geremd","datum_eerste_toelating","datum_eerste_tenaamstelling_in_nederland","wacht_op_keuren","catalogusprijs","wam_verzekerd","maximale_constructiesnelheid","laadvermogen","oplegger_geremd","aanhangwagen_autonoom_geremd","aanhangwagen_middenas_geremd","aantal_staanplaatsen","aantal_deuren","aantal_wielen","afstand_hart_koppeling_tot_achterzijde_voertuig","afstand_voorzijde_voertuig_tot_hart_koppeling","afwijkende_maximum_snelheid","lengte","breedte","europese_voertuigcategorie","europese_voertuigcategorie_toevoeging","europese_uitvoeringcategorie_toevoeging","plaats_chassisnummer","technische_max_massa_voertuig","type","type_gasinstallatie","typegoedkeuringsnummer","variant","uitvoering","volgnummer_wijziging_eu_typegoedkeuring","vermogen_massarijklaar","wielbasis","export_indicator","openstaande_terugroepactie_indicator","vervaldatum_tachograaf","taxi_indicator","maximum_massa_samenstelling","aantal_rolstoelplaatsen","maximum_ondersteunende_snelheid","jaar_laatste_registratie_tellerstand","tellerstandoordeel","code_toelichting_tellerstandoordeel","tenaamstellen_mogelijk","vervaldatum_apk_dt","datum_tenaamstelling_dt","datum_eerste_toelating_dt","datum_eerste_tenaamstelling_in_nederland_dt","vervaldatum_tachograaf_dt","maximum_last_onder_de_vooras_sen_tezamen_koppeling","type_remsysteem_voertuig_code","rupsonderstelconfiguratiecode","wielbasis_voertuig_minimum","wielbasis_voertuig_maximum","lengte_voertuig_minimum","lengte_voertuig_maximum","breedte_voertuig_minimum","breedte_voertuig_maximum","hoogte_voertuig","hoogte_voertuig_minimum","hoogte_voertuig_maximum","massa_bedrijfsklaar_minimaal","massa_bedrijfsklaar_maximaal","technisch_toelaatbaar_massa_koppelpunt","maximum_massa_technisch_maximaal","maximum_massa_technisch_minimaal","subcategorie_nederland","verticale_belasting_koppelpunt_getrokken_voertuig","zuinigheidsclassificatie","registratie_datum_goedkeuring_afschrijvingsmoment_bpm","registratie_datum_goedkeuring_afschrijvingsmoment_bpm_dt","gem_lading_wrde","aerodyn_voorz","massa_alt_aandr","verl_cab_ind","api_gekentekende_voertuigen_assen","api_gekentekende_voertuigen_brandstof","api_gekentekende_voertuigen_carrosserie","api_gekentekende_voertuigen_carrosserie_specifiek","api_gekentekende_voertuigen_voertuigklasse"
"V307FV","Bedrijfsauto","DFSK","V22","20250417","20231122","4468","open laadvloer","5","N.v.t.","N.v.t.","4","1310","1064","1960","1164",,,"20170412","20170412","Geen verstrekking in Open Data","22621","Ja",,"896",,,,,,"4",,,,,"164","N1",,,"r. balk by vooras","1960","CV21",,,,,,"0.05","282","Nee","Nee",,"Nee",,,,"2023","Logisch","00","Ja","2025-04-17T00:00:00.000","2023-11-22T00:00:00.000","2017-04-12T00:00:00.000","2017-04-12T00:00:00.000",,"0",,,,,,,,,,,,,,,,,,,,,,,,,,"https://opendata.rdw.nl/resource/3huj-srit.json","https://opendata.rdw.nl/resource/8ys7-d773.json","https://opendata.rdw.nl/resource/vezc-m2t6.json","https://opendata.rdw.nl/resource/jhie-znh9.json","https://opendata.rdw.nl/resource/kmfi-hrps.json"
"V388RF","Bedrijfsauto","DFSK","K01H","20240803","20180803","3865","open laadvloer","2","N.v.t.","N.v.t.","4","1240","858","1865","958",,,"20180803","20180803","Geen verstrekking in Open Data","21199","Ja",,"1007",,,,,"2","4","0","0",,"428","156","N1",,,,"1865","CLH",,"e4*2007/46*1171*00","CLH","CLH","0","0.06","276","Nee","Nee",,"Nee","0","0","0.00","2023","Logisch","00","Ja","2024-08-03T00:00:00.000","2018-08-03T00:00:00.000","2018-08-03T00:00:00.000","2018-08-03T00:00:00.000",,,,,,,,,,,"185",,,,,,,,,,,,,,,,,"https://opendata.rdw.nl/resource/3huj-srit.json","https://opendata.rdw.nl/resource/8ys7-d773.json","https://opendata.rdw.nl/resource/vezc-m2t6.json","https://opendata.rdw.nl/resource/jhie-znh9.json","https://opendata.rdw.nl/resource/kmfi-hrps.json"
"V66FNR","Bedrijfsauto","DFSK","C32","20280521","20240521","5088","open laadvloer","5","N.v.t.","N.v.t.","4","1493","1202","2315","1302",,,"20240521","20240521","Geen verstrekking in Open Data","25537","Ja","100","1113",,,,,"4","4","0","0",,"404","166","N1",,,,"2315","C32",,"e24*KS07/46*0641*00","C32","C32","0","0.06","305","Nee","Nee",,"Nee","0","0","0.00","2024","Logisch","00","Ja","2028-05-21T00:00:00.000","2024-05-21T00:00:00.000","2024-05-21T00:00:00.000","2024-05-21T00:00:00.000",,,,,,,,,,,"191",,,,,,,,,,,"20240512","2024-05-12T00:00:00.000",,,,,"https://opendata.rdw.nl/resource/3huj-srit.json","https://opendata.rdw.nl/resource/8ys7-d773.json","https://opendata.rdw.nl/resource/vezc-m2t6.json","https://opendata.rdw.nl/resource/jhie-znh9.json","https://opendata.rdw.nl/resource/kmfi-hrps.json"
"V67FNR","Bedrijfsauto","DFSK","C32","20280521","20240521","5088","open laadvloer","5","N.v.t.","N.v.t.","4","1493","1202","2315","1302",,,"20240521","20240521","Geen verstrekking in Open Data","25537","Ja","100","1113",,,,,"4","4","0","0",,"494","166","N1",,,,"2315","C32",,"e24*KS07/46*0641*00","C32","C32","0","0.06","305","Nee","Nee",,"Nee","0","0","0.00","2024","Logisch","00","Ja","2028-05-21T00:00:00.000","2024-05-21T00:00:00.000","2024-05-21T00:00:00.000","2024-05-21T00:00:00.000",,,,,,,,,,,"191",,,,,,,,,,,"20240512","2024-05-12T00:00:00.000",,,,,"https://opendata.rdw.nl/resource/3huj-srit.json","https://opendata.rdw.nl/resource/8ys7-d773.json","https://opendata.rdw.nl/resource/vezc-m2t6.json","https://opendata.rdw.nl/resource/jhie-znh9.json","https://opendata.rdw.nl/resource/kmfi-hrps.json"
"VD413G","Bedrijfsauto","DFSK","MINI TRUCK","20250331","20170330","3101","open laadvloer","2","N.v.t.","N.v.t.","4","1310","975","1915","1075",,,"20120228","20170330","Geen verstrekking in Open Data","17173","Ja",,"940",,,,,,"4",,,,,"164","N1",,,"bodemplaat r. voorzitting","1915","CV21",,,,,,"0.05","282","Nee","Nee",,"Nee",,,,"2024","Niet geregistreerd","NG","Ja","2025-03-31T00:00:00.000","2017-03-30T00:00:00.000","2012-02-28T00:00:00.000","2017-03-30T00:00:00.000",,"0",,,,,,,,,,,,,,,,,,,,,,,,,,"https://opendata.rdw.nl/resource/3huj-srit.json","https://opendata.rdw.nl/resource/8ys7-d773.json","https://opendata.rdw.nl/resource/vezc-m2t6.json","https://opendata.rdw.nl/resource/jhie-znh9.json","https://opendata.rdw.nl/resource/kmfi-hrps.json"
"VFN61T","Bedrijfsauto","DFSK","K01H","20260326","20200326","3807","open laadvloer","2","N.v.t.","N.v.t.","4","1240","858","1865","958",,,"20200326","20200326","Geen verstrekking in Open Data","20142","Ja","120","1007",,,,,"2","4","0","0",,"428","156","N1",,,,"1865","CLH1",,"e4*KS07/46*0032*01","N/A","N/A","0","0.07","276","Nee","Nee",,"Nee","0","0","0.00","2024","Logisch","00","Ja","2026-03-26T00:00:00.000","2020-03-26T00:00:00.000","2020-03-26T00:00:00.000","2020-03-26T00:00:00.000",,,,,,,,,,,"185",,,,,,,,,,,,,,,,,"https://opendata.rdw.nl/resource/3huj-srit.json","https://opendata.rdw.nl/resource/8ys7-d773.json","https://opendata.rdw.nl/resource/vezc-m2t6.json","https://opendata.rdw.nl/resource/jhie-znh9.json","https://opendata.rdw.nl/resource/kmfi-hrps.json"
"VFN76T","Bedrijfsauto","DFSK","K01H","20260321","20200321","3807","open laadvloer","2","N.v.t.","N.v.t.","4","1240","858","1865","958",,,"20200321","20200321","Geen verstrekking in Open Data","20142","Ja","120","1007",,,,,"2","4","0","0",,"428","156","N1",,,,"1865","CLH1",,"e4*KS07/46*0032*01","N/A","N/A","0","0.07","276","Nee","Nee",,"Nee","0","0","0.00","2024","Logisch","00","Ja","2026-03-21T00:00:00.000","2020-03-21T00:00:00.000","2020-03-21T00:00:00.000","2020-03-21T00:00:00.000",,,,,,,,,,,"185",,,,,,,,,,,,,,,,,"https://opendata.rdw.nl/resource/3huj-srit.json","https://opendata.rdw.nl/resource/8ys7-d773.json","https://opendata.rdw.nl/resource/vezc-m2t6.json","https://opendata.rdw.nl/resource/jhie-znh9.json","https://opendata.rdw.nl/resource/kmfi-hrps.json"
"VH212K","Bedrijfsauto","DFSK","K01H","20240216","20220829","3499","open laadvloer","2","N.v.t.","N.v.t.","4","1310","920","1865","1020",,,"20140313","20140313","Geen verstrekking in Open Data","12685","Ja",,"945",,,,,"0","4","0","0",,"428","156","N1",,,"r. bodemplaat by voorzitting","1865","CLV",,"e4*2007/46*0464*04","CLH","B","0","0.06","276","Nee","Nee",,"Nee","0","0",,"2023","Logisch","00","Ja","2024-02-16T00:00:00.000","2022-08-29T00:00:00.000","2014-03-13T00:00:00.000","2014-03-13T00:00:00.000",,"0",,,,,,,,,,,,,,,,,,,,,,,,,,"https://opendata.rdw.nl/resource/3huj-srit.json","https://opendata.rdw.nl/resource/8ys7-d773.json","https://opendata.rdw.nl/resource/vezc-m2t6.json","https://opendata.rdw.nl/resource/jhie-znh9.json","https://opendata.rdw.nl/resource/kmfi-hrps.json"
"VK119X","Bedrijfsauto","DFSK","K01H","20210323","20231020","4364","open laadvloer","2","N.v.t.","N.v.t.","4","1310","1120","1865","1220",,,"20150323","20150323","Geen verstrekking in Open Data","22489","Ja",,"745",,,,,,"4",,,,,"156","N1",,,"r. bodemplaat by voorzitting","1865","CLV",,,,,,"0.05","276","Nee","Nee",,"Nee",,,,"2023","Logisch","00","Ja","2021-03-23T00:00:00.000","2023-10-20T00:00:00.000","2015-03-23T00:00:00.000","2015-03-23T00:00:00.000",,"0",,,,,,,,,,,,,,,,,,,,,,,,,,"https://opendata.rdw.nl/resource/3huj-srit.json","https://opendata.rdw.nl/resource/8ys7-d773.json","https://opendata.rdw.nl/resource/vezc-m2t6.json","https://opendata.rdw.nl/resource/jhie-znh9.json","https://opendata.rdw.nl/resource/kmfi-hrps.json"
"VKN52K","Bedrijfsauto","DFSK","C32","20250521","20210521","4184","open laadvloer","5","N.v.t.","N.v.t.","4","1493","1202","2315","1302",,,"20210521","20210521","Geen verstrekking in Open Data","21729","Ja","100","1113",,,,,"4","4","0","0",,"494","166","N1",,,,"2315","C32",,"e24*KS07/46*0641*00","C32","C32","0","0.06","305","Nee","Nee",,"Nee","0","0","0.00","2021","Logisch","00","Ja","2025-05-21T00:00:00.000","2021-05-21T00:00:00.000","2021-05-21T00:00:00.000","2021-05-21T00:00:00.000",,,,,,,,,,,"191",,,,,,,,,,,,,,,,,"https://opendata.rdw.nl/resource/3huj-srit.json","https://opendata.rdw.nl/resource/8ys7-d773.json","https://opendata.rdw.nl/resource/vezc-m2t6.json","https://opendata.rdw.nl/resource/jhie-znh9.json","https://opendata.rdw.nl/resource/kmfi-hrps.json"
"VKN90K","Bedrijfsauto","DFSK","C32","20250521","20210521","4184","open laadvloer","5","N.v.t.","N.v.t.","4","1493","1202","2315","1302",,,"20210521","20210521","Geen verstrekking in Open Data","21729","Ja","100","1113",,,,,"4","4","0","0",,"494","166","N1",,,,"2315","C32",,"e24*KS07/46*0641*00","C32","C32","0","0.06","305","Nee","Nee",,"Nee","0","0","0.00","2021","Logisch","00","Ja","2025-05-21T00:00:00.000","2021-05-21T00:00:00.000","2021-05-21T00:00:00.000","2021-05-21T00:00:00.000",,,,,,,,,,,"191",,,,,,,,,,,,,,,,,"https://opendata.rdw.nl/resource/3huj-srit.json","https://opendata.rdw.nl/resource/8ys7-d773.json","https://opendata.rdw.nl/resource/vezc-m2t6.json","https://opendata.rdw.nl/resource/jhie-znh9.json","https://opendata.rdw.nl/resource/kmfi-hrps.json"
"VPF90J","Bedrijfsauto","DFSK","K01H","20260225","20220225","4278","open laadvloer","2","N.v.t.","N.v.t.","4","1240","858","1865","958",,,"20220225","20220225","Geen verstrekking in Open Data","22126","Ja","120","1007",,,,,"2","4","0","0",,"428","156","N1",,,,"1865","CLH1",,"e4*KS07/46*0032*01","N/A","N/A","0","0.07","276","Nee","Nee",,"Nee","0","0","0.00","2022","Logisch","00","Ja","2026-02-25T00:00:00.000","2022-02-25T00:00:00.000","2022-02-25T00:00:00.000","2022-02-25T00:00:00.000",,,,,,,,,,,"185",,,,,,,,,,,"20220225","2022-02-25T00:00:00.000",,,,,"https://opendata.rdw.nl/resource/3huj-srit.json","https://opendata.rdw.nl/resource/8ys7-d773.json","https://opendata.rdw.nl/resource/vezc-m2t6.json","https://opendata.rdw.nl/resource/jhie-znh9.json","https://opendata.rdw.nl/resource/kmfi-hrps.json"
"VPG94K","Bedrijfsauto","DFSK","K01H","20260315","20220315","4278","open laadvloer","2","N.v.t.","N.v.t.","4","1240","858","1865","958",,,"20220315","20220315","Geen verstrekking in Open Data","22126","Ja","120","1007",,,,,"2","4","0","0",,"428","156","N1",,,,"1865","CLH1",,"e4*KS07/46*0032*01","N/A","N/A","0","0.07","276","Nee","Nee",,"Nee","0","0","0.00","2022","Logisch","00","Ja","2026-03-15T00:00:00.000","2022-03-15T00:00:00.000","2022-03-15T00:00:00.000","2022-03-15T00:00:00.000",,,,,,,,,,,"185",,,,,,,,,,,"20220303","2022-03-03T00:00:00.000",,,,,"https://opendata.rdw.nl/resource/3huj-srit.json","https://opendata.rdw.nl/resource/8ys7-d773.json","https://opendata.rdw.nl/resource/vezc-m2t6.json","https://opendata.rdw.nl/resource/jhie-znh9.json","https://opendata.rdw.nl/resource/kmfi-hrps.json"
"VPS80F","Bedrijfsauto","DFSK","K01H","20260427","20220427","4278","open laadvloer","2","N.v.t.","N.v.t.","4","1240","858","1865","958",,,"20220427","20220427","Geen verstrekking in Open Data","22126","Ja","120","1007",,,,,"2","4","0","0",,"428","156","N1",,,,"1865","CLH1",,"e4*KS07/46*0032*01","N/A","N/A","0","0.07","276","Nee","Nee",,"Nee","0","0","0.00","2024","Logisch","00","Ja","2026-04-27T00:00:00.000","2022-04-27T00:00:00.000","2022-04-27T00:00:00.000","2022-04-27T00:00:00.000",,,,,,,,,,,"185",,,,,,,,,,,"20220422","2022-04-22T00:00:00.000",,,,,"https://opendata.rdw.nl/resource/3huj-srit.json","https://opendata.rdw.nl/resource/8ys7-d773.json","https://opendata.rdw.nl/resource/vezc-m2t6.json","https://opendata.rdw.nl/resource/jhie-znh9.json","https://opendata.rdw.nl/resource/kmfi-hrps.json"
"VT431L","Bedrijfsauto","DFSK","K01H","20240224","20240506","3902","open laadvloer","2","N.v.t.","N.v.t.","4","1310","858","1865","958",,,"20160224","20160224","Geen verstrekking in Open Data","20546","Ja",,"1007",,,,,"2","4","0","0",,"428","156","N1",,,"in motorruimte r.","1865","CLV",,"e4*2007/46*0464*05","CLH","B","0","0.06","276","Nee","Nee",,"Nee","0","0","0.00","2024","Logisch","00","Ja","2024-02-24T00:00:00.000","2024-05-06T00:00:00.000","2016-02-24T00:00:00.000","2016-02-24T00:00:00.000",,,,,,,,,,,"183",,,,,,,,,,,,,,,,,"https://opendata.rdw.nl/resource/3huj-srit.json","https://opendata.rdw.nl/resource/8ys7-d773.json","https://opendata.rdw.nl/resource/vezc-m2t6.json","https://opendata.rdw.nl/resource/jhie-znh9.json","https://opendata.rdw.nl/resource/kmfi-hrps.json"
"VT836V","Bedrijfsauto","DFSK","K01H","20240308","20240601","4951","open laadvloer","2","N.v.t.","N.v.t.","4","1310","1040","1865","1140",,,"20160308","20160308","Geen verstrekking in Open Data","20007","Nee",,"825",,,,,"2","4","0","0",,"428","156","N1",,,"in motorruimte r.","1865","CLV",,"e4*2007/46*0464*05","CLH","B","0","0.05","276","Nee","Nee",,"Nee","0","0","0.00","2024","Logisch","00","Ja","2024-03-08T00:00:00.000","2024-06-01T00:00:00.000","2016-03-08T00:00:00.000","2016-03-08T00:00:00.000",,,,,,,,,,,"183",,,,,,,,,,,,,,,,,"https://opendata.rdw.nl/resource/3huj-srit.json","https://opendata.rdw.nl/resource/8ys7-d773.json","https://opendata.rdw.nl/resource/vezc-m2t6.json","https://opendata.rdw.nl/resource/jhie-znh9.json","https://opendata.rdw.nl/resource/kmfi-hrps.json"
"VV045V","Bedrijfsauto","DFSK","K01H","20250204","20190116","4950","open laadvloer","2","N.v.t.","N.v.t.","4","1310","940","1865","1040",,,"20160520","20160520","Geen verstrekking in Open Data","24957","Ja",,"925",,,,,"2","4","0","0",,"0","156","N1",,,"r. bodemplaat by voorzitting","1865","CLV",,"e4*2007/46*0464*05","CLH","B","0","0.06","276","Nee","Nee",,"Nee","0","0","0.00","2024","Logisch","00","Ja","2025-02-04T00:00:00.000","2019-01-16T00:00:00.000","2016-05-20T00:00:00.000","2016-05-20T00:00:00.000",,"0",,,,,,,,,,,,,,,,,,,,,,,,,,"https://opendata.rdw.nl/resource/3huj-srit.json","https://opendata.rdw.nl/resource/8ys7-d773.json","https://opendata.rdw.nl/resource/vezc-m2t6.json","https://opendata.rdw.nl/resource/jhie-znh9.json","https://opendata.rdw.nl/resource/kmfi-hrps.json"
"VV812D","Bedrijfsauto","DFSK","V22","20241012","20240203","3976","open laadvloer","5","N.v.t.","N.v.t.","4","1310","1064","1960","1164",,,"20160331","20160331","Geen verstrekking in Open Data","22101","Ja",,"896",,,,,"4","4","0","0",,"464","164","N1",,,,"1960","CV21",,"e4*2007/46*0437*03","CV22","B","0","0.05","282","Nee","Nee",,"Nee","0","0","0.00","2024","Logisch","00","Ja","2024-10-12T00:00:00.000","2024-02-03T00:00:00.000","2016-03-31T00:00:00.000","2016-03-31T00:00:00.000",,,,,,,,,,,"192",,,,,,,,,,,,,,,,,"https://opendata.rdw.nl/resource/3huj-srit.json","https://opendata.rdw.nl/resource/8ys7-d773.json","https://opendata.rdw.nl/resource/vezc-m2t6.json","https://opendata.rdw.nl/resource/jhie-znh9.json","https://opendata.rdw.nl/resource/kmfi-hrps.json"
"VVV23N","Bedrijfsauto","DFSK","DFSK EC31","20270908","20230908",,"open laadvloer","2","N.v.t.","N.v.t.",,,"1295","2600","1395",,,"20230908","20230908","Geen verstrekking in Open Data","25995","Ja","80","1305",,,,,"2","4",,,,"473","164","N1",,,,"2600","DFSK EC31",,"e4*KS18/858*00014*00","CRC1030","TG","0","0.02","305","Nee","Nee",,"Nee",,,,"2023","Logisch","00","Ja","2027-09-08T00:00:00.000","2023-09-08T00:00:00.000","2023-09-08T00:00:00.000","2023-09-08T00:00:00.000",,,,,,,,,,,"199",,,,,,,,,,,"20230609","2023-06-09T00:00:00.000",,,,,"https://opendata.rdw.nl/resource/3huj-srit.json","https://opendata.rdw.nl/resource/8ys7-d773.json","https://opendata.rdw.nl/resource/vezc-m2t6.json","https://opendata.rdw.nl/resource/jhie-znh9.json","https://opendata.rdw.nl/resource/kmfi-hrps.json"
"VVV24N","Bedrijfsauto","DFSK","DFSK EC31","20270905","20230905",,"open laadvloer","2","N.v.t.","N.v.t.",,,"1295","2600","1395",,,"20230905","20230905","Geen verstrekking in Open Data","25995","Ja","80","1305",,,,,"2","4",,,,"473","164","N1",,,,"2600","DFSK EC31",,"e4*KS18/858*00014*00","CRC1030","TG","0","0.02","305","Nee","Nee",,"Nee",,,,"2023","Logisch","00","Ja","2027-09-05T00:00:00.000","2023-09-05T00:00:00.000","2023-09-05T00:00:00.000","2023-09-05T00:00:00.000",,,,,,,,,,,"199",,,,,,,,,,,"20230609","2023-06-09T00:00:00.000",,,,,"https://opendata.rdw.nl/resource/3huj-srit.json","https://opendata.rdw.nl/resource/8ys7-d773.json","https://opendata.rdw.nl/resource/vezc-m2t6.json","https://opendata.rdw.nl/resource/jhie-znh9.json","https://opendata.rdw.nl/resource/kmfi-hrps.json"
"VZ281G","Bedrijfsauto","DFSK","K01H","20240819","20160819",,"open laadvloer","2","N.v.t.","N.v.t.","4","1310","858","1865","958",,,"20160819","20160819","Geen verstrekking in Open Data",,"Ja",,"1007",,,,,,"4",,,,,"156","N1",,,"r. bodemplaat by voorzitting","1865","CLV",,,,,,"0.06","276","Nee","Nee",,"Nee",,,,"2022","Logisch","00","Ja","2024-08-19T00:00:00.000","2016-08-19T00:00:00.000","2016-08-19T00:00:00.000","2016-08-19T00:00:00.000",,"0",,,,,,,,,,,,,,,,,,,,,,,,,,"https://opendata.rdw.nl/resource/3huj-srit.json","https://opendata.rdw.nl/resource/8ys7-d773.json","https://opendata.rdw.nl/resource/vezc-m2t6.json","https://opendata.rdw.nl/resource/jhie-znh9.json","https://opendata.rdw.nl/resource/kmfi-hrps.json"
"VZ284G","Bedrijfsauto","DFSK","K01","20250823","20231129","3706","open laadvloer","2","N.v.t.","N.v.t.","4","1012","858","1855","958",,,"20160915","20160915","Geen verstrekking in Open Data","19720","Ja",,"997",,,,,,"4",,,,,"156","N1",,,"r. bodemplaat by voorzitting","1855","CLV",,,,,,"0.04","252","Nee","Nee",,"Nee",,,,"2023","Logisch","00","Ja","2025-08-23T00:00:00.000","2023-11-29T00:00:00.000","2016-09-15T00:00:00.000","2016-09-15T00:00:00.000",,"0",,,,,,,,,,,,,,,,,,,,,,,,,,"https://opendata.rdw.nl/resource/3huj-srit.json","https://opendata.rdw.nl/resource/8ys7-d773.json","https://opendata.rdw.nl/resource/vezc-m2t6.json","https://opendata.rdw.nl/resource/jhie-znh9.json","https://opendata.rdw.nl/resource/kmfi-hrps.json"
"VZ285G","Bedrijfsauto","DFSK","K01H","20250209","20210212","3902","open laadvloer","2","N.v.t.","N.v.t.","4","1310","858","1865","958",,,"20160915","20160915","Geen verstrekking in Open Data","20546","Ja",,"1007",,,,,,"4",,,,,"156","N1",,,"r. bodemplaat by voorzitting","1865","CLV",,,,,,"0.06","276","Nee","Nee",,"Nee",,,,"2023","Logisch","00","Ja","2025-02-09T00:00:00.000","2021-02-12T00:00:00.000","2016-09-15T00:00:00.000","2016-09-15T00:00:00.000",,"0",,,,,,,,,,,,,,,,,,,,,,,,,,"https://opendata.rdw.nl/resource/3huj-srit.json","https://opendata.rdw.nl/resource/8ys7-d773.json","https://opendata.rdw.nl/resource/vezc-m2t6.json","https://opendata.rdw.nl/resource/jhie-znh9.json","https://opendata.rdw.nl/resource/kmfi-hrps.json"
"VZ286G","Bedrijfsauto","DFSK","K01H","20240513","20240524","3902","open laadvloer","2","N.v.t.","N.v.t.","4","1310","858","1865","958",,,"20160823","20160823","Geen verstrekking in Open Data","20546","Ja",,"1007",,,,,,"4",,,,,"156","N1",,,"r. bodemplaat by voorzitting","1865","CLV",,,,,,"0.06","276","Nee","Nee",,"Nee",,,,"2024","Logisch","00","Ja","2024-05-13T00:00:00.000","2024-05-24T00:00:00.000","2016-08-23T00:00:00.000","2016-08-23T00:00:00.000",,"0",,,,,,,,,,,,,,,,,,,,,,,,,,"https://opendata.rdw.nl/resource/3huj-srit.json","https://opendata.rdw.nl/resource/8ys7-d773.json","https://opendata.rdw.nl/resource/vezc-m2t6.json","https://opendata.rdw.nl/resource/jhie-znh9.json","https://opendata.rdw.nl/resource/kmfi-hrps.json"
"VZ288G","Bedrijfsauto","DFSK","K01H","20250201","20181206","4950","open laadvloer","2","N.v.t.","N.v.t.","4","1310","858","1865","958",,,"20160915","20160915","Geen verstrekking in Open Data","24957","Ja",,"1007",,,,,,"4",,,,,"156","N1",,,"r. bodemplaat by voorzitting","1865","CLV",,,,,,"0.06","276","Nee","Nee",,"Nee",,,,"2024","Logisch","00","Ja","2025-02-01T00:00:00.000","2018-12-06T00:00:00.000","2016-09-15T00:00:00.000","2016-09-15T00:00:00.000",,"0",,,,,,,,,,,,,,,,,,,,,,,,,,"https://opendata.rdw.nl/resource/3huj-srit.json","https://opendata.rdw.nl/resource/8ys7-d773.json","https://opendata.rdw.nl/resource/vezc-m2t6.json","https://opendata.rdw.nl/resource/jhie-znh9.json","https://opendata.rdw.nl/resource/kmfi-hrps.json"
"VZ289G","Bedrijfsauto","DFSK","K01H","20240925","20240415","3706","open laadvloer","2","N.v.t.","N.v.t.","4","1310","858","1865","958",,,"20160925","20160925","Geen verstrekking in Open Data","19720","Ja",,"1007",,,,,,"4",,,,,"156","N1",,,"r. bodemplaat by voorzitting","1865","CLV",,,,,,"0.06","276","Nee","Nee",,"Nee",,,,"2024","Logisch","00","Ja","2024-09-25T00:00:00.000","2024-04-15T00:00:00.000","2016-09-25T00:00:00.000","2016-09-25T00:00:00.000",,"0",,,,,,,,,,,,,,,,,,,,,,,,,,"https://opendata.rdw.nl/resource/3huj-srit.json","https://opendata.rdw.nl/resource/8ys7-d773.json","https://opendata.rdw.nl/resource/vezc-m2t6.json","https://opendata.rdw.nl/resource/jhie-znh9.json","https://opendata.rdw.nl/resource/kmfi-hrps.json"
"VZ291G","Bedrijfsauto","DFSK","K01H","20241007","20171005","3902","open laadvloer","2","N.v.t.","N.v.t.","4","1310","858","1865","958",,,"20160915","20160915","Geen verstrekking in Open Data","20546","Ja",,"1007",,,,,,"4",,,,,"156","N1",,,"r. bodemplaat by voorzitting","1865","CLV",,,,,,"0.06","276","Nee","Nee",,"Nee",,,,"2022","Logisch","00","Ja","2024-10-07T00:00:00.000","2017-10-05T00:00:00.000","2016-09-15T00:00:00.000","2016-09-15T00:00:00.000",,"0",,,,,,,,,,,,,,,,,,,,,,,,,,"https://opendata.rdw.nl/resource/3huj-srit.json","https://opendata.rdw.nl/resource/8ys7-d773.json","https://opendata.rdw.nl/resource/vezc-m2t6.json","https://opendata.rdw.nl/resource/jhie-znh9.json","https://opendata.rdw.nl/resource/kmfi-hrps.json"