"kenteken","voertuigsoort","merk","handelsbenaming","vervaldatum_apk","datum_tenaamstelling","bruto_bpm","inrichting","aantal_zitplaatsen","eerste_kleur","tweede_kleur","aantal_cilinders","cilinderinhoud","massa_ledig_voertuig","toegestane_maximum_massa_voertuig","massa_rijklaar","maximum_massa_trekken_ongeremd","maximum_trekken_massa_geremd","datum_eerste_toelating","datum_eerste_tenaamstelling_in_nederland","wacht_op_keuren","catalogusprijs","wam_verzekerd","maximale_constructiesnelheid","laadvermogen","oplegger_geremd","aanhangwagen_autonoom_geremd","aanhangwagen_middenas_geremd","aantal_staanplaatsen","aantal_deuren","aantal_wielen","afstand_hart_koppeling_tot_achterzijde_voertuig","afstand_voorzijde_voertuig_tot_hart_koppeling","afwijkende_maximum_snelheid","lengte","breedte","europese_voertuigcategorie","europese_voertuigcategorie_toevoeging","europese_uitvoeringcategorie_toevoeging","plaats_chassisnummer","technische_max_massa_voertuig","type","type_gasinstallatie","typegoedkeuringsnummer","variant","uitvoering","volgnummer_wijziging_eu_typegoedkeuring","vermogen_massarijklaar","wielbasis","export_indicator","openstaande_terugroepactie_indicator","vervaldatum_tachograaf","taxi_indicator","maximum_massa_samenstelling","aantal_rolstoelplaatsen","maximum_ondersteunende_snelheid","jaar_laatste_registratie_tellerstand","tellerstandoordeel","code_toelichting_tellerstandoordeel","tenaamstellen_mogelijk","vervaldatum_apk_dt","datum_tenaamstelling_dt","datum_eerste_toelating_dt","datum_eerste_tenaamstelling_in_nederland_dt","vervaldatum_tachograaf_dt","maximum_last_onder_de_vooras_sen_tezamen_koppeling","type_remsysteem_voertuig_code","rupsonderstelconfiguratiecode","wielbasis_voertuig_minimum","wielbasis_voertuig_maximum","lengte_voertuig_minimum","lengte_voertuig_maximum","breedte_voertuig_minimum","breedte_voertuig_maximum","hoogte_voertuig","hoogte_voertuig_minimum","hoogte_voertuig_maximum","massa_bedrijfsklaar_minimaal","massa_bedrijfsklaar_maximaal","technisch_toelaatbaar_massa_koppelpunt","maximum_massa_technisch_maximaal","maximum_massa_technisch_minimaal","subcategorie_nederland","verticale_belasting_koppelpunt_getrokken_voertuig","zuinigheidsclassificatie","registratie_datum_goedkeuring_afschrijvingsmoment_bpm","registratie_datum_goedkeuring_afschrijvingsmoment_bpm_dt","gem_lading_wrde","aerodyn_voorz","massa_alt_aandr","verl_cab_ind","api_gekentekende_voertuigen_assen","api_gekentekende_voertuigen_brandstof","api_gekentekende_voertuigen_carrosserie","api_gekentekende_voertuigen_carrosserie_specifiek","api_gekentekende_voertuigen_voertuigklasse"
"G396RV","Personenauto","CITROEN","JUMPER ODER RELAY","20250224","20220302","10940","kampeerwagen","2","GRIJS","Niet geregistreerd","4","2198","2742","3500","2842","750","2500","20160405","20191203","Geen verstrekking in Open Data","45185","Ja","152",,,,,,"4","4",,,,,,"M1",,,,"3500","CTMFB",,,,,,"0.03","345","Nee","Nee",,"Nee","6000",,,"2024","Geen oordeel","05","Ja","2025-02-24T00:00:00.000","2022-03-02T00:00:00.000","2016-04-05T00:00:00.000","2019-12-03T00:00:00.000",,,,,,,,,,,,,,,,,,,,,,,,,,,,"https://opendata.rdw.nl/resource/3huj-srit.json","https://opendata.rdw.nl/resource/8ys7-d773.json","https://opendata.rdw.nl/resource/vezc-m2t6.json","https://opendata.rdw.nl/resource/jhie-znh9.json","https://opendata.rdw.nl/resource/kmfi-hrps.json"
"G698JT","Personenauto","CITROEN","JUMPER ODER RELAY","20250403","20200706","11521","kampeerwagen","4","GRIJS","Niet geregistreerd","4","1997","2163","3500","2263","750","2500","20170306","20191028","Geen verstrekking in Open Data","46772","Ja","148",,,,,,"4","4",,,,,,"M1",,,,"3500",,,,,,,"0.04","354","Nee","Nee",,"Nee","6000",,,"2024","Geen oordeel","05","Ja","2025-04-03T00:00:00.000","2020-07-06T00:00:00.000","2017-03-06T00:00:00.000","2019-10-28T00:00:00.000",,,,,,,,,,,,,,,,,,,,,,,,,,,,"https://opendata.rdw.nl/resource/3huj-srit.json","https://opendata.rdw.nl/resource/8ys7-d773.json","https://opendata.rdw.nl/resource/vezc-m2t6.json","https://opendata.rdw.nl/resource/jhie-znh9.json","https://opendata.rdw.nl/resource/kmfi-hrps.json"
"HF575N","Personenauto","CITROEN","JUMPER ODER RELAY","20240912","20190531","11696","kampeerwagen","2","GRIJS","Niet geregistreerd","4","2198","2975","3500","3075","750","2500","20140825","20151015","Geen verstrekking in Open Data",,"Ja",,,,,,,"2","4",,,,,,"M1",,,"r. deurstyl","3500",,,,,,,"0.04","404","Nee","Nee",,"Nee","6500",,,"2023","Geen oordeel","05","Ja","2024-09-12T00:00:00.000","2019-05-31T00:00:00.000","2014-08-25T00:00:00.000","2015-10-15T00:00:00.000",,,,,,,,,,,,,,,,,,,,,,,,,,,,"https://opendata.rdw.nl/resource/3huj-srit.json","https://opendata.rdw.nl/resource/8ys7-d773.json","https://opendata.rdw.nl/resource/vezc-m2t6.json","https://opendata.rdw.nl/resource/jhie-znh9.json","https://opendata.rdw.nl/resource/kmfi-hrps.json"
"J267VV","Personenauto","CITROEN","JUMPER ODER RELAY","20241110","20210112","11299","kampeerwagen","2","GRIJS","Niet geregistreerd","4","2198","2937","3500","3037","750","3000","20140414","20210112","Geen verstrekking in Open Data","46692","Ja","148",,,,,,"4","4",,,,"636","205","M1",,,"r. voorwielscherm by vooras","3500","Y",,,,,,"0.03","404","Nee","Nee",,"Nee","6500",,,"2023","Geen oordeel","05","Ja","2024-11-10T00:00:00.000","2021-01-12T00:00:00.000","2014-04-14T00:00:00.000","2021-01-12T00:00:00.000",,,,,,,,,,,"252",,,,,,,,,,,,,,,,,"https://opendata.rdw.nl/resource/3huj-srit.json","https://opendata.rdw.nl/resource/8ys7-d773.json","https://opendata.rdw.nl/resource/vezc-m2t6.json","https://opendata.rdw.nl/resource/jhie-znh9.json","https://opendata.rdw.nl/resource/kmfi-hrps.json"
"J428DF","Personenauto","CITROEN","JUMPER ODER RELAY","20250531","20200704","10295","kampeerwagen","4","WIT","Niet geregistreerd","4","2198","1979","3300","2079","750","2500","20140512","20200704","Geen verstrekking in Open Data","42487","Ja","148",,,,,,"3","4",,,,,,"M1",,,,"3300",,,,,,,"0.05","345","Nee","Nee",,"Nee","5800",,,"2024","Geen oordeel","05","Ja","2025-05-31T00:00:00.000","2020-07-04T00:00:00.000","2014-05-12T00:00:00.000","2020-07-04T00:00:00.000",,,,,,,,,,,,,,,,,,,,,,,,,,,,"https://opendata.rdw.nl/resource/3huj-srit.json","https://opendata.rdw.nl/resource/8ys7-d773.json","https://opendata.rdw.nl/resource/vezc-m2t6.json","https://opendata.rdw.nl/resource/jhie-znh9.json","https://opendata.rdw.nl/resource/kmfi-hrps.json"
"J872LS","Personenauto","CITROEN","JUMPER ODER RELAY","20240731","20200910","8416","kampeerwagen","4","WIT","Niet geregistreerd","4","1997","2900","3500","3000","750","3000","20170519","20200910","Geen verstrekking in Open Data","34552","Ja","148",,,,,,"4","4",,,,,"205","M1",,,"r. voorwielscherm by vooras","3500","Y",,,,,,"0.03","404","Nee","Nee",,"Nee",,,,"2023","Geen oordeel","05","Ja","2024-07-31T00:00:00.000","2020-09-10T00:00:00.000","2017-05-19T00:00:00.000","2020-09-10T00:00:00.000",,,,,,,,,,,"252",,,,,,,,,,,,,,,,,"https://opendata.rdw.nl/resource/3huj-srit.json","https://opendata.rdw.nl/resource/8ys7-d773.json","https://opendata.rdw.nl/resource/vezc-m2t6.json","https://opendata.rdw.nl/resource/jhie-znh9.json","https://opendata.rdw.nl/resource/kmfi-hrps.json"
"JG865G","Personenauto","CITROEN","JUMPER ODER RELAY","20250417","20160322","8589","kampeerwagen","2","GRIJS","Niet geregistreerd","4","2198","2597","3500","2697","750","2500","20111010","20160322","Geen verstrekking in Open Data",,"Ja",,,,,,,"4","4",,,,,,"M1",,,"r. voorwielscherm by voorzitting","3500","Y",,,,,,"0.03","345","Nee","Nee",,"Nee","6000",,,"2024","Geen oordeel","05","Ja","2025-04-17T00:00:00.000","2016-03-22T00:00:00.000","2011-10-10T00:00:00.000","2016-03-22T00:00:00.000",,,,,,,,,,,,,,,,,,,,,,,,,,,,"https://opendata.rdw.nl/resource/3huj-srit.json","https://opendata.rdw.nl/resource/8ys7-d773.json","https://opendata.rdw.nl/resource/vezc-m2t6.json","https://opendata.rdw.nl/resource/jhie-znh9.json","https://opendata.rdw.nl/resource/kmfi-hrps.json"
"K680PV","Personenauto","CITROEN","JUMPER ODER RELAY","20250430","20210401","5815","kampeerwagen","4","GRIJS","Niet geregistreerd","4","1997","2863","3500","2963","750","3000","20170406","20210401","Geen verstrekking in Open Data","49548","Ja","152",,,,,,"4","4",,,,"600","205","M1",,,,"3500","Y",,,,,,"0.04","404","Nee","Nee",,"Nee","6500",,,"2024","Geen oordeel","05","Ja","2025-04-30T00:00:00.000","2021-04-01T00:00:00.000","2017-04-06T00:00:00.000","2021-04-01T00:00:00.000",,,,,,,,,,,"265",,,,,,,,,,,,,,,,,"https://opendata.rdw.nl/resource/3huj-srit.json","https://opendata.rdw.nl/resource/8ys7-d773.json","https://opendata.rdw.nl/resource/vezc-m2t6.json","https://opendata.rdw.nl/resource/jhie-znh9.json","https://opendata.rdw.nl/resource/kmfi-hrps.json"
"L875XR","Personenauto","CITROEN","JUMPER ODER RELAY","20241108","20221108","8181","kampeerwagen","6","WIT","Niet geregistreerd","4","2198","2598","3500","2698","750","2000","20151218","20210909","Geen verstrekking in Open Data","33583","Ja","145",,,,,,"3","4",,,,,,"M1",,,,"3500","PLA4",,,,,,"0.03","300","Nee","Nee",,"Nee","5300",,,"2023","Geen oordeel","05","Ja","2024-11-08T00:00:00.000","2022-11-08T00:00:00.000","2015-12-18T00:00:00.000","2021-09-09T00:00:00.000",,,,,,,,,,,,,,,,,,,,,,,,,,,,"https://opendata.rdw.nl/resource/3huj-srit.json","https://opendata.rdw.nl/resource/8ys7-d773.json","https://opendata.rdw.nl/resource/vezc-m2t6.json","https://opendata.rdw.nl/resource/jhie-znh9.json","https://opendata.rdw.nl/resource/kmfi-hrps.json"
"PL863P","Personenauto","CITROEN","JUMPER ODER RELAY","20241207","20170731","9980","kampeerwagen","2","WIT","Niet geregistreerd","4","2198","2613","3500","2713","750","2000","20161129","20170731","Geen verstrekking in Open Data",,"Ja",,,,,,,"4","4",,,,,,"M1",,,"r. voorwielscherm by voorzitting","3500","Y",,,,,,"0.03","345","Nee","Nee",,"Nee",,,,"2023","Geen oordeel","05","Ja","2024-12-07T00:00:00.000","2017-07-31T00:00:00.000","2016-11-29T00:00:00.000","2017-07-31T00:00:00.000",,,,,,,,,,,,,,,,,,,,,,,,,,,,"https://opendata.rdw.nl/resource/3huj-srit.json","https://opendata.rdw.nl/resource/8ys7-d773.json","https://opendata.rdw.nl/resource/vezc-m2t6.json","https://opendata.rdw.nl/resource/jhie-znh9.json","https://opendata.rdw.nl/resource/kmfi-hrps.json"
"PP622V","Personenauto","CITROEN","JUMPER ODER RELAY","20250619","20190704","10889","kampeerwagen","4","WIT","Niet geregistreerd","4","2198","2780","3500","2880","750","2500","20120411","20170902","Geen verstrekking in Open Data",,"Ja",,,,,,,"4","4",,,,,,"M1",,,"r. voorwielscherm","3500","Y",,,,,,"0.04","403","Nee","Nee",,"Nee","6000",,,"2024","Geen oordeel","05","Ja","2025-06-19T00:00:00.000","2019-07-04T00:00:00.000","2012-04-11T00:00:00.000","2017-09-02T00:00:00.000",,,,,,,,,,,,,,,,,,,,,,,,,,,,"https://opendata.rdw.nl/resource/3huj-srit.json","https://opendata.rdw.nl/resource/8ys7-d773.json","https://opendata.rdw.nl/resource/vezc-m2t6.json","https://opendata.rdw.nl/resource/jhie-znh9.json","https://opendata.rdw.nl/resource/kmfi-hrps.json"
"PT386T","Personenauto","CITROEN","JUMPER ODER RELAY","20240925","20170925","11096","kampeerwagen","4","GRIJS","Niet geregistreerd","4","2198","2830","3500","2930","750","2500","20140827","20170925","Geen verstrekking in Open Data",,"Ja",,,,,,,"4","4",,,,,,"M1",,,"r. deurdorpel by voorzitting","3500","Y",,,,,,"0.03","404","Nee","Nee",,"Nee","6000",,,"2023","Geen oordeel","05","Ja","2024-09-25T00:00:00.000","2017-09-25T00:00:00.000","2014-08-27T00:00:00.000","2017-09-25T00:00:00.000",,,,,,,,,,,,,,,,,,,,,,,,,,,,"https://opendata.rdw.nl/resource/3huj-srit.json","https://opendata.rdw.nl/resource/8ys7-d773.json","https://opendata.rdw.nl/resource/vezc-m2t6.json","https://opendata.rdw.nl/resource/jhie-znh9.json","https://opendata.rdw.nl/resource/kmfi-hrps.json"
"RF311P","Personenauto","CITROEN","JUMPER ODER RELAY","20240921","20171128","11492","kampeerwagen","4","GRIJS","Niet geregistreerd","4","2198","2760","3500","2860","750","2500","20140114","20171128","Geen verstrekking in Open Data",,"Ja",,,,,,,"4","4",,,,,,"M1",,,"r. deurdorpel by voorzitting","3500","Y",,,,,,"0.04","403","Nee","Nee",,"Nee",,,,"2023","Geen oordeel","05","Ja","2024-09-21T00:00:00.000","2017-11-28T00:00:00.000","2014-01-14T00:00:00.000","2017-11-28T00:00:00.000",,,,,,,,,,,,,,,,,,,,,,,,,,,,"https://opendata.rdw.nl/resource/3huj-srit.json","https://opendata.rdw.nl/resource/8ys7-d773.json","https://opendata.rdw.nl/resource/vezc-m2t6.json","https://opendata.rdw.nl/resource/jhie-znh9.json","https://opendata.rdw.nl/resource/kmfi-hrps.json"
"RX386B","Personenauto","CITROEN","JUMPER ODER RELAY","20250130","20180305","10267","kampeerwagen","4","BLAUW","Niet geregistreerd","4","2198","2830","3300","2930","750","2000","20140522","20180305","Geen verstrekking in Open Data",,"Ja",,,,,,,"4","4",,,,,,"M1",,,"r. deurstyl by pers.ruimte","3300","Y",,,,,,"0.03","403","Nee","Nee",,"Nee","5300",,,"2024","Geen oordeel","05","Ja","2025-01-30T00:00:00.000","2018-03-05T00:00:00.000","2014-05-22T00:00:00.000","2018-03-05T00:00:00.000",,,,,,,,,,,,,,,,,,,,,,,,,,,,"https://opendata.rdw.nl/resource/3huj-srit.json","https://opendata.rdw.nl/resource/8ys7-d773.json","https://opendata.rdw.nl/resource/vezc-m2t6.json","https://opendata.rdw.nl/resource/jhie-znh9.json","https://opendata.rdw.nl/resource/kmfi-hrps.json"
"RX476B","Personenauto","CITROEN","JUMPER ODER RELAY","20250312","20180309","10357","kampeerwagen","4","WIT","Niet geregistreerd","4","2198","2722","3500","2822","750","2500","20160120","20180309","Geen verstrekking in Open Data",,"Ja",,,,,,,"4","4",,,,,,"M1",,,"r. deurdorpel by pers.ruimte","3500","Y",,,,,,"0.03","345","Nee","Nee",,"Nee","6000",,,"2024","Geen oordeel","05","Ja","2025-03-12T00:00:00.000","2018-03-09T00:00:00.000","2016-01-20T00:00:00.000","2018-03-09T00:00:00.000",,,,,,,,,,,,,,,,,,,,,,,,,,,,"https://opendata.rdw.nl/resource/3huj-srit.json","https://opendata.rdw.nl/resource/8ys7-d773.json","https://opendata.rdw.nl/resource/vezc-m2t6.json","https://opendata.rdw.nl/resource/jhie-znh9.json","https://opendata.rdw.nl/resource/kmfi-hrps.json"
"SJ633F","Personenauto","CITROEN","JUMPER ODER RELAY","20250416","20180423","10246","kampeerwagen","4","GRIJS","Niet geregistreerd","4","2198","2760","3300","2860","750","2500","20130801","20180423","Geen verstrekking in Open Data",,"Ja",,,,,,,"4","4",,,,,,"M1",,,"r. voorwielscherm by vooras","3300","Y",,,,,,"0.03","404","Nee","Nee",,"Nee","5800",,,"2024","Geen oordeel","05","Ja","2025-04-16T00:00:00.000","2018-04-23T00:00:00.000","2013-08-01T00:00:00.000","2018-04-23T00:00:00.000",,,,,,,,,,,,,,,,,,,,,,,,,,,,"https://opendata.rdw.nl/resource/3huj-srit.json","https://opendata.rdw.nl/resource/8ys7-d773.json","https://opendata.rdw.nl/resource/vezc-m2t6.json","https://opendata.rdw.nl/resource/jhie-znh9.json","https://opendata.rdw.nl/resource/kmfi-hrps.json"
"TP582T","Personenauto","CITROEN","JUMPER ODER RELAY","20241030","20191101","8979","kampeerwagen","4","BLAUW","Niet geregistreerd","4","2198","2500","3300","2600","750","2000","20140512","20181005","Geen verstrekking in Open Data",,"Ja",,,,,,,"4","4",,,,,,"M1",,,"r. voorwielscherm","3300","Y",,,,,,"0.03","345","Nee","Nee",,"Nee","5300",,,"2023","Geen oordeel","05","Ja","2024-10-30T00:00:00.000","2019-11-01T00:00:00.000","2014-05-12T00:00:00.000","2018-10-05T00:00:00.000",,,,,,,,,,,,,,,,,,,,,,,,,,,,"https://opendata.rdw.nl/resource/3huj-srit.json","https://opendata.rdw.nl/resource/8ys7-d773.json","https://opendata.rdw.nl/resource/vezc-m2t6.json","https://opendata.rdw.nl/resource/jhie-znh9.json","https://opendata.rdw.nl/resource/kmfi-hrps.json"
"TS229N","Personenauto","CITROEN","JUMPER ODER RELAY","20241018","20181022","8979","kampeerwagen","4","ZWART","Niet geregistreerd","4","2198","2680","3300","2780","750","2000","20140129","20181022","Geen verstrekking in Open Data",,"Ja",,,,,,,"4","4",,,,,,"M1",,,"r. voorwielscherm by vooras","3300","Y",,,,,,"0.03","345","Nee","Nee",,"Nee","5300",,,"2023","Geen oordeel","05","Ja","2024-10-18T00:00:00.000","2018-10-22T00:00:00.000","2014-01-29T00:00:00.000","2018-10-22T00:00:00.000",,,,,,,,,,,,,,,,,,,,,,,,,,,,"https://opendata.rdw.nl/resource/3huj-srit.json","https://opendata.rdw.nl/resource/8ys7-d773.json","https://opendata.rdw.nl/resource/vezc-m2t6.json","https://opendata.rdw.nl/resource/jhie-znh9.json","https://opendata.rdw.nl/resource/kmfi-hrps.json"
"TT183F","Personenauto","CITROEN","JUMPER ODER RELAY","20241107","20181116","11319","kampeerwagen","4","GRIJS","Niet geregistreerd","4","2198","2689","3500","2789","750","2500","20160311","20181116","Geen verstrekking in Open Data",,"Ja",,,,,,,"4","4",,,,,,"M1",,,"r. voorwielscherm by pers.ruimte","3500","Y",,,,,,"0.03","404","Nee","Nee",,"Nee",,,,"2024","Geen oordeel","05","Ja","2024-11-07T00:00:00.000","2018-11-16T00:00:00.000","2016-03-11T00:00:00.000","2018-11-16T00:00:00.000",,,,,,,,,,,,,,,,,,,,,,,,,,,,"https://opendata.rdw.nl/resource/3huj-srit.json","https://opendata.rdw.nl/resource/8ys7-d773.json","https://opendata.rdw.nl/resource/vezc-m2t6.json","https://opendata.rdw.nl/resource/jhie-znh9.json","https://opendata.rdw.nl/resource/kmfi-hrps.json"
"TX490B","Personenauto","CITROEN","JUMPER ODER RELAY","20250323","20181102","11055","kampeerwagen","4","GRIJS","Niet geregistreerd","4","1997","2712","3500","2812","750","2500","20170529","20181102","Geen verstrekking in Open Data",,"Ja",,,,,,,"4","4",,,,,,"M1",,,"r. voorwielscherm by vooras","3500","Y",,,,,,"0.03","346","Nee","Nee",,"Nee",,,,"2024","Geen oordeel","05","Ja","2025-03-23T00:00:00.000","2018-11-02T00:00:00.000","2017-05-29T00:00:00.000","2018-11-02T00:00:00.000",,,,,,,,,,,,,,,,,,,,,,,,,,,,"https://opendata.rdw.nl/resource/3huj-srit.json","https://opendata.rdw.nl/resource/8ys7-d773.json","https://opendata.rdw.nl/resource/vezc-m2t6.json","https://opendata.rdw.nl/resource/jhie-znh9.json","https://opendata.rdw.nl/resource/kmfi-hrps.json"
"ZP822F","Personenauto","CITROEN","JUMPER ODER RELAY","20250430","20190726","8617","kampeerwagen","4","BLAUW","Niet geregistreerd","4","2198","2600","3300","2700","750","2000","20140605","20190726","Geen verstrekking in Open Data","35416","Ja",,,,,,,"5","4",,,,,,"M1",,,"r. voorwielscherm by vooras","3300","Y",,,,,,"0.03","345","Nee","Nee",,"Nee","5300",,,"2024","Geen oordeel","05","Ja","2025-04-30T00:00:00.000","2019-07-26T00:00:00.000","2014-06-05T00:00:00.000","2019-07-26T00:00:00.000",,,,,,,,,,,,,,,,,,,,,,,,,,,,"https://opendata.rdw.nl/resource/3huj-srit.json","https://opendata.rdw.nl/resource/8ys7-d773.json","https://opendata.rdw.nl/resource/vezc-m2t6.json","https://opendata.rdw.nl/resource/jhie-znh9.json","https://opendata.rdw.nl/resource/kmfi-hrps.json"
"ZR042F","Personenauto","CITROEN","JUMPER ODER RELAY","20240728","20211222","4660","kampeerwagen","2","WIT","Niet geregistreerd","4","2198","2917","3500","3017","750","2500","20150901","20190709","Geen verstrekking in Open Data","46454","Ja","157",,,,,,"2","4",,,,,,"M1",,,"r. voorwielscherm","3500",,,,,,,"0.04","404","Nee","Nee",,"Nee","6000",,,"2023","Onlogisch","04","Nee","2024-07-28T00:00:00.000","2021-12-22T00:00:00.000","2015-09-01T00:00:00.000","2019-07-09T00:00:00.000",,,,,,,,,,,,,,,,,,,,,,,,,,,,"https://opendata.rdw.nl/resource/3huj-srit.json","https://opendata.rdw.nl/resource/8ys7-d773.json","https://opendata.rdw.nl/resource/vezc-m2t6.json","https://opendata.rdw.nl/resource/jhie-znh9.json","https://opendata.rdw.nl/resource/kmfi-hrps.json"
"J036TF","Personenauto","CITROEN","JUMPER ODER RELAY","20250623",,"8878","kampeerwagen","3","GRIJS","Niet geregistreerd","4","2198","2212","3000","2312","750","2500","20110825","20200701","Geen verstrekking in Open Data","36039","Ja","150",,,,,,"4","4",,,,,"205","M1",,,"r. voorwielscherm","3000","Y",,,,,,"0.04","345","Nee","Nee",,"Nee","5500",,,"2024","Geen oordeel","05","Ja","2025-06-23T00:00:00.000",,"2011-08-25T00:00:00.000","2020-07-01T00:00:00.000",,,,,,,,,,,,,,,,,,,,,,,,,,,,"https://opendata.rdw.nl/resource/3huj-srit.json","https://opendata.rdw.nl/resource/8ys7-d773.json","https://opendata.rdw.nl/resource/vezc-m2t6.json","https://opendata.rdw.nl/resource/jhie-znh9.json","https://opendata.rdw.nl/resource/kmfi-hrps.json"
