"kenteken","voertuigsoort","merk","handelsbenaming","vervaldatum_apk","datum_tenaamstelling","bruto_bpm","inrichting","aantal_zitplaatsen","eerste_kleur","tweede_kleur","aantal_cilinders","cilinderinhoud","massa_ledig_voertuig","toegestane_maximum_massa_voertuig","massa_rijklaar","maximum_massa_trekken_ongeremd","maximum_trekken_massa_geremd","datum_eerste_toelating","datum_eerste_tenaamstelling_in_nederland","wacht_op_keuren","catalogusprijs","wam_verzekerd","maximale_constructiesnelheid","laadvermogen","oplegger_geremd","aanhangwagen_autonoom_geremd","aanhangwagen_middenas_geremd","aantal_staanplaatsen","aantal_deuren","aantal_wielen","afstand_hart_koppeling_tot_achterzijde_voertuig","afstand_voorzijde_voertuig_tot_hart_koppeling","afwijkende_maximum_snelheid","lengte","breedte","europese_voertuigcategorie","europese_voertuigcategorie_toevoeging","europese_uitvoeringcategorie_toevoeging","plaats_chassisnummer","technische_max_massa_voertuig","type","type_gasinstallatie","typegoedkeuringsnummer","variant","uitvoering","volgnummer_wijziging_eu_typegoedkeuring","vermogen_massarijklaar","wielbasis","export_indicator","openstaande_terugroepactie_indicator","vervaldatum_tachograaf","taxi_indicator","maximum_massa_samenstelling","aantal_rolstoelplaatsen","maximum_ondersteunende_snelheid","jaar_laatste_registratie_tellerstand","tellerstandoordeel","code_toelichting_tellerstandoordeel","tenaamstellen_mogelijk","vervaldatum_apk_dt","datum_tenaamstelling_dt","datum_eerste_toelating_dt","datum_eerste_tenaamstelling_in_nederland_dt","vervaldatum_tachograaf_dt","maximum_last_onder_de_vooras_sen_tezamen_koppeling","type_remsysteem_voertuig_code","rupsonderstelconfiguratiecode","wielbasis_voertuig_minimum","wielbasis_voertuig_maximum","lengte_voertuig_minimum","lengte_voertuig_maximum","breedte_voertuig_minimum","breedte_voertuig_maximum","hoogte_voertuig","hoogte_voertuig_minimum","hoogte_voertuig_maximum","massa_bedrijfsklaar_minimaal","massa_bedrijfsklaar_maximaal","technisch_toelaatbaar_massa_koppelpunt","maximum_massa_technisch_maximaal","maximum_massa_technisch_minimaal","subcategorie_nederland","verticale_belasting_koppelpunt_getrokken_voertuig","zuinigheidsclassificatie","registratie_datum_goedkeuring_afschrijvingsmoment_bpm","registratie_datum_goedkeuring_afschrijvingsmoment_bpm_dt","gem_lading_wrde","aerodyn_voorz","massa_alt_aandr","verl_cab_ind","api_gekentekende_voertuigen_assen","api_gekentekende_voertuigen_brandstof","api_gekentekende_voertuigen_carrosserie","api_gekentekende_voertuigen_carrosserie_specifiek","api_gekentekende_voertuigen_voertuigklasse"
"H039NN","Personenauto","BMW","520D EFFICIENT DYNAMICS","20240705","20230720","893","sedan","5","BRUIN","Niet geregistreerd","4","1995","1515","2245","1615","750","2000","20170828","20200320","Geen verstrekking in Open Data","64407","Ja","223",,,,,,"4","4",,,,"494","187","M1",,,,"2245","G5L",,"e1*2007/46*1688*02","JE31","CA15R0L0","0","0.07","298","Nee","Nee",,"Nee","4335",,,"2023","Geen oordeel","05","Ja","2024-07-05T00:00:00.000","2023-07-20T00:00:00.000","2017-08-28T00:00:00.000","2020-03-20T00:00:00.000",,,,,,,,,,,"147",,,,,,,,,,"A",,,,,,,"https://opendata.rdw.nl/resource/3huj-srit.json","https://opendata.rdw.nl/resource/8ys7-d773.json","https://opendata.rdw.nl/resource/vezc-m2t6.json","https://opendata.rdw.nl/resource/jhie-znh9.json","https://opendata.rdw.nl/resource/kmfi-hrps.json"
"H579ZG","Personenauto","BMW","520D EFFICIENT DYNAMICS","20240814","20200911","3593","sedan","5","GRIJS","Niet geregistreerd","4","1995","1515","2245","1615","750","2000","20170322","20200911","Geen verstrekking in Open Data","63795","Ja","235",,,,,,"4","4",,,,"494","187","M1",,,,"2245","G5L",,"e1*2007/46*1688*01","JE31","CA1500LD","0","0.09","298","Nee","Nee",,"Nee","4335",,,"2023","Geen oordeel","05","Ja","2024-08-14T00:00:00.000","2020-09-11T00:00:00.000","2017-03-22T00:00:00.000","2020-09-11T00:00:00.000",,,,,,,,,,,"147",,,,,,,,,,"A",,,,,,,"https://opendata.rdw.nl/resource/3huj-srit.json","https://opendata.rdw.nl/resource/8ys7-d773.json","https://opendata.rdw.nl/resource/vezc-m2t6.json","https://opendata.rdw.nl/resource/jhie-znh9.json","https://opendata.rdw.nl/resource/kmfi-hrps.json"
"K714XB","Personenauto","BMW","520D EFFICIENT DYNAMICS","20250319","20210714","685","sedan","5","ZWART","Niet geregistreerd","4","1995","1515","2245","1615","750","2000","20170821","20210319","Geen verstrekking in Open Data","67965","Ja","235",,,,,,"4","4","0","0",,"494","187","M1",,,"r. motorruimte","2245","G5L",,"e1*2007/46*1688*02","JE31","CA1500L0","0","0.09","298","Nee","Nee",,"Nee","4335","0","0.00","2024","Onlogisch","04","Ja","2025-03-19T00:00:00.000","2021-07-14T00:00:00.000","2017-08-21T00:00:00.000","2021-03-19T00:00:00.000",,,,,,,,,,,"147",,,,,,,,,,"A",,,,,,,"https://opendata.rdw.nl/resource/3huj-srit.json","https://opendata.rdw.nl/resource/8ys7-d773.json","https://opendata.rdw.nl/resource/vezc-m2t6.json","https://opendata.rdw.nl/resource/jhie-znh9.json","https://opendata.rdw.nl/resource/kmfi-hrps.json"
"L102VH","Personenauto","BMW","520D EFFICIENT DYNAMICS","20241012","20211224","3844","sedan","5","ZWART","Niet geregistreerd","4","1995","1515","2245","1615","750","2000","20170504","20211224","Geen verstrekking in Open Data","62163","Ja","235",,,,,,"4","4",,,,"494","187","M1",,,,"2245","G5L",,"e1*2007/46*1688*01","JE31","CA1500LD","0","0.09","298","Nee","Nee",,"Nee","4335",,,"2024","Geen oordeel","05","Ja","2024-10-12T00:00:00.000","2021-12-24T00:00:00.000","2017-05-04T00:00:00.000","2021-12-24T00:00:00.000",,,,,,,,,,,"147",,,,,,,,,,,,,,,,,"https://opendata.rdw.nl/resource/3huj-srit.json","https://opendata.rdw.nl/resource/8ys7-d773.json","https://opendata.rdw.nl/resource/vezc-m2t6.json","https://opendata.rdw.nl/resource/jhie-znh9.json","https://opendata.rdw.nl/resource/kmfi-hrps.json"
"L189DJ","Personenauto","BMW","520D EFFICIENT DYNAMICS","20240702","20240202","1559","sedan","5","ZWART","Niet geregistreerd","4","1995","1515","2245","1615","750","2000","20170519","20210702","Geen verstrekking in Open Data","67392","Nee","235",,,,,,"4","4",,,,"494","187","M1",,,,"2245","G5L",,,,,,"0.09","298","Nee","Nee",,"Nee","4335",,,"2024","Geen oordeel","05","Ja","2024-07-02T00:00:00.000","2024-02-02T00:00:00.000","2017-05-19T00:00:00.000","2021-07-02T00:00:00.000",,,,,,,,,,,"147",,,,,,,,,,,,,,,,,"https://opendata.rdw.nl/resource/3huj-srit.json","https://opendata.rdw.nl/resource/8ys7-d773.json","https://opendata.rdw.nl/resource/vezc-m2t6.json","https://opendata.rdw.nl/resource/jhie-znh9.json","https://opendata.rdw.nl/resource/kmfi-hrps.json"
"L283GR","Personenauto","BMW","520D EFFICIENT DYNAMICS","20241228","20221225","2168","sedan","5","GRIJS","Niet geregistreerd","4","1995","1515","2245","1615","750","2000","20170425","20210512","Geen verstrekking in Open Data","58537","Ja","235",,,,,,"4","4",,,,"494","187","M1",,,,"2245","G5L",,"e1*2007/46*1688*01","JE31","CA2500M0","0","0.09","298","Nee","Nee",,"Nee","4335",,,"2024","Geen oordeel","05","Ja","2024-12-28T00:00:00.000","2022-12-25T00:00:00.000","2017-04-25T00:00:00.000","2021-05-12T00:00:00.000",,,,,,,,,,,"147",,,,,,,,,,,,,,,,,"https://opendata.rdw.nl/resource/3huj-srit.json","https://opendata.rdw.nl/resource/8ys7-d773.json","https://opendata.rdw.nl/resource/vezc-m2t6.json","https://opendata.rdw.nl/resource/jhie-znh9.json","https://opendata.rdw.nl/resource/kmfi-hrps.json"
"N746JB","Personenauto","BMW","520D EFFICIENT DYNAMICS","20240802","20211019","5428","sedan","5","BLAUW","Niet geregistreerd","4","1995","1515","2245","1615","750","2000","20170802","20211019","Geen verstrekking in Open Data","82939","Ja","235",,,,,,"4","4","0","0",,"494","187","M1",,,,"2245","G5L",,"e1*2007/46*1688*02","JE31","CA1500L0","0","0.09","298","Nee","Nee",,"Nee","4335","0","0.00","2023","Geen oordeel","05","Ja","2024-08-02T00:00:00.000","2021-10-19T00:00:00.000","2017-08-02T00:00:00.000","2021-10-19T00:00:00.000",,,,,,,,,,,"147",,,,,,,,,,,"20211015","2021-10-15T00:00:00.000",,,,,"https://opendata.rdw.nl/resource/3huj-srit.json","https://opendata.rdw.nl/resource/8ys7-d773.json","https://opendata.rdw.nl/resource/vezc-m2t6.json","https://opendata.rdw.nl/resource/jhie-znh9.json","https://opendata.rdw.nl/resource/kmfi-hrps.json"
"NT272H","Personenauto","BMW","520D EFFICIENT DYNAMICS","20250430","20171123","7050","sedan","5","ZWART","Niet geregistreerd","4","1995","1515","2245","1615","750","2000","20170424","20170424","Geen verstrekking in Open Data","71604","Ja",,,,,,,"4","4","0","0",,"494","187","M1",,,"in motorruimte r.","2245","G5L",,"e1*2007/46*1688*01","JE31","CA250000","0","0.09","298","Nee","Nee",,"Nee","4335","0","0.00","2024","Logisch","00","Ja","2025-04-30T00:00:00.000","2017-11-23T00:00:00.000","2017-04-24T00:00:00.000","2017-04-24T00:00:00.000",,,,,,,,,,,"147",,,,,,,,,,"B",,,,,,,"https://opendata.rdw.nl/resource/3huj-srit.json","https://opendata.rdw.nl/resource/8ys7-d773.json","https://opendata.rdw.nl/resource/vezc-m2t6.json","https://opendata.rdw.nl/resource/jhie-znh9.json","https://opendata.rdw.nl/resource/kmfi-hrps.json"
"P404BX","Personenauto","BMW","520D EFFICIENT DYNAMICS","20250201","20220202","7625","sedan","5","GRIJS","Niet geregistreerd","4","1995","1515","2245","1615","750","2000","20180118","20220202","Geen verstrekking in Open Data","73949","Ja","235",,,,,,"4","4",,,,"494","187","M1",,,"r. motorruimte","2245","G5L",,"e1*2007/46*1688*03","JE31","CA2500M0","0","0.09","298","Nee","Nee",,"Nee","4335",,,"2024","Geen oordeel","05","Ja","2025-02-01T00:00:00.000","2022-02-02T00:00:00.000","2018-01-18T00:00:00.000","2022-02-02T00:00:00.000",,,,,,,,,,,"147",,,,,,,,,,,"20220201","2022-02-01T00:00:00.000",,,,,"https://opendata.rdw.nl/resource/3huj-srit.json","https://opendata.rdw.nl/resource/8ys7-d773.json","https://opendata.rdw.nl/resource/vezc-m2t6.json","https://opendata.rdw.nl/resource/jhie-znh9.json","https://opendata.rdw.nl/resource/kmfi-hrps.json"
"P806GR","Personenauto","BMW","520D EFFICIENT DYNAMICS","20241207","20220317","3437","sedan","5","BLAUW","Niet geregistreerd","4","1995","1515","2245","1615","750","2000","20180102","20220317","Geen verstrekking in Open Data","58843","Ja","223",,,,,,"4","4",,,,"494","187","M1",,,,"2245","G5L",,"e1*2007/46*1688*03","JE31","CA15R0L0","0","0.07","298","Nee","Nee",,"Nee","4335",,,"2023","Geen oordeel","05","Ja","2024-12-07T00:00:00.000","2022-03-17T00:00:00.000","2018-01-02T00:00:00.000","2022-03-17T00:00:00.000",,,,,,,,,,,"147",,,,,,,,,,,"20220304","2022-03-04T00:00:00.000",,,,,"https://opendata.rdw.nl/resource/3huj-srit.json","https://opendata.rdw.nl/resource/8ys7-d773.json","https://opendata.rdw.nl/resource/vezc-m2t6.json","https://opendata.rdw.nl/resource/jhie-znh9.json","https://opendata.rdw.nl/resource/kmfi-hrps.json"
"PD150B","Personenauto","BMW","520D EFFICIENT DYNAMICS","20250216","20240217","5428","sedan","5","ZWART","Niet geregistreerd","4","1995","1515","2245","1615","750","2000","20170602","20170602","Geen verstrekking in Open Data","66039","Ja",,,,,,,"4","4","0","0",,"494","187","M1",,,"in motorruimte r.","2245","G5L",,"e1*2007/46*1688*01","JE31","CA150000","0","0.09","298","Nee","Nee",,"Nee","4335","0","0.00","2024","Logisch","00","Ja","2025-02-16T00:00:00.000","2024-02-17T00:00:00.000","2017-06-02T00:00:00.000","2017-06-02T00:00:00.000",,,,,,,,,,,"147",,,,,,,,,,"A",,,,,,,"https://opendata.rdw.nl/resource/3huj-srit.json","https://opendata.rdw.nl/resource/8ys7-d773.json","https://opendata.rdw.nl/resource/vezc-m2t6.json","https://opendata.rdw.nl/resource/jhie-znh9.json","https://opendata.rdw.nl/resource/kmfi-hrps.json"
"PF640H","Personenauto","BMW","520D EFFICIENT DYNAMICS","20240614","20170614","5428","sedan","5","GRIJS","Niet geregistreerd","4","1995","1515","2245","1615","750","2000","20170614","20170614","Geen verstrekking in Open Data","62248","Ja",,,,,,,"4","4","0","0",,"494","187","M1",,,"in motorruimte r.","2245","G5L",,"e1*2007/46*1688*01","JE31","CA1500L0","0","0.09","298","Nee","Nee",,"Nee","4335","0","0.00","2024","Logisch","00","Ja","2024-06-14T00:00:00.000","2017-06-14T00:00:00.000","2017-06-14T00:00:00.000","2017-06-14T00:00:00.000",,,,,,,,,,,"147",,,,,,,,,,"A",,,,,,,"https://opendata.rdw.nl/resource/3huj-srit.json","https://opendata.rdw.nl/resource/8ys7-d773.json","https://opendata.rdw.nl/resource/vezc-m2t6.json","https://opendata.rdw.nl/resource/jhie-znh9.json","https://opendata.rdw.nl/resource/kmfi-hrps.json"
"PG723F","Personenauto","BMW","520D EFFICIENT DYNAMICS","20240622","20170622","7050","sedan","5","ZWART","Niet geregistreerd","4","1995","1515","2245","1615","750","2000","20170622","20170622","Geen verstrekking in Open Data","80597","Ja",,,,,,,"4","4","0","0",,"494","187","M1",,,"in motorruimte r.","2245","G5L",,"e1*2007/46*1688*01","JE31","CA250000","0","0.09","298","Nee","Nee",,"Nee","4335","0","0.00","2024","Logisch","00","Ja","2024-06-22T00:00:00.000","2017-06-22T00:00:00.000","2017-06-22T00:00:00.000","2017-06-22T00:00:00.000",,,,,,,,,,,"147",,,,,,,,,,"B",,,,,,,"https://opendata.rdw.nl/resource/3huj-srit.json","https://opendata.rdw.nl/resource/8ys7-d773.json","https://opendata.rdw.nl/resource/vezc-m2t6.json","https://opendata.rdw.nl/resource/jhie-znh9.json","https://opendata.rdw.nl/resource/kmfi-hrps.json"
"PH151N","Personenauto","BMW","520D EFFICIENT DYNAMICS","20240701","20230615","7050","sedan","5","ZWART","Niet geregistreerd","4","1995","1515","2245","1615","750","2000","20170701","20170701","Geen verstrekking in Open Data","82697","Ja",,,,,,,"4","4","0","0",,"494","187","M1",,,"in motorruimte r.","2245","G5L",,"e1*2007/46*1688*01","JE31","CA2500N0","0","0.09","298","Nee","Nee",,"Nee","4335","0","0.00","2024","Logisch","00","Ja","2024-07-01T00:00:00.000","2023-06-15T00:00:00.000","2017-07-01T00:00:00.000","2017-07-01T00:00:00.000",,,,,,,,,,,"147",,,,,,,,,,"B",,,,,,,"https://opendata.rdw.nl/resource/3huj-srit.json","https://opendata.rdw.nl/resource/8ys7-d773.json","https://opendata.rdw.nl/resource/vezc-m2t6.json","https://opendata.rdw.nl/resource/jhie-znh9.json","https://opendata.rdw.nl/resource/kmfi-hrps.json"
"PL140S","Personenauto","BMW","520D EFFICIENT DYNAMICS","20240801","20220412","5428","sedan","5","ZWART","Niet geregistreerd","4","1995","1515","2245","1615","750","2000","20170801","20170801","Geen verstrekking in Open Data","59056","Ja",,,,,,,"4","4","0","0",,"494","187","M1",,,"in motorruimte r.","2245","G5L",,"e1*2007/46*1688*01","JE31","CA1500L0","0","0.09","298","Nee","Nee",,"Ja","4335","0","0.00","2024","Logisch","00","Ja","2024-08-01T00:00:00.000","2022-04-12T00:00:00.000","2017-08-01T00:00:00.000","2017-08-01T00:00:00.000",,,,,,,,,,,"147",,,,,,,,,,"A","20220419","2022-04-19T00:00:00.000",,,,,"https://opendata.rdw.nl/resource/3huj-srit.json","https://opendata.rdw.nl/resource/8ys7-d773.json","https://opendata.rdw.nl/resource/vezc-m2t6.json","https://opendata.rdw.nl/resource/jhie-znh9.json","https://opendata.rdw.nl/resource/kmfi-hrps.json"
"PR262B","Personenauto","BMW","520D EFFICIENT DYNAMICS","20250506","20190430","7050","sedan","5","GRIJS","Niet geregistreerd","4","1995","1515","2245","1615","750","2000","20170825","20170825","Geen verstrekking in Open Data","75919","Ja",,,,,,,"4","4","0","0",,"494","187","M1",,,"in motorruimte r.","2245","G5L",,"e1*2007/46*1688*02","JE31","CA250000","0","0.09","298","Nee","Nee",,"Nee","4335","0","0.00","2024","Logisch","00","Ja","2025-05-06T00:00:00.000","2019-04-30T00:00:00.000","2017-08-25T00:00:00.000","2017-08-25T00:00:00.000",,,,,,,,,,,"147",,,,,,,,,,"B",,,,,,,"https://opendata.rdw.nl/resource/3huj-srit.json","https://opendata.rdw.nl/resource/8ys7-d773.json","https://opendata.rdw.nl/resource/vezc-m2t6.json","https://opendata.rdw.nl/resource/jhie-znh9.json","https://opendata.rdw.nl/resource/kmfi-hrps.json"
"PS189R","Personenauto","BMW","520D EFFICIENT DYNAMICS","20241127","20221001","7050","sedan","5","ZWART","Niet geregistreerd","4","1995","1515","2245","1615","750","2000","20170909","20170909","Geen verstrekking in Open Data","82535","Ja",,,,,,,"4","4","0","0",,"494","187","M1",,,"in motorruimte r.","2245","G5L",,"e1*2007/46*1688*02","JE31","CA250000","0","0.09","298","Nee","Nee",,"Nee","4335","0","0.00","2024","Logisch","00","Ja","2024-11-27T00:00:00.000","2022-10-01T00:00:00.000","2017-09-09T00:00:00.000","2017-09-09T00:00:00.000",,,,,,,,,,,"147",,,,,,,,,,"B",,,,,,,"https://opendata.rdw.nl/resource/3huj-srit.json","https://opendata.rdw.nl/resource/8ys7-d773.json","https://opendata.rdw.nl/resource/vezc-m2t6.json","https://opendata.rdw.nl/resource/jhie-znh9.json","https://opendata.rdw.nl/resource/kmfi-hrps.json"
"PV494N","Personenauto","BMW","520D EFFICIENT DYNAMICS","20250103","20240223","5428","sedan","5","GRIJS","Niet geregistreerd","4","1995","1515","2245","1615","750","2000","20171010","20171010","Geen verstrekking in Open Data","61551","Ja",,,,,,,"4","4","0","0",,"494","187","M1",,,"in motorruimte r.","2245","G5L",,"e1*2007/46*1688*02","JE31","CA1500L0","0","0.09","298","Nee","Nee",,"Nee","4335","0","0.00","2024","Logisch","00","Ja","2025-01-03T00:00:00.000","2024-02-23T00:00:00.000","2017-10-10T00:00:00.000","2017-10-10T00:00:00.000",,,,,,,,,,,"147",,,,,,,,,,"A",,,,,,,"https://opendata.rdw.nl/resource/3huj-srit.json","https://opendata.rdw.nl/resource/8ys7-d773.json","https://opendata.rdw.nl/resource/vezc-m2t6.json","https://opendata.rdw.nl/resource/jhie-znh9.json","https://opendata.rdw.nl/resource/kmfi-hrps.json"
"PV665N","Personenauto","BMW","520D EFFICIENT DYNAMICS","20241005","20190802","7050","sedan","5","ZWART","Niet geregistreerd","4","1995","1515","2245","1615","750","2000","20171005","20171005","Geen verstrekking in Open Data","80472","Ja",,,,,,,"4","4","0","0",,"494","187","M1",,,"in motorruimte r.","2245","G5L",,"e1*2007/46*1688*02","JE31","CA2500N0","0","0.09","298","Nee","Nee",,"Nee","4335","0","0.00","2024","Logisch","00","Ja","2024-10-05T00:00:00.000","2019-08-02T00:00:00.000","2017-10-05T00:00:00.000","2017-10-05T00:00:00.000",,,,,,,,,,,"147",,,,,,,,,,"B",,,,,,,"https://opendata.rdw.nl/resource/3huj-srit.json","https://opendata.rdw.nl/resource/8ys7-d773.json","https://opendata.rdw.nl/resource/vezc-m2t6.json","https://opendata.rdw.nl/resource/jhie-znh9.json","https://opendata.rdw.nl/resource/kmfi-hrps.json"
"R501FP","Personenauto","BMW","520D EFFICIENT DYNAMICS","20240816","20220816","2205","sedan","5","GRIJS","Niet geregistreerd","4","1995","1515","2245","1615","750","2000","20180122","20220816","Geen verstrekking in Open Data","62163","Ja","223",,,,,,"4","4",,,,"494","187","M1",,,,"2245","G5L",,"e1*2007/46*1688*03","JE31","CA15R0L0","0","0.07","298","Nee","Nee",,"Nee","4335",,,"2023","Geen oordeel","05","Ja","2024-08-16T00:00:00.000","2022-08-16T00:00:00.000","2018-01-22T00:00:00.000","2022-08-16T00:00:00.000",,,,,,,,,,,"147",,,,,,,,,,,"20220809","2022-08-09T00:00:00.000",,,,,"https://opendata.rdw.nl/resource/3huj-srit.json","https://opendata.rdw.nl/resource/8ys7-d773.json","https://opendata.rdw.nl/resource/vezc-m2t6.json","https://opendata.rdw.nl/resource/jhie-znh9.json","https://opendata.rdw.nl/resource/kmfi-hrps.json"
"RB049G","Personenauto","BMW","520D EFFICIENT DYNAMICS","20241021","20171020","5428","sedan","5","GRIJS","Niet geregistreerd","4","1995","1515","2245","1615","750","2000","20171020","20171020","Geen verstrekking in Open Data","67474","Ja",,,,,,,"4","4","0","0",,"494","187","M1",,,"in motorruimte r.","2245","G5L",,"e1*2007/46*1688*02","JE31","CA1500L0","0","0.09","298","Nee","Nee",,"Nee","4335","0","0.00","2024","Logisch","00","Ja","2024-10-21T00:00:00.000","2017-10-20T00:00:00.000","2017-10-20T00:00:00.000","2017-10-20T00:00:00.000",,,,,,,,,,,"147",,,,,,,,,,"A",,,,,,,"https://opendata.rdw.nl/resource/3huj-srit.json","https://opendata.rdw.nl/resource/8ys7-d773.json","https://opendata.rdw.nl/resource/vezc-m2t6.json","https://opendata.rdw.nl/resource/jhie-znh9.json","https://opendata.rdw.nl/resource/kmfi-hrps.json"
"RJ768P","Personenauto","BMW","520D EFFICIENT DYNAMICS","20241208","20211207","5428","sedan","5","BLAUW","Niet geregistreerd","4","1995","1515","2245","1615","750","2000","20171208","20171208","Geen verstrekking in Open Data","81602","Ja",,,,,,,"4","4","0","0",,"494","187","M1",,,"in motorruimte r.","2245","G5L",,"e1*2007/46*1688*03","JE31","CA150000","0","0.09","298","Nee","Nee",,"Nee","4335","0","0.00","2023","Logisch","00","Ja","2024-12-08T00:00:00.000","2021-12-07T00:00:00.000","2017-12-08T00:00:00.000","2017-12-08T00:00:00.000",,,,,,,,,,,"147",,,,,,,,,,"A",,,,,,,"https://opendata.rdw.nl/resource/3huj-srit.json","https://opendata.rdw.nl/resource/8ys7-d773.json","https://opendata.rdw.nl/resource/vezc-m2t6.json","https://opendata.rdw.nl/resource/jhie-znh9.json","https://opendata.rdw.nl/resource/kmfi-hrps.json"
"RL109S","Personenauto","BMW","520D EFFICIENT DYNAMICS","20240628","20230630","7050","sedan","5","WIT","Niet geregistreerd","4","1995","1515","2245","1615","750","2000","20180112","20180112","Geen verstrekking in Open Data","70929","Ja",,,,,,,"4","4","0","0",,"494","187","M1",,,"in motorruimte r.","2245","G5L",,"e1*2007/46*1688*03","JE31","CA2500L0","0","0.09","298","Nee","Nee",,"Nee","4335","0","0.00","2023","Logisch","00","Ja","2024-06-28T00:00:00.000","2023-06-30T00:00:00.000","2018-01-12T00:00:00.000","2018-01-12T00:00:00.000",,,,,,,,,,,"147",,,,,,,,,,"C",,,,,,,"https://opendata.rdw.nl/resource/3huj-srit.json","https://opendata.rdw.nl/resource/8ys7-d773.json","https://opendata.rdw.nl/resource/vezc-m2t6.json","https://opendata.rdw.nl/resource/jhie-znh9.json","https://opendata.rdw.nl/resource/kmfi-hrps.json"
"RT264D","Personenauto","BMW","520D EFFICIENT DYNAMICS","20250202","20230608","6040","sedan","5","GRIJS","Niet geregistreerd","4","1995","1515","2245","1615","750","2000","20180202","20180202","Geen verstrekking in Open Data","71669","Ja",,,,,,,"4","4","0","0",,"494","187","M1",,,"in motorruimte r.","2245","G5L",,"e1*2007/46*1688*03","JE31","CA150000","0","0.09","298","Nee","Nee",,"Ja","4335","0","0.00","2024","Logisch","00","Ja","2025-02-02T00:00:00.000","2023-06-08T00:00:00.000","2018-02-02T00:00:00.000","2018-02-02T00:00:00.000",,,,,,,,,,,"147",,,,,,,,,,"B","20230613","2023-06-13T00:00:00.000",,,,,"https://opendata.rdw.nl/resource/3huj-srit.json","https://opendata.rdw.nl/resource/8ys7-d773.json","https://opendata.rdw.nl/resource/vezc-m2t6.json","https://opendata.rdw.nl/resource/jhie-znh9.json","https://opendata.rdw.nl/resource/kmfi-hrps.json"
"RX479V","Personenauto","BMW","520D EFFICIENT DYNAMICS","20250228","20240222","6040","sedan","5","GRIJS","Niet geregistreerd","4","1995","1515","2245","1615","750","2000","20180228","20180228","Geen verstrekking in Open Data","69718","Ja",,,,,,,"4","4","0","0",,"494","187","M1",,,"in motorruimte r.","2245","G5L",,"e1*2007/46*1688*03","JE31","CA150000","0","0.09","298","Nee","Nee",,"Nee","4335","0","0.00","2024","Logisch","00","Ja","2025-02-28T00:00:00.000","2024-02-22T00:00:00.000","2018-02-28T00:00:00.000","2018-02-28T00:00:00.000",,,,,,,,,,,"147",,,,,,,,,,"B",,,,,,,"https://opendata.rdw.nl/resource/3huj-srit.json","https://opendata.rdw.nl/resource/8ys7-d773.json","https://opendata.rdw.nl/resource/vezc-m2t6.json","https://opendata.rdw.nl/resource/jhie-znh9.json","https://opendata.rdw.nl/resource/kmfi-hrps.json"
"SF531R","Personenauto","BMW","520D EFFICIENT DYNAMICS","20250504","20231010","6040","sedan","5","BLAUW","Niet geregistreerd","4","1995","1515","2245","1615","750","2000","20180316","20180316","Geen verstrekking in Open Data","72839","Ja",,,,,,,"4","4","0","0",,"494","0","M1",,,"r. motorruimte","2245","G5L",,"e1*2007/46*1688*03","JE31","CA1500L0","0","0.09","298","Nee","Nee",,"Nee","4335","0","0.00","2024","Logisch","00","Ja","2025-05-04T00:00:00.000","2023-10-10T00:00:00.000","2018-03-16T00:00:00.000","2018-03-16T00:00:00.000",,,,,,,,,,,,,,,,,,,,,"B",,,,,,,"https://opendata.rdw.nl/resource/3huj-srit.json","https://opendata.rdw.nl/resource/8ys7-d773.json","https://opendata.rdw.nl/resource/vezc-m2t6.json","https://opendata.rdw.nl/resource/jhie-znh9.json","https://opendata.rdw.nl/resource/kmfi-hrps.json"