"kenteken","voertuigsoort","merk","handelsbenaming","vervaldatum_apk","datum_tenaamstelling","bruto_bpm","inrichting","aantal_zitplaatsen","eerste_kleur","tweede_kleur","aantal_cilinders","cilinderinhoud","massa_ledig_voertuig","toegestane_maximum_massa_voertuig","massa_rijklaar","maximum_massa_trekken_ongeremd","maximum_trekken_massa_geremd","datum_eerste_toelating","datum_eerste_tenaamstelling_in_nederland","wacht_op_keuren","catalogusprijs","wam_verzekerd","maximale_constructiesnelheid","laadvermogen","oplegger_geremd","aanhangwagen_autonoom_geremd","aanhangwagen_middenas_geremd","aantal_staanplaatsen","aantal_deuren","aantal_wielen","afstand_hart_koppeling_tot_achterzijde_voertuig","afstand_voorzijde_voertuig_tot_hart_koppeling","afwijkende_maximum_snelheid","lengte","breedte","europese_voertuigcategorie","europese_voertuigcategorie_toevoeging","europese_uitvoeringcategorie_toevoeging","plaats_chassisnummer","technische_max_massa_voertuig","type","type_gasinstallatie","typegoedkeuringsnummer","variant","uitvoering","volgnummer_wijziging_eu_typegoedkeuring","vermogen_massarijklaar","wielbasis","export_indicator","openstaande_terugroepactie_indicator","vervaldatum_tachograaf","taxi_indicator","maximum_massa_samenstelling","aantal_rolstoelplaatsen","maximum_ondersteunende_snelheid","jaar_laatste_registratie_tellerstand","tellerstandoordeel","code_toelichting_tellerstandoordeel","tenaamstellen_mogelijk","vervaldatum_apk_dt","datum_tenaamstelling_dt","datum_eerste_toelating_dt","datum_eerste_tenaamstelling_in_nederland_dt","vervaldatum_tachograaf_dt","maximum_last_onder_de_vooras_sen_tezamen_koppeling","type_remsysteem_voertuig_code","rupsonderstelconfiguratiecode","wielbasis_voertuig_minimum","wielbasis_voertuig_maximum","lengte_voertuig_minimum","lengte_voertuig_maximum","breedte_voertuig_minimum","breedte_voertuig_maximum","hoogte_voertuig","hoogte_voertuig_minimum","hoogte_voertuig_maximum","massa_bedrijfsklaar_minimaal","massa_bedrijfsklaar_maximaal","technisch_toelaatbaar_massa_koppelpunt","maximum_massa_technisch_maximaal","maximum_massa_technisch_minimaal","subcategorie_nederland","verticale_belasting_koppelpunt_getrokken_voertuig","zuinigheidsclassificatie","registratie_datum_goedkeuring_afschrijvingsmoment_bpm","registratie_datum_goedkeuring_afschrijvingsmoment_bpm_dt","gem_lading_wrde","aerodyn_voorz","massa_alt_aandr","verl_cab_ind","api_gekentekende_voertuigen_assen","api_gekentekende_voertuigen_brandstof","api_gekentekende_voertuigen_carrosserie","api_gekentekende_voertuigen_carrosserie_specifiek","api_gekentekende_voertuigen_voertuigklasse"
"03XXVT","Personenauto","AUDI","AUDI A4 WW.AUDI S4","20241026","20090411","8761","sedan","5","GRIJS","Niet geregistreerd","4","1984","1315","1890","1415","700","1300","20041201","20071031","Geen verstrekking in Open Data",,"Ja",,,,,,,"4","4",,,,,,"M1",,,"r. by schutbord","1890",,,,,,,"0.07","266","Nee","Nee",,"Nee","3235",,,"2023","Geen oordeel","05","Ja","2024-10-26T00:00:00.000","2009-04-11T00:00:00.000","2004-12-01T00:00:00.000","2007-10-31T00:00:00.000",,"0",,,,,,,,,,,,,,,,,,,,,,,,,,"https://opendata.rdw.nl/resource/3huj-srit.json","https://opendata.rdw.nl/resource/8ys7-d773.json","https://opendata.rdw.nl/resource/vezc-m2t6.json","https://opendata.rdw.nl/resource/jhie-znh9.json","https://opendata.rdw.nl/resource/kmfi-hrps.json"
"06NBB2","Personenauto","AUDI","AUDI A4 WW.AUDI S4","20250506","20230224","9715","sedan","5","BLAUW","Niet geregistreerd","4","1781","1365","1940","1465","730","1400","20050104","20100922","Geen verstrekking in Open Data",,"Ja",,,,,,,"4","4",,,,,,"M1",,,"schutbord by motorruimte","1940",,,,,,,"0.08","266","Nee","Nee",,"Nee",,,,"2024","Geen oordeel","05","Ja","2025-05-06T00:00:00.000","2023-02-24T00:00:00.000","2005-01-04T00:00:00.000","2010-09-22T00:00:00.000",,"0",,,,,,,,,,,,,,,,,,,,,,,,,,"https://opendata.rdw.nl/resource/3huj-srit.json","https://opendata.rdw.nl/resource/8ys7-d773.json","https://opendata.rdw.nl/resource/vezc-m2t6.json","https://opendata.rdw.nl/resource/jhie-znh9.json","https://opendata.rdw.nl/resource/kmfi-hrps.json"
"1XDT91","Personenauto","AUDI","AUDI A4 WW.AUDI S4","20240621","20240614","10792","sedan","5","GRIJS","Niet geregistreerd","6","2393","1550","2035","1650","750","1600","20031013","20140627","Geen verstrekking in Open Data","47275","Ja",,,,,,,"4","4",,,,,,"M1",,,"v. by schutbord","2035",,"G3 gasinstallatie",,,,,"0.08","265","Nee","Nee",,"Nee",,,,"2023","Geen oordeel","05","Ja","2024-06-21T00:00:00.000","2024-06-14T00:00:00.000","2003-10-13T00:00:00.000","2014-06-27T00:00:00.000",,"0",,,,,,,,,,,,,,,,,,,,,,,,,,"https://opendata.rdw.nl/resource/3huj-srit.json","https://opendata.rdw.nl/resource/8ys7-d773.json","https://opendata.rdw.nl/resource/vezc-m2t6.json","https://opendata.rdw.nl/resource/jhie-znh9.json","https://opendata.rdw.nl/resource/kmfi-hrps.json"
"56NBP5","Personenauto","AUDI","AUDI A4 WW.AUDI S4","20250611","20230718","5851","sedan","5","GRIJS","Niet geregistreerd","4","1781","1445","2020","1545","750","1600","20030922","20100729","Geen verstrekking in Open Data",,"Ja",,,,,,,"4","4",,,,,,"M1",,,"schutbord motorruimte","2020",,,,,,,"0.08","264","Nee","Nee",,"Nee",,,,"2024","Geen oordeel","05","Ja","2025-06-11T00:00:00.000","2023-07-18T00:00:00.000","2003-09-22T00:00:00.000","2010-07-29T00:00:00.000",,"0",,,,,,,,,,,,,,,,,,,,,,,,,,"https://opendata.rdw.nl/resource/3huj-srit.json","https://opendata.rdw.nl/resource/8ys7-d773.json","https://opendata.rdw.nl/resource/vezc-m2t6.json","https://opendata.rdw.nl/resource/jhie-znh9.json","https://opendata.rdw.nl/resource/kmfi-hrps.json"
"84XDVT","Personenauto","AUDI","AUDI A4 WW.AUDI S4","20241219","20070413","11185","sedan","5","BLAUW","Niet geregistreerd","4","1781","1445","2020","1545","750","1600","20041216","20070413","Geen verstrekking in Open Data",,"Ja",,,,,,,"4","4",,,,,,"M1",,,"midden tegen schutbord onder motorkap","2020",,,,,,,"0.08","265","Nee","Nee",,"Nee","3665",,,"2023","Geen oordeel","05","Ja","2024-12-19T00:00:00.000","2007-04-13T00:00:00.000","2004-12-16T00:00:00.000","2007-04-13T00:00:00.000",,"0",,,,,,,,,,,,,,,,,,,,,,,,,,"https://opendata.rdw.nl/resource/3huj-srit.json","https://opendata.rdw.nl/resource/8ys7-d773.json","https://opendata.rdw.nl/resource/vezc-m2t6.json","https://opendata.rdw.nl/resource/jhie-znh9.json","https://opendata.rdw.nl/resource/kmfi-hrps.json"
"G339JZ","Personenauto","AUDI","AUDI A4 WW.AUDI S4","20241010","20191010","7847","sedan","5","ZWART","Niet geregistreerd","4","1984","1365","1940","1465","730","1300","20050620","20191010","Geen verstrekking in Open Data",,"Ja","205",,,,,,"4","4",,,,,,"M1",,,,"1940","8E",,,,,,"0.07","264","Nee","Nee",,"Nee","3285",,,"2023","Geen oordeel","05","Ja","2024-10-10T00:00:00.000","2019-10-10T00:00:00.000","2005-06-20T00:00:00.000","2019-10-10T00:00:00.000",,,,,,,,,,,,,,,,,,,,,,,,,,,,"https://opendata.rdw.nl/resource/3huj-srit.json","https://opendata.rdw.nl/resource/8ys7-d773.json","https://opendata.rdw.nl/resource/vezc-m2t6.json","https://opendata.rdw.nl/resource/jhie-znh9.json","https://opendata.rdw.nl/resource/kmfi-hrps.json"
"G359ZR","Personenauto","AUDI","AUDI A4 WW.AUDI S4","20240911","20220326","10245","sedan","5","GRIJS","Niet geregistreerd","6","2393","1450","2025","1550","750","1600","20030218","20200911","Geen verstrekking in Open Data",,"Ja","222",,,,,,"4","4",,,,,,"M1",,,,"2025",,,,,,,"0.08","266","Nee","Nee",,"Nee","3670",,,"2023","Geen oordeel","05","Ja","2024-09-11T00:00:00.000","2022-03-26T00:00:00.000","2003-02-18T00:00:00.000","2020-09-11T00:00:00.000",,,,,,,,,,,,,,,,,,,,,,,,,,,,"https://opendata.rdw.nl/resource/3huj-srit.json","https://opendata.rdw.nl/resource/8ys7-d773.json","https://opendata.rdw.nl/resource/vezc-m2t6.json","https://opendata.rdw.nl/resource/jhie-znh9.json","https://opendata.rdw.nl/resource/kmfi-hrps.json"
"G489NN","Personenauto","AUDI","AUDI A4 WW.AUDI S4","20250405","20230614","9239","sedan","5","GRIJS","Niet geregistreerd","4","1984","1425","2000","1525","750","1500","20041125","20210326","Geen verstrekking in Open Data",,"Ja","235",,,,,,"4","4",,,,,,"M1",,,"schutbord","2000",,,,,,,"0.10","265","Nee","Nee",,"Nee","3545",,,"2024","Geen oordeel","05","Ja","2025-04-05T00:00:00.000","2023-06-14T00:00:00.000","2004-11-25T00:00:00.000","2021-03-26T00:00:00.000",,,,,,,,,,,,,,,,,,,,,,,,,,,,"https://opendata.rdw.nl/resource/3huj-srit.json","https://opendata.rdw.nl/resource/8ys7-d773.json","https://opendata.rdw.nl/resource/vezc-m2t6.json","https://opendata.rdw.nl/resource/jhie-znh9.json","https://opendata.rdw.nl/resource/kmfi-hrps.json"
"GH928P","Personenauto","AUDI","AUDI A4 WW.AUDI S4","20250312","20150526","8085","sedan","5","ZWART","Niet geregistreerd","4","1984","1285","1860","1385","690","1300","20011010","20150526","Geen verstrekking in Open Data",,"Ja",,,,,,,"4","4",,,,,,"M1",,,"midden tegen schutbord onder motorkap","1860",,,,,,,"0.07","266","Nee","Nee",,"Nee","3205",,,"2024","Geen oordeel","05","Ja","2025-03-12T00:00:00.000","2015-05-26T00:00:00.000","2001-10-10T00:00:00.000","2015-05-26T00:00:00.000",,,,,,,,,,,,,,,,,,,,,,,,,,,,"https://opendata.rdw.nl/resource/3huj-srit.json","https://opendata.rdw.nl/resource/8ys7-d773.json","https://opendata.rdw.nl/resource/vezc-m2t6.json","https://opendata.rdw.nl/resource/jhie-znh9.json","https://opendata.rdw.nl/resource/kmfi-hrps.json"
"GN306R","Personenauto","AUDI","AUDI A4 WW.AUDI S4","20250110","20231221","7304","sedan","5","GRIJS","Niet geregistreerd","4","1595","1275","1850","1375","680","1200","20051027","20150703","Geen verstrekking in Open Data",,"Ja",,,,,,,"4","4",,,,,,"M1",,,"r. schutbord motorruimte","1850",,,,,,,"0.05","266","Nee","Nee",,"Nee",,,,"2024","Geen oordeel","05","Ja","2025-01-10T00:00:00.000","2023-12-21T00:00:00.000","2005-10-27T00:00:00.000","2015-07-03T00:00:00.000",,,,,,,,,,,,,,,,,,,,,,,,,,,,"https://opendata.rdw.nl/resource/3huj-srit.json","https://opendata.rdw.nl/resource/8ys7-d773.json","https://opendata.rdw.nl/resource/vezc-m2t6.json","https://opendata.rdw.nl/resource/jhie-znh9.json","https://opendata.rdw.nl/resource/kmfi-hrps.json"
"GX562V","Personenauto","AUDI","AUDI A4 WW.AUDI S4","20241103","20220115","19674","sedan","5","GRIJS","Niet geregistreerd","6","2393","1543","2025","1643","750","1600","20020304","20150919","Geen verstrekking in Open Data",,"Ja","222",,,,,,"4","4",,,,,,"M1",,,"schutbord by motorruimte","2025",,,,,,,"0.08","265","Nee","Nee",,"Nee","3670",,,"2023","Geen oordeel","05","Ja","2024-11-03T00:00:00.000","2022-01-15T00:00:00.000","2002-03-04T00:00:00.000","2015-09-19T00:00:00.000",,,,,,,,,,,,,,,,,,,,,,,,,,,,"https://opendata.rdw.nl/resource/3huj-srit.json","https://opendata.rdw.nl/resource/8ys7-d773.json","https://opendata.rdw.nl/resource/vezc-m2t6.json","https://opendata.rdw.nl/resource/jhie-znh9.json","https://opendata.rdw.nl/resource/kmfi-hrps.json"
"H544HR","Personenauto","AUDI","AUDI A4 WW.AUDI S4","20250208","20200207","6472","sedan","5","GRIJS","Niet geregistreerd","4","1595","1270","1845","1370","680","1200","20031216","20200207","Geen verstrekking in Open Data",,"Ja","190",,,,,,"4","4",,,,,,"M1",,,"r. schutbord by motorruimte","1845",,,,,,,"0.05","264","Nee","Nee",,"Nee","3090",,,"2024","Geen oordeel","05","Ja","2025-02-08T00:00:00.000","2020-02-07T00:00:00.000","2003-12-16T00:00:00.000","2020-02-07T00:00:00.000",,,,,,,,,,,,,,,,,,,,,,,,,,,,"https://opendata.rdw.nl/resource/3huj-srit.json","https://opendata.rdw.nl/resource/8ys7-d773.json","https://opendata.rdw.nl/resource/vezc-m2t6.json","https://opendata.rdw.nl/resource/jhie-znh9.json","https://opendata.rdw.nl/resource/kmfi-hrps.json"
"J428ZB","Personenauto","AUDI","AUDI A4 WW.AUDI S4","20250125","20210126","5941","sedan","5","GRIJS","Niet geregistreerd","4","1595","1270","1845","1370","680","1200","20010907","20210126","Geen verstrekking in Open Data",,"Ja","190",,,,,,"4","4",,,,,,"M1",,,,"1845","8E",,,,,,"0.05","265","Nee","Nee",,"Nee","3090",,,"2024","Geen oordeel","05","Ja","2025-01-25T00:00:00.000","2021-01-26T00:00:00.000","2001-09-07T00:00:00.000","2021-01-26T00:00:00.000",,,,,,,,,,,,,,,,,,,,,,,,,,,,"https://opendata.rdw.nl/resource/3huj-srit.json","https://opendata.rdw.nl/resource/8ys7-d773.json","https://opendata.rdw.nl/resource/vezc-m2t6.json","https://opendata.rdw.nl/resource/jhie-znh9.json","https://opendata.rdw.nl/resource/kmfi-hrps.json"
"J449RL","Personenauto","AUDI","AUDI A4 WW.AUDI S4","20250320","20240320","7952","sedan","5","ZWART","Niet geregistreerd","4","1984","1365","1940","1465","730","1300","20051118","20201031","Geen verstrekking in Open Data",,"Ja","205",,,,,,"4","4",,,,,,"M1",,,,"1940","8E",,,,,,"0.07","264","Nee","Nee",,"Nee","3285",,,"2024","Geen oordeel","05","Ja","2025-03-20T00:00:00.000","2024-03-20T00:00:00.000","2005-11-18T00:00:00.000","2020-10-31T00:00:00.000",,,,,,,,,,,,,,,,,,,,,,,,,,,,"https://opendata.rdw.nl/resource/3huj-srit.json","https://opendata.rdw.nl/resource/8ys7-d773.json","https://opendata.rdw.nl/resource/vezc-m2t6.json","https://opendata.rdw.nl/resource/jhie-znh9.json","https://opendata.rdw.nl/resource/kmfi-hrps.json"
"J884KH","Personenauto","AUDI","AUDI A4 WW.AUDI S4","20250621","20240516","8125","sedan","5","GRIJS","Niet geregistreerd","4","1984","1320","1895","1420","710","1400","20010430","20200821","Geen verstrekking in Open Data",,"Ja","205",,,,,,"4","4",,,,,,"M1",,,,"1895","8E",,,,,,"0.07","264","Nee","Nee",,"Nee",,,,"2024","Geen oordeel","05","Ja","2025-06-21T00:00:00.000","2024-05-16T00:00:00.000","2001-04-30T00:00:00.000","2020-08-21T00:00:00.000",,,,,,,,,,,,,,,,,,,,,,,,,,,,"https://opendata.rdw.nl/resource/3huj-srit.json","https://opendata.rdw.nl/resource/8ys7-d773.json","https://opendata.rdw.nl/resource/vezc-m2t6.json","https://opendata.rdw.nl/resource/jhie-znh9.json","https://opendata.rdw.nl/resource/kmfi-hrps.json"
"JG254P","Personenauto","AUDI","AUDI A4 WW.AUDI S4","20250224","20240119","7973","sedan","5","BLAUW","Niet geregistreerd","4","1984","1372","1860","1472","690","1300","20010517","20160311","Geen verstrekking in Open Data",,"Ja",,,,,,,"4","4",,,,,,"M1",,,"r. schutbord motorruimte","1860",,,,,,,"0.07","266","Nee","Nee",,"Nee",,,,"2024","Geen oordeel","05","Ja","2025-02-24T00:00:00.000","2024-01-19T00:00:00.000","2001-05-17T00:00:00.000","2016-03-11T00:00:00.000",,,,,,,,,,,,,,,,,,,,,,,,,,,,"https://opendata.rdw.nl/resource/3huj-srit.json","https://opendata.rdw.nl/resource/8ys7-d773.json","https://opendata.rdw.nl/resource/vezc-m2t6.json","https://opendata.rdw.nl/resource/jhie-znh9.json","https://opendata.rdw.nl/resource/kmfi-hrps.json"
"JZ608J","Personenauto","AUDI","AUDI A4 WW.AUDI S4","20240909","20230819","10832","sedan","5","BLAUW","Niet geregistreerd","6","2393","1450","2025","1550","750","1600","20011210","20160826","Geen verstrekking in Open Data",,"Ja",,,,,,,"4","4",,,,,,"M1",,,"midden tegen schutbord onder motorkap","2025","8E",,,,,,"0.08","266","Nee","Nee",,"Nee","3625",,,"2023","Geen oordeel","05","Ja","2024-09-09T00:00:00.000","2023-08-19T00:00:00.000","2001-12-10T00:00:00.000","2016-08-26T00:00:00.000",,,,,,,,,,,,,,,,,,,,,,,,,,,,"https://opendata.rdw.nl/resource/3huj-srit.json","https://opendata.rdw.nl/resource/8ys7-d773.json","https://opendata.rdw.nl/resource/vezc-m2t6.json","https://opendata.rdw.nl/resource/jhie-znh9.json","https://opendata.rdw.nl/resource/kmfi-hrps.json"
"K102LZ","Personenauto","AUDI","AUDI A4 WW.AUDI S4","20230614","20210507","11705","sedan","5","GRIJS","Niet geregistreerd","4","1781","1370","1945","1470","730","1400","20040312","20210421","Geen verstrekking in Open Data",,"Ja","236",,,,,,"4","4",,,,,,"M1",,,,"1945","8E",,,,,,"0.10","265","Nee","Nee",,"Nee",,,,"2022","Geen oordeel","05","Ja","2023-06-14T00:00:00.000","2021-05-07T00:00:00.000","2004-03-12T00:00:00.000","2021-04-21T00:00:00.000",,,,,,,,,,,,,,,,,,,,,,,,,,,,"https://opendata.rdw.nl/resource/3huj-srit.json","https://opendata.rdw.nl/resource/8ys7-d773.json","https://opendata.rdw.nl/resource/vezc-m2t6.json","https://opendata.rdw.nl/resource/jhie-znh9.json","https://opendata.rdw.nl/resource/kmfi-hrps.json"
"KT313G","Personenauto","AUDI","AUDI A4 WW.AUDI S4","20250104","20170406","9573","sedan","5","BLAUW","Niet geregistreerd","4","1984","1365","1940","1465","730","1300","20050110","20170406","Geen verstrekking in Open Data",,"Ja",,,,,,,"4","4",,,,,,"M1",,,"schutbord","1940","8E",,,,,,"0.07","266","Nee","Nee",,"Nee",,,,"2023","Geen oordeel","05","Ja","2025-01-04T00:00:00.000","2017-04-06T00:00:00.000","2005-01-10T00:00:00.000","2017-04-06T00:00:00.000",,,,,,,,,,,,,,,,,,,,,,,,,,,,"https://opendata.rdw.nl/resource/3huj-srit.json","https://opendata.rdw.nl/resource/8ys7-d773.json","https://opendata.rdw.nl/resource/vezc-m2t6.json","https://opendata.rdw.nl/resource/jhie-znh9.json","https://opendata.rdw.nl/resource/kmfi-hrps.json"
"L786XT","Personenauto","AUDI","AUDI A4 WW.AUDI S4","20240823","20210821","6866","sedan","5","GRIJS","Niet geregistreerd","4","1984","1325","1900","1425","710","1300","20040209","20210821","Geen verstrekking in Open Data",,"Ja","218",,,,,,"4","4",,,,,,"M1",,,,"1900","8E",,,,,,"0.08","265","Nee","Nee",,"Nee","3245",,,"2023","Geen oordeel","05","Ja","2024-08-23T00:00:00.000","2021-08-21T00:00:00.000","2004-02-09T00:00:00.000","2021-08-21T00:00:00.000",,,,,,,,,,,,,,,,,,,,,,,,,,,,"https://opendata.rdw.nl/resource/3huj-srit.json","https://opendata.rdw.nl/resource/8ys7-d773.json","https://opendata.rdw.nl/resource/vezc-m2t6.json","https://opendata.rdw.nl/resource/jhie-znh9.json","https://opendata.rdw.nl/resource/kmfi-hrps.json"
"N719VZ","Personenauto","AUDI","AUDI A4 WW.AUDI S4","20250331","20220628","7897","sedan","5","GRIJS","Niet geregistreerd","4","1984","1285","1860","1385","690","1300","20040109","20211231","Geen verstrekking in Open Data",,"Ja","212",,,,,,"4","4",,,,,,"M1",,,,"1860","8E",,,,,,"0.07","266","Nee","Nee",,"Nee","3205",,,"2024","Geen oordeel","05","Ja","2025-03-31T00:00:00.000","2022-06-28T00:00:00.000","2004-01-09T00:00:00.000","2021-12-31T00:00:00.000",,,,,,,,,,,,,,,,,,,,,,"20211229","2021-12-29T00:00:00.000",,,,,"https://opendata.rdw.nl/resource/3huj-srit.json","https://opendata.rdw.nl/resource/8ys7-d773.json","https://opendata.rdw.nl/resource/vezc-m2t6.json","https://opendata.rdw.nl/resource/jhie-znh9.json","https://opendata.rdw.nl/resource/kmfi-hrps.json"
"NJ894F","Personenauto","AUDI","AUDI A4 WW.AUDI S4","20240923","20240323","9643","sedan","5","BLAUW","Niet geregistreerd","4","1984","1320","1895","1420","710","1300","20011121","20170202","Geen verstrekking in Open Data",,"Ja",,,,,,,"4","4",,,,,,"M1",,,"r. schutbord","1895",,,,,,,"0.07","264","Nee","Nee",,"Nee",,,,"2024","Geen oordeel","05","Ja","2024-09-23T00:00:00.000","2024-03-23T00:00:00.000","2001-11-21T00:00:00.000","2017-02-02T00:00:00.000",,,,,,,,,,,,,,,,,,,,,,,,,,,,"https://opendata.rdw.nl/resource/3huj-srit.json","https://opendata.rdw.nl/resource/8ys7-d773.json","https://opendata.rdw.nl/resource/vezc-m2t6.json","https://opendata.rdw.nl/resource/jhie-znh9.json","https://opendata.rdw.nl/resource/kmfi-hrps.json"
"PT815P","Personenauto","AUDI","AUDI A4 WW.AUDI S4","20241012","20210528","8393","sedan","5","GRIJS","Niet geregistreerd","4","1781","1390","1965","1490","740","1500","20020403","20171014","Geen verstrekking in Open Data",,"Ja",,,,,,,"4","4",,,,,,"M1",,,"r. schutbord","1965","8E",,,,,,"0.07","265","Nee","Nee",,"Nee","3510",,,"2023","Geen oordeel","05","Ja","2024-10-12T00:00:00.000","2021-05-28T00:00:00.000","2002-04-03T00:00:00.000","2017-10-14T00:00:00.000",,,,,,,,,,,,,,,,,,,,,,,,,,,,"https://opendata.rdw.nl/resource/3huj-srit.json","https://opendata.rdw.nl/resource/8ys7-d773.json","https://opendata.rdw.nl/resource/vezc-m2t6.json","https://opendata.rdw.nl/resource/jhie-znh9.json","https://opendata.rdw.nl/resource/kmfi-hrps.json"
"RH632V","Personenauto","AUDI","AUDI A4 WW.AUDI S4","20240928","20220416","9859","sedan","5","GRIJS","Niet geregistreerd","4","1984","1340","1915","1440","710","1300","20031009","20171124","Geen verstrekking in Open Data",,"Ja",,,,,,,"4","4",,,,,,"M1",,,"v. schutbord","1915","8E",,,,,,"0.07","266","Nee","Nee",,"Nee","3260",,,"2023","Geen oordeel","05","Ja","2024-09-28T00:00:00.000","2022-04-16T00:00:00.000","2003-10-09T00:00:00.000","2017-11-24T00:00:00.000",,,,,,,,,,,,,,,,,,,,,,,,,,,,"https://opendata.rdw.nl/resource/3huj-srit.json","https://opendata.rdw.nl/resource/8ys7-d773.json","https://opendata.rdw.nl/resource/vezc-m2t6.json","https://opendata.rdw.nl/resource/jhie-znh9.json","https://opendata.rdw.nl/resource/kmfi-hrps.json"
"SF139J","Personenauto","AUDI","AUDI A4 WW.AUDI S4","20241203","20211208","9219","sedan","5","GRIJS","Niet geregistreerd","4","1984","1365","1940","1465","730","1300","20050304","20180510","Geen verstrekking in Open Data",,"Ja",,,,,,,"4","4",,,,,,"M1",,,,"1940",,,,,,,"0.07","266","Nee","Nee",,"Nee",,,,"2023","Geen oordeel","05","Ja","2024-12-03T00:00:00.000","2021-12-08T00:00:00.000","2005-03-04T00:00:00.000","2018-05-10T00:00:00.000",,,,,,,,,,,,,,,,,,,,,,,,,,,,"https://opendata.rdw.nl/resource/3huj-srit.json","https://opendata.rdw.nl/resource/8ys7-d773.json","https://opendata.rdw.nl/resource/vezc-m2t6.json","https://opendata.rdw.nl/resource/jhie-znh9.json","https://opendata.rdw.nl/resource/kmfi-hrps.json"
"SF260G","Personenauto","AUDI","AUDI A4 WW.AUDI S4","20250619","20230619","7304","sedan","5","GRIJS","Niet geregistreerd","4","1595","1275","1850","1375","680","1200","20050729","20180618","Geen verstrekking in Open Data",,"Ja",,,,,,,"4","4",,,,,,"M1",,,,"1850","8E",,,,,,"0.05","265","Nee","Nee",,"Nee",,,,"2024","Geen oordeel","05","Ja","2025-06-19T00:00:00.000","2023-06-19T00:00:00.000","2005-07-29T00:00:00.000","2018-06-18T00:00:00.000",,,,,,,,,,,,,,,,,,,,,,,,,,,,"https://opendata.rdw.nl/resource/3huj-srit.json","https://opendata.rdw.nl/resource/8ys7-d773.json","https://opendata.rdw.nl/resource/vezc-m2t6.json","https://opendata.rdw.nl/resource/jhie-znh9.json","https://opendata.rdw.nl/resource/kmfi-hrps.json"
"SJ371F","Personenauto","AUDI","AUDI A4 WW.AUDI S4","20240718","20180706","8085","sedan","5","WIT","Niet geregistreerd","4","1984","1285","1860","1385","690","1300","20010723","20180706","Geen verstrekking in Open Data",,"Ja",,,,,,,"4","4",,,,,,"M1",,,"schutbord","1860","8E",,,,,,"0.07","266","Nee","Nee",,"Nee","3160",,,"2023","Geen oordeel","05","Ja","2024-07-18T00:00:00.000","2018-07-06T00:00:00.000","2001-07-23T00:00:00.000","2018-07-06T00:00:00.000",,,,,,,,,,,,,,,,,,,,,,,,,,,,"https://opendata.rdw.nl/resource/3huj-srit.json","https://opendata.rdw.nl/resource/8ys7-d773.json","https://opendata.rdw.nl/resource/vezc-m2t6.json","https://opendata.rdw.nl/resource/jhie-znh9.json","https://opendata.rdw.nl/resource/kmfi-hrps.json"
"SK572S","Personenauto","AUDI","AUDI A4 WW.AUDI S4","20241031","20180419","8164","sedan","5","GRIJS","Niet geregistreerd","4","1781","1350","1925","1450","720","1400","20011121","20180419","Geen verstrekking in Open Data",,"Ja",,,,,,,"4","4",,,,,,"M1",,,"by schutbord onder motorruimte","1925","8E",,,,,,"0.08","265","Nee","Nee",,"Nee","3370",,,"2023","Geen oordeel","05","Ja","2024-10-31T00:00:00.000","2018-04-19T00:00:00.000","2001-11-21T00:00:00.000","2018-04-19T00:00:00.000",,,,,,,,,,,,,,,,,,,,,,,,,,,,"https://opendata.rdw.nl/resource/3huj-srit.json","https://opendata.rdw.nl/resource/8ys7-d773.json","https://opendata.rdw.nl/resource/vezc-m2t6.json","https://opendata.rdw.nl/resource/jhie-znh9.json","https://opendata.rdw.nl/resource/kmfi-hrps.json"