"kenteken","voertuigsoort","merk","handelsbenaming","vervaldatum_apk","datum_tenaamstelling","bruto_bpm","inrichting","aantal_zitplaatsen","eerste_kleur","tweede_kleur","aantal_cilinders","cilinderinhoud","massa_ledig_voertuig","toegestane_maximum_massa_voertuig","massa_rijklaar","maximum_massa_trekken_ongeremd","maximum_trekken_massa_geremd","datum_eerste_toelating","datum_eerste_tenaamstelling_in_nederland","wacht_op_keuren","catalogusprijs","wam_verzekerd","maximale_constructiesnelheid","laadvermogen","oplegger_geremd","aanhangwagen_autonoom_geremd","aanhangwagen_middenas_geremd","aantal_staanplaatsen","aantal_deuren","aantal_wielen","afstand_hart_koppeling_tot_achterzijde_voertuig","afstand_voorzijde_voertuig_tot_hart_koppeling","afwijkende_maximum_snelheid","lengte","breedte","europese_voertuigcategorie","europese_voertuigcategorie_toevoeging","europese_uitvoeringcategorie_toevoeging","plaats_chassisnummer","technische_max_massa_voertuig","type","type_gasinstallatie","typegoedkeuringsnummer","variant","uitvoering","volgnummer_wijziging_eu_typegoedkeuring","vermogen_massarijklaar","wielbasis","export_indicator","openstaande_terugroepactie_indicator","vervaldatum_tachograaf","taxi_indicator","maximum_massa_samenstelling","aantal_rolstoelplaatsen","maximum_ondersteunende_snelheid","jaar_laatste_registratie_tellerstand","tellerstandoordeel","code_toelichting_tellerstandoordeel","tenaamstellen_mogelijk","vervaldatum_apk_dt","datum_tenaamstelling_dt","datum_eerste_toelating_dt","datum_eerste_tenaamstelling_in_nederland_dt","vervaldatum_tachograaf_dt","maximum_last_onder_de_vooras_sen_tezamen_koppeling","type_remsysteem_voertuig_code","rupsonderstelconfiguratiecode","wielbasis_voertuig_minimum","wielbasis_voertuig_maximum","lengte_voertuig_minimum","lengte_voertuig_maximum","breedte_voertuig_minimum","breedte_voertuig_maximum","hoogte_voertuig","hoogte_voertuig_minimum","hoogte_voertuig_maximum","massa_bedrijfsklaar_minimaal","massa_bedrijfsklaar_maximaal","technisch_toelaatbaar_massa_koppelpunt","maximum_massa_technisch_maximaal","maximum_massa_technisch_minimaal","subcategorie_nederland","verticale_belasting_koppelpunt_getrokken_voertuig","zuinigheidsclassificatie","registratie_datum_goedkeuring_afschrijvingsmoment_bpm","registratie_datum_goedkeuring_afschrijvingsmoment_bpm_dt","gem_lading_wrde","aerodyn_voorz","massa_alt_aandr","verl_cab_ind","api_gekentekende_voertuigen_assen","api_gekentekende_voertuigen_brandstof","api_gekentekende_voertuigen_carrosserie","api_gekentekende_voertuigen_carrosserie_specifiek","api_gekentekende_voertuigen_voertuigklasse"
"5ZDV11","Personenauto","SEAT","LEON X-PERIENCE","20240102",,"9111","stationwagen","5","GRIJS","Niet geregistreerd","4","1968","1429","2060","1529","750","2000","20150102","20150102","Geen verstrekking in Open Data","43783","Nee",,,,,,,"5","4","0","0",,"454","0","M1",,,"r. motorkap","2060","5F",,"e9*2007/46*0094*13","XCUNAX1","AD6SAD6D90037MMMLO","0","0.09","263","Ja","Nee",,"Nee","4060","0",,"2023","Logisch","00","Nee","2024-01-02T00:00:00.000",,"2015-01-02T00:00:00.000","2015-01-02T00:00:00.000",,,,,,,,,,,,,,,,,,,,,"E",,,,,,,"https://opendata.rdw.nl/resource/3huj-srit.json","https://opendata.rdw.nl/resource/8ys7-d773.json","https://opendata.rdw.nl/resource/vezc-m2t6.json","https://opendata.rdw.nl/resource/jhie-znh9.json","https://opendata.rdw.nl/resource/kmfi-hrps.json"
"G600KJ","Personenauto","SEAT","LEON X-PERIENCE","20241108",,"6083","stationwagen","5","WIT","Niet geregistreerd","4","1598","1282","1950","1382","690","1500","20181108","20191018","Geen verstrekking in Open Data","32256","Nee","193",,,,,,"5","4",,,,,"182","M1",,,,"1950","5F",,"e9*2007/46*0094*28","XDGTEX0V","FM5SFM5A40517CPVLO51BA","0","0.06","263","Ja","Nee",,"Nee","3450",,,"2023","Geen oordeel","05","Nee","2024-11-08T00:00:00.000",,"2018-11-08T00:00:00.000","2019-10-18T00:00:00.000",,,,,,,,,,,"148",,,,,,,,,,,,,,,,,"https://opendata.rdw.nl/resource/3huj-srit.json","https://opendata.rdw.nl/resource/8ys7-d773.json","https://opendata.rdw.nl/resource/vezc-m2t6.json","https://opendata.rdw.nl/resource/jhie-znh9.json","https://opendata.rdw.nl/resource/kmfi-hrps.json"
"GN388F","Personenauto","SEAT","LEON X-PERIENCE","20240719",,"5416","stationwagen","5","GRIJS","Niet geregistreerd","4","1598","1231","1890","1331","660","1500","20160719","20160719","Geen verstrekking in Open Data","33700","Nee",,,,,,,"5","4","0","0",,"0","0","M1",,,"r. motorkap","1890","5F",,"e9*2007/46*0094*16","XCXXBX0V","FM5SFM5A40517MMVLO573","0","0.06","263","Ja","Nee",,"Nee","3390","0","0.00","2024","Logisch","00","Nee","2024-07-19T00:00:00.000",,"2016-07-19T00:00:00.000","2016-07-19T00:00:00.000",,,,,,,,,,,,,,,,,,,,,"D",,,,,,,"https://opendata.rdw.nl/resource/3huj-srit.json","https://opendata.rdw.nl/resource/8ys7-d773.json","https://opendata.rdw.nl/resource/vezc-m2t6.json","https://opendata.rdw.nl/resource/jhie-znh9.json","https://opendata.rdw.nl/resource/kmfi-hrps.json"
"GT146N","Personenauto","SEAT","LEON X-PERIENCE","20240723",,"4954","stationwagen","5","GRIJS","Niet geregistreerd","4","1598","1231","1890","1331","660","1500","20151021","20151021","Geen verstrekking in Open Data","29160","Nee",,,,,,,"5","4","0","0",,"0","0","M1",,,"r. motorkap","1890","5F",,"e9*2007/46*0094*17","XCXXBX0V","FM5SFM5A40517MMVLO573","0","0.06","263","Ja","Nee",,"Nee","3390","0",,"2023","Logisch","00","Nee","2024-07-23T00:00:00.000",,"2015-10-21T00:00:00.000","2015-10-21T00:00:00.000",,,,,,,,,,,,,,,,,,,,,"B",,,,,,,"https://opendata.rdw.nl/resource/3huj-srit.json","https://opendata.rdw.nl/resource/8ys7-d773.json","https://opendata.rdw.nl/resource/vezc-m2t6.json","https://opendata.rdw.nl/resource/jhie-znh9.json","https://opendata.rdw.nl/resource/kmfi-hrps.json"
"GT147N","Personenauto","SEAT","LEON X-PERIENCE","20240914",,"4954","stationwagen","5","BRUIN","Niet geregistreerd","4","1598","1231","1890","1331","660","1500","20151130","20151130","Geen verstrekking in Open Data","31664","Nee",,,,,,,"5","4","0","0",,"0","0","M1",,,"r. motorkap","1890","5F",,"e9*2007/46*0094*16","XCXXBX0V","FM5SFM5A40517MMVLO573","0","0.06","263","Ja","Nee",,"Nee","3390","0","0.00","2023","Logisch","00","Nee","2024-09-14T00:00:00.000",,"2015-11-30T00:00:00.000","2015-11-30T00:00:00.000",,,,,,,,,,,,,,,,,,,,,"B",,,,,,,"https://opendata.rdw.nl/resource/3huj-srit.json","https://opendata.rdw.nl/resource/8ys7-d773.json","https://opendata.rdw.nl/resource/vezc-m2t6.json","https://opendata.rdw.nl/resource/jhie-znh9.json","https://opendata.rdw.nl/resource/kmfi-hrps.json"
"GT183N","Personenauto","SEAT","LEON X-PERIENCE","20230831",,"4954","stationwagen","5","GRIJS","Niet geregistreerd","4","1598","1231","1890","1331","660","1500","20150831","20150831","Geen verstrekking in Open Data","31098","Nee",,,,,,,"5","4","0","0",,"0","0","M1",,,"r. motorkap","1890","5F",,"e9*2007/46*0094*17","XCXXBX0V","FM5SFM5A40517MMVLO573","0","0.06","263","Ja","Nee",,"Nee","3390","0",,"2023","Logisch","00","Nee","2023-08-31T00:00:00.000",,"2015-08-31T00:00:00.000","2015-08-31T00:00:00.000",,,,,,,,,,,,,,,,,,,,,"B",,,,,,,"https://opendata.rdw.nl/resource/3huj-srit.json","https://opendata.rdw.nl/resource/8ys7-d773.json","https://opendata.rdw.nl/resource/vezc-m2t6.json","https://opendata.rdw.nl/resource/jhie-znh9.json","https://opendata.rdw.nl/resource/kmfi-hrps.json"
"GT187N","Personenauto","SEAT","LEON X-PERIENCE","20230301",,"4954","stationwagen","5","GRIJS","Niet geregistreerd","4","1598","1231","1890","1331","660","1500","20150819","20150819","Geen verstrekking in Open Data","31698","Nee",,,,,,,"5","4","0","0",,"0","0","M1",,,"r. motorkap","1890","5F",,"e9*2007/46*0094*17","XCXXBX0V","FM5SFM5A40517MMVLO573","0","0.06","263","Ja","Nee",,"Nee","3390","0",,"2022","Onlogisch","04","Nee","2023-03-01T00:00:00.000",,"2015-08-19T00:00:00.000","2015-08-19T00:00:00.000",,,,,,,,,,,,,,,,,,,,,"B",,,,,,,"https://opendata.rdw.nl/resource/3huj-srit.json","https://opendata.rdw.nl/resource/8ys7-d773.json","https://opendata.rdw.nl/resource/vezc-m2t6.json","https://opendata.rdw.nl/resource/jhie-znh9.json","https://opendata.rdw.nl/resource/kmfi-hrps.json"
"GV351R","Personenauto","SEAT","LEON X-PERIENCE","20221210",,"4954","stationwagen","5","BRUIN","Niet geregistreerd","4","1598","1231","1890","1331","660","1500","20151203","20151203","Geen verstrekking in Open Data","31098","Nee",,,,,,,"5","4","0","0",,"0","0","M1",,,"r. motorkap","1890","5F",,"e9*2007/46*0094*17","XCXXBX0V","FM5SFM5A40517MMVLO573","0","0.06","263","Ja","Nee",,"Nee","3390","0",,"2022","Logisch","00","Nee","2022-12-10T00:00:00.000",,"2015-12-03T00:00:00.000","2015-12-03T00:00:00.000",,,,,,,,,,,,,,,,,,,,,"B",,,,,,,"https://opendata.rdw.nl/resource/3huj-srit.json","https://opendata.rdw.nl/resource/8ys7-d773.json","https://opendata.rdw.nl/resource/vezc-m2t6.json","https://opendata.rdw.nl/resource/jhie-znh9.json","https://opendata.rdw.nl/resource/kmfi-hrps.json"
"HG379X","Personenauto","SEAT","LEON X-PERIENCE","20230902",,"4954","stationwagen","5","ZWART","Niet geregistreerd","4","1598","1231","1890","1331","660","1500","20151201","20151201","Geen verstrekking in Open Data","33239","Nee",,,,,,,"5","4","0","0",,"454","182","M1",,,"in motorruimte r.","1890","5F",,"e9*2007/46*0094*16","XCXXBX0V","FM5SFM5A40517MMVLO573","0","0.06","263","Ja","Nee",,"Nee","3390","0","0.00","2022","Logisch","00","Nee","2023-09-02T00:00:00.000",,"2015-12-01T00:00:00.000","2015-12-01T00:00:00.000",,,,,,,,,,,"148",,,,,,,,,,"B",,,,,,,"https://opendata.rdw.nl/resource/3huj-srit.json","https://opendata.rdw.nl/resource/8ys7-d773.json","https://opendata.rdw.nl/resource/vezc-m2t6.json","https://opendata.rdw.nl/resource/jhie-znh9.json","https://opendata.rdw.nl/resource/kmfi-hrps.json"
"N656SX","Personenauto","SEAT","LEON X-PERIENCE","20231220",,"1155","stationwagen","5","GRIJS","Niet geregistreerd","4","1968","1429","2050","1529","750","2000","20161228","20211223","Geen verstrekking in Open Data","41714","Nee","224",,,,,,"5","4",,,,,"182","M1",,,,"2050","5F",,"e9*2007/46*0094*23","XCUNAX1V","AD6SAD6D90037MMMLM573","1","0.09","263","Ja","Nee",,"Nee","4050",,,"2023","Geen oordeel","05","Nee","2023-12-20T00:00:00.000",,"2016-12-28T00:00:00.000","2021-12-23T00:00:00.000",,,,,,,,,,,"148",,,,,,,,,,,"20211214","2021-12-14T00:00:00.000",,,,,"https://opendata.rdw.nl/resource/3huj-srit.json","https://opendata.rdw.nl/resource/8ys7-d773.json","https://opendata.rdw.nl/resource/vezc-m2t6.json","https://opendata.rdw.nl/resource/jhie-znh9.json","https://opendata.rdw.nl/resource/kmfi-hrps.json"
"RB395L","Personenauto","SEAT","LEON X-PERIENCE","20231026",,"7050","stationwagen","5","ZWART","Niet geregistreerd","4","1598","1231","1890","1331","660","1500","20171025","20171025","Geen verstrekking in Open Data","37410","Ja",,,,,,,"5","4","0","0",,"455","182","M1",,,"in motorruimte r.","1890","5F",,"e9*2007/46*0094*24","XDDYAX0V","FM5SFM5A40517MMVLO573","0","0.06","263","Ja","Nee",,"Nee","3390","0","0.00","2022","Logisch","00","Nee","2023-10-26T00:00:00.000",,"2017-10-25T00:00:00.000","2017-10-25T00:00:00.000",,,,,,,,,,,"148",,,,,,,,,,"D",,,,,,,"https://opendata.rdw.nl/resource/3huj-srit.json","https://opendata.rdw.nl/resource/8ys7-d773.json","https://opendata.rdw.nl/resource/vezc-m2t6.json","https://opendata.rdw.nl/resource/jhie-znh9.json","https://opendata.rdw.nl/resource/kmfi-hrps.json"
"RJ045H","Personenauto","SEAT","LEON X-PERIENCE","20230907",,"3054","stationwagen","5","ZWART","Niet geregistreerd","4","1968","1429","2080","1529","750","2000","20150907","20171128","Geen verstrekking in Open Data","45656","Nee",,,,,,,"5","4","0","0",,"0","0","M1",,,"r. motorkap","2080","5F",,"e9*2007/46*0094*15","XCUNAX1V","AD6SAD6D90037MMMLM573","0","0.09","263","Ja","Nee",,"Nee","4080","0","0.00","2022","Geen oordeel","05","Nee","2023-09-07T00:00:00.000",,"2015-09-07T00:00:00.000","2017-11-28T00:00:00.000",,,,,,,,,,,,,,,,,,,,,"E",,,,,,,"https://opendata.rdw.nl/resource/3huj-srit.json","https://opendata.rdw.nl/resource/8ys7-d773.json","https://opendata.rdw.nl/resource/vezc-m2t6.json","https://opendata.rdw.nl/resource/jhie-znh9.json","https://opendata.rdw.nl/resource/kmfi-hrps.json"
"SL451X","Personenauto","SEAT","LEON X-PERIENCE","20240804",,"10303","stationwagen","5","BLAUW","Niet geregistreerd","4","1798","1386","2000","1486","740","1500","20180517","20180517","Geen verstrekking in Open Data","46640","Nee",,,,,,,"5","4","0","0",,"455","182","M1",,,,"2000","5F",,"e9*2007/46*0094*26","XCJSBX1V","AD6SAD6D90047MMMLM573","0","0.09","263","Ja","Nee",,"Nee","3500","0","0.00","2023","Logisch","00","Nee","2024-08-04T00:00:00.000",,"2018-05-17T00:00:00.000","2018-05-17T00:00:00.000",,,,,,,,,,,"148",,,,,,,,,,"E",,,,,,,"https://opendata.rdw.nl/resource/3huj-srit.json","https://opendata.rdw.nl/resource/8ys7-d773.json","https://opendata.rdw.nl/resource/vezc-m2t6.json","https://opendata.rdw.nl/resource/jhie-znh9.json","https://opendata.rdw.nl/resource/kmfi-hrps.json"
"XV302S","Personenauto","SEAT","LEON X-PERIENCE","20221216",,"4298","stationwagen","5","WIT","Niet geregistreerd","4","1598","1372","2030","1472","730","1700","20151204","20191216","Geen verstrekking in Open Data","38340","Nee",,,,,,,"5","4",,,,,,"M1",,,,"2030","5F",,"e9*2007/46*0094*17","XCXXBX1V","AM6SAM62Q0327MMMLO573","0","0.06","263","Ja","Nee",,"Nee","3730",,,"2022","Geen oordeel","05","Nee","2022-12-16T00:00:00.000",,"2015-12-04T00:00:00.000","2019-12-16T00:00:00.000",,,,,,,,,,,,,,,,,,,,,"D",,,,,,,"https://opendata.rdw.nl/resource/3huj-srit.json","https://opendata.rdw.nl/resource/8ys7-d773.json","https://opendata.rdw.nl/resource/vezc-m2t6.json","https://opendata.rdw.nl/resource/jhie-znh9.json","https://opendata.rdw.nl/resource/kmfi-hrps.json"
"ZH835T","Personenauto","SEAT","LEON X-PERIENCE","20240202",,"3392","stationwagen","5","WIT","Niet geregistreerd","4","1395","1163","1820","1263","630","1400","20160202","20190530","Geen verstrekking in Open Data","31365","Nee",,,,,,,"5","4",,,,,,"M1",,,,"1820","5F",,"e9*2007/46*0094*18","XCZCAX0V","FM6SFM6AJ0097MMVLO573","0","0.07","263","Ja","Nee",,"Nee","3220",,,"2022","Geen oordeel","05","Nee","2024-02-02T00:00:00.000",,"2016-02-02T00:00:00.000","2019-05-30T00:00:00.000",,,,,,,,,,,,,,,,,,,,,"B",,,,,,,"https://opendata.rdw.nl/resource/3huj-srit.json","https://opendata.rdw.nl/resource/8ys7-d773.json","https://opendata.rdw.nl/resource/vezc-m2t6.json","https://opendata.rdw.nl/resource/jhie-znh9.json","https://opendata.rdw.nl/resource/kmfi-hrps.json"
