"kenteken","voertuigsoort","merk","handelsbenaming","vervaldatum_apk","datum_tenaamstelling","bruto_bpm","inrichting","aantal_zitplaatsen","eerste_kleur","tweede_kleur","aantal_cilinders","cilinderinhoud","massa_ledig_voertuig","toegestane_maximum_massa_voertuig","massa_rijklaar","maximum_massa_trekken_ongeremd","maximum_trekken_massa_geremd","datum_eerste_toelating","datum_eerste_tenaamstelling_in_nederland","wacht_op_keuren","catalogusprijs","wam_verzekerd","maximale_constructiesnelheid","laadvermogen","oplegger_geremd","aanhangwagen_autonoom_geremd","aanhangwagen_middenas_geremd","aantal_staanplaatsen","aantal_deuren","aantal_wielen","afstand_hart_koppeling_tot_achterzijde_voertuig","afstand_voorzijde_voertuig_tot_hart_koppeling","afwijkende_maximum_snelheid","lengte","breedte","europese_voertuigcategorie","europese_voertuigcategorie_toevoeging","europese_uitvoeringcategorie_toevoeging","plaats_chassisnummer","technische_max_massa_voertuig","type","type_gasinstallatie","typegoedkeuringsnummer","variant","uitvoering","volgnummer_wijziging_eu_typegoedkeuring","vermogen_massarijklaar","wielbasis","export_indicator","openstaande_terugroepactie_indicator","vervaldatum_tachograaf","taxi_indicator","maximum_massa_samenstelling","aantal_rolstoelplaatsen","maximum_ondersteunende_snelheid","jaar_laatste_registratie_tellerstand","tellerstandoordeel","code_toelichting_tellerstandoordeel","tenaamstellen_mogelijk","vervaldatum_apk_dt","datum_tenaamstelling_dt","datum_eerste_toelating_dt","datum_eerste_tenaamstelling_in_nederland_dt","vervaldatum_tachograaf_dt","maximum_last_onder_de_vooras_sen_tezamen_koppeling","type_remsysteem_voertuig_code","rupsonderstelconfiguratiecode","wielbasis_voertuig_minimum","wielbasis_voertuig_maximum","lengte_voertuig_minimum","lengte_voertuig_maximum","breedte_voertuig_minimum","breedte_voertuig_maximum","hoogte_voertuig","hoogte_voertuig_minimum","hoogte_voertuig_maximum","massa_bedrijfsklaar_minimaal","massa_bedrijfsklaar_maximaal","technisch_toelaatbaar_massa_koppelpunt","maximum_massa_technisch_maximaal","maximum_massa_technisch_minimaal","subcategorie_nederland","verticale_belasting_koppelpunt_getrokken_voertuig","zuinigheidsclassificatie","registratie_datum_goedkeuring_afschrijvingsmoment_bpm","registratie_datum_goedkeuring_afschrijvingsmoment_bpm_dt","gem_lading_wrde","aerodyn_voorz","massa_alt_aandr","verl_cab_ind","api_gekentekende_voertuigen_assen","api_gekentekende_voertuigen_brandstof","api_gekentekende_voertuigen_carrosserie","api_gekentekende_voertuigen_carrosserie_specifiek","api_gekentekende_voertuigen_voertuigklasse"
"00GFN4","Personenauto","RENAULT","LAGUNA","20231230",,"8330","stationwagen","5","ZWART","Niet geregistreerd","4","1997","1365","1940","1465","650","1300","20080610","20080610","Geen verstrekking in Open Data",,"Nee",,,,,,,"4","4","0","0",,"480","0","M1",,,"r. tegen schutbord onder motorkap","1940","T",,"e2*2001/116*0363*07","KT1F","KT1F06","0","0.07","276","Ja","Nee",,"Nee","3240","0",,"2023","Logisch","00","Nee","2023-12-30T00:00:00.000",,"2008-06-10T00:00:00.000","2008-06-10T00:00:00.000",,,,,,,,,,,,,,,,,,,,,"C",,,,,,,"https://opendata.rdw.nl/resource/3huj-srit.json","https://opendata.rdw.nl/resource/8ys7-d773.json","https://opendata.rdw.nl/resource/vezc-m2t6.json","https://opendata.rdw.nl/resource/jhie-znh9.json","https://opendata.rdw.nl/resource/kmfi-hrps.json"
"00GSP4","Personenauto","RENAULT","LAGUNA","20230325",,"8656","stationwagen","5","GRIJS","Niet geregistreerd","4","1998","1463","2038","1563","650","1300","20080829","20080829","Geen verstrekking in Open Data",,"Nee",,,,,,,"4","4","0","0",,"480","0","M1",,,"r. tegen schutbord onder motorkap","2038","T",,"e2*2001/116*0363*08","KT1H","KT1H0E","0","0.08","276","Ja","Nee",,"Nee","3338","0",,"2022","Logisch","00","Nee","2023-03-25T00:00:00.000",,"2008-08-29T00:00:00.000","2008-08-29T00:00:00.000",,,,,,,,,,,,,,,,,,,,,"D",,,,,,,"https://opendata.rdw.nl/resource/3huj-srit.json","https://opendata.rdw.nl/resource/8ys7-d773.json","https://opendata.rdw.nl/resource/vezc-m2t6.json","https://opendata.rdw.nl/resource/jhie-znh9.json","https://opendata.rdw.nl/resource/kmfi-hrps.json"
"00JHV2","Personenauto","RENAULT","LAGUNA",,,"7868","stationwagen","5","GRIJS","Niet geregistreerd","4","1995","1476","2051","1576","650","1500","20090606","20090606","Geen verstrekking in Open Data",,"Nee",,,,,,,"4","4","0","0",,"480","0","M1",,,"r. tegen schutbord onder motorkap","2051","T",,"e2*2001/116*0363*09","KT2A","KT2A06","0","0.06","276","Ja","Nee",,"Nee","3551","0","0.00","2023","Logisch","00","Nee",,,"2009-06-06T00:00:00.000","2009-06-06T00:00:00.000",,,,,,,,,,,,,,,,,,,,,"C",,,,,,,"https://opendata.rdw.nl/resource/3huj-srit.json","https://opendata.rdw.nl/resource/8ys7-d773.json","https://opendata.rdw.nl/resource/vezc-m2t6.json","https://opendata.rdw.nl/resource/jhie-znh9.json","https://opendata.rdw.nl/resource/kmfi-hrps.json"
"00JNT1","Personenauto","RENAULT","MEGANE","20240324",,"4928","stationwagen","5","ZWART","Niet geregistreerd","4","1397","1260","1790","1360","680","1300","20090714","20090714","Geen verstrekking in Open Data",,"Nee",,,,,,,"4","4","0","0",,"456","0","M1",,,"r. deurstyl","1790","Z",,"e2*2001/116*0373*06","KZ0F","KZ0F06","0","0.07","270","Ja","Nee",,"Nee","3090","0",,"2024","Logisch","00","Nee","2024-03-24T00:00:00.000",,"2009-07-14T00:00:00.000","2009-07-14T00:00:00.000",,,,,,,,,,,,,,,,,,,,,"B",,,,,,,"https://opendata.rdw.nl/resource/3huj-srit.json","https://opendata.rdw.nl/resource/8ys7-d773.json","https://opendata.rdw.nl/resource/vezc-m2t6.json","https://opendata.rdw.nl/resource/jhie-znh9.json","https://opendata.rdw.nl/resource/kmfi-hrps.json"
"00KGG1","Personenauto","RENAULT","MEGANE","20230826",,"5366","stationwagen","5","ZWART","Niet geregistreerd","4","1461","1282","1812","1382","690","1300","20091106","20091106","Geen verstrekking in Open Data",,"Nee",,,,,,,"4","4","0","0",,"456","0","M1",,,"r. deurstyl","1812","Z",,"e2*2001/116*0373*06","KZ0C","KZ0C05","0","0.05","270","Ja","Nee",,"Nee","3112","0","0.00","2022","Logisch","00","Nee","2023-08-26T00:00:00.000",,"2009-11-06T00:00:00.000","2009-11-06T00:00:00.000",,,,,,,,,,,,,,,,,,,,,"A",,,,,,,"https://opendata.rdw.nl/resource/3huj-srit.json","https://opendata.rdw.nl/resource/8ys7-d773.json","https://opendata.rdw.nl/resource/vezc-m2t6.json","https://opendata.rdw.nl/resource/jhie-znh9.json","https://opendata.rdw.nl/resource/kmfi-hrps.json"
"00KND3","Personenauto","RENAULT","MEGANE","20240707",,"5494","stationwagen","5","GROEN","Niet geregistreerd","4","1461","1225","1812","1325","662","1300","20100123","20100123","Geen verstrekking in Open Data","26780","Nee",,,,,,,"4","4","0","0",,"456","0","M1",,,"r. deurstyl","1812","Z",,"e2*2001/116*0373*10","KZ1A","KZ1A05","0","0.05","270","Ja","Nee",,"Nee","3112","0",,"2023","Niet geregistreerd","NG","Nee","2024-07-07T00:00:00.000",,"2010-01-23T00:00:00.000","2010-01-23T00:00:00.000",,,,,,,,,,,,,,,,,,,,,"A",,,,,,,"https://opendata.rdw.nl/resource/3huj-srit.json","https://opendata.rdw.nl/resource/8ys7-d773.json","https://opendata.rdw.nl/resource/vezc-m2t6.json","https://opendata.rdw.nl/resource/jhie-znh9.json","https://opendata.rdw.nl/resource/kmfi-hrps.json"
"00KNK6","Personenauto","RENAULT","MEGANE","20241103",,"5017","stationwagen","5","BLAUW","Niet geregistreerd","4","1461","1225","1812","1325","662","1300","20100112","20100112","Geen verstrekking in Open Data","24884","Nee",,,,,,,"4","4","0","0",,"456","0","M1",,,"r. deurstyl","1812","Z",,"e2*2001/116*0373*10","KZ1A","KZ1A05","0","0.05","270","Ja","Nee",,"Nee","3112","0",,"2023","Logisch","00","Nee","2024-11-03T00:00:00.000",,"2010-01-12T00:00:00.000","2010-01-12T00:00:00.000",,,,,,,,,,,,,,,,,,,,,"A",,,,,,,"https://opendata.rdw.nl/resource/3huj-srit.json","https://opendata.rdw.nl/resource/8ys7-d773.json","https://opendata.rdw.nl/resource/vezc-m2t6.json","https://opendata.rdw.nl/resource/jhie-znh9.json","https://opendata.rdw.nl/resource/kmfi-hrps.json"
"00KVJ7","Personenauto","RENAULT","MEGANE","20221020",,"4882","stationwagen","5","ZWART","Niet geregistreerd","4","1598","1250","1780","1350","675","1300","20100218","20100218","Geen verstrekking in Open Data","24080","Nee",,,,,,,"4","4","0","0",,"456","0","M1",,,"r. deurstyl","1780","Z",,"e2*2001/116*0373*11","KZ0V","KZ0V06","0","0.06","270","Ja","Nee",,"Nee","3080","0",,"2022","Logisch","00","Nee","2022-10-20T00:00:00.000",,"2010-02-18T00:00:00.000","2010-02-18T00:00:00.000",,,,,,,,,,,,,,,,,,,,,"C",,,,,,,"https://opendata.rdw.nl/resource/3huj-srit.json","https://opendata.rdw.nl/resource/8ys7-d773.json","https://opendata.rdw.nl/resource/vezc-m2t6.json","https://opendata.rdw.nl/resource/jhie-znh9.json","https://opendata.rdw.nl/resource/kmfi-hrps.json"
"00KVT1","Personenauto","RENAULT","LAGUNA","20230220",,"10890","stationwagen","5","ZWART","Niet geregistreerd","4","1998","1463","2038","1563","650","1300","20100305","20100305","Geen verstrekking in Open Data","37110","Nee",,,,,,,"4","4","0","0",,"480","0","M1",,,"r. tegen schutbord onder motorkap","2038","T",,"e2*2001/116*0363*15","KT1H","KT1H0E","0","0.08","276","Ja","Nee",,"Nee","3338","0",,"2022","Logisch","00","Nee","2023-02-20T00:00:00.000",,"2010-03-05T00:00:00.000","2010-03-05T00:00:00.000",,,,,,,,,,,,,,,,,,,,,"E",,,,,,,"https://opendata.rdw.nl/resource/3huj-srit.json","https://opendata.rdw.nl/resource/8ys7-d773.json","https://opendata.rdw.nl/resource/vezc-m2t6.json","https://opendata.rdw.nl/resource/jhie-znh9.json","https://opendata.rdw.nl/resource/kmfi-hrps.json"
"00KXB6","Personenauto","RENAULT","MEGANE","20240325",,"4731","stationwagen","5","GRIJS","Niet geregistreerd","4","1598","1305","1780","1405","675","1300","20100302","20100302","Geen verstrekking in Open Data","23275","Nee",,,,,,,"4","4","0","0",,"456","0","M1",,,"r. deurstyl","1780","Z","G3 gasinstallatie","e2*2001/116*0373*11","KZ0V","KZ0V06","0","0.06","270","Ja","Nee",,"Nee","3080","0",,"2024","Logisch","00","Nee","2024-03-25T00:00:00.000",,"2010-03-02T00:00:00.000","2010-03-02T00:00:00.000",,"0",,,,,,,,,,,,,,,,,,,"C",,,,,,,"https://opendata.rdw.nl/resource/3huj-srit.json","https://opendata.rdw.nl/resource/8ys7-d773.json","https://opendata.rdw.nl/resource/vezc-m2t6.json","https://opendata.rdw.nl/resource/jhie-znh9.json","https://opendata.rdw.nl/resource/kmfi-hrps.json"
"00LLS7","Personenauto","RENAULT","MEGANE","20250207","20240525","4746","stationwagen","5","BLAUW","Niet geregistreerd","4","1397","1215","1790","1315","657","1300","20100528","20100528","Geen verstrekking in Open Data","24685","Ja",,,,,,,"4","4","0","0",,"456","0","M1",,,"r. deurstyl","1790","Z",,"e2*2001/116*0373*14","KZ1V","KZ1V06","0","0.07","270","Ja","Nee",,"Nee","3090","0",,"2024","Logisch","00","Nee","2025-02-07T00:00:00.000","2024-05-25T00:00:00.000","2010-05-28T00:00:00.000","2010-05-28T00:00:00.000",,,,,,,,,,,,,,,,,,,,,"B",,,,,,,"https://opendata.rdw.nl/resource/3huj-srit.json","https://opendata.rdw.nl/resource/8ys7-d773.json","https://opendata.rdw.nl/resource/vezc-m2t6.json","https://opendata.rdw.nl/resource/jhie-znh9.json","https://opendata.rdw.nl/resource/kmfi-hrps.json"
"00LXN8","Personenauto","RENAULT","MEGANE","20230215",,"4491","stationwagen","5","WIT","Niet geregistreerd","4","1598","1250","1780","1350","675","1300","20100716","20100716","Geen verstrekking in Open Data","21990","Nee",,,,,,,"4","4","0","0",,"456","0","M1",,,"r. deurstyl","1780","Z",,"e2*2001/116*0373*15","KZ0V","KZ0V06","0","0.06","270","Ja","Nee",,"Nee","3080","0",,"2022","Logisch","00","Nee","2023-02-15T00:00:00.000",,"2010-07-16T00:00:00.000","2010-07-16T00:00:00.000",,,,,,,,,,,,,,,,,,,,,"C",,,,,,,"https://opendata.rdw.nl/resource/3huj-srit.json","https://opendata.rdw.nl/resource/8ys7-d773.json","https://opendata.rdw.nl/resource/vezc-m2t6.json","https://opendata.rdw.nl/resource/jhie-znh9.json","https://opendata.rdw.nl/resource/kmfi-hrps.json"
"00PFV8","Personenauto","RENAULT","MEGANE",,,"5807","stationwagen","5","GRIJS","Niet geregistreerd","4","1461","1240","1825","1340","670","1500","20110112","20110112","Geen verstrekking in Open Data","28575","Nee",,,,,,,"4","4","0","0",,"456","0","M1",,,"r. deurstyl","1825","Z",,"e2*2001/116*0373*17","KZ1G","KZ1G06","0","0.06","270","Ja","Nee",,"Nee","3125","0",,"2022","Niet geregistreerd","NG","Nee",,,"2011-01-12T00:00:00.000","2011-01-12T00:00:00.000",,,,,,,,,,,,,,,,,,,,,"A",,,,,,,"https://opendata.rdw.nl/resource/3huj-srit.json","https://opendata.rdw.nl/resource/8ys7-d773.json","https://opendata.rdw.nl/resource/vezc-m2t6.json","https://opendata.rdw.nl/resource/jhie-znh9.json","https://opendata.rdw.nl/resource/kmfi-hrps.json"
"00PFZ7","Personenauto","RENAULT","MEGANE","20241031",,"4737","stationwagen","5","GRIJS","Niet geregistreerd","4","1397","1215","1790","1315","655","1500","20110114","20110114","Geen verstrekking in Open Data","26280","Nee",,,,,,,"4","4","0","0",,"456","0","M1",,,"r. deurstyl","1790","Z",,"e2*2001/116*0373*18","KZ1V","KZ1V06","0","0.07","270","Ja","Nee",,"Nee","3090","0","0.00","2023","Logisch","00","Nee","2024-10-31T00:00:00.000",,"2011-01-14T00:00:00.000","2011-01-14T00:00:00.000",,,,,,,,,,,,,,,,,,,,,"B",,,,,,,"https://opendata.rdw.nl/resource/3huj-srit.json","https://opendata.rdw.nl/resource/8ys7-d773.json","https://opendata.rdw.nl/resource/vezc-m2t6.json","https://opendata.rdw.nl/resource/jhie-znh9.json","https://opendata.rdw.nl/resource/kmfi-hrps.json"
"00PHR3","Personenauto","RENAULT","MEGANE","20230223",,"5808","stationwagen","5","GRIJS","Niet geregistreerd","4","1461","1240","1825","1340","670","1500","20110127","20110127","Geen verstrekking in Open Data","28585","Nee",,,,,,,"4","4","0","0",,"456","0","M1",,,"r. deurstyl","1825","Z",,"e2*2001/116*0373*18","KZ1G","KZ1G06","0","0.06","270","Ja","Nee",,"Nee","3125","0","0.00","2022","Logisch","00","Nee","2023-02-23T00:00:00.000",,"2011-01-27T00:00:00.000","2011-01-27T00:00:00.000",,,,,,,,,,,,,,,,,,,,,"A",,,,,,,"https://opendata.rdw.nl/resource/3huj-srit.json","https://opendata.rdw.nl/resource/8ys7-d773.json","https://opendata.rdw.nl/resource/vezc-m2t6.json","https://opendata.rdw.nl/resource/jhie-znh9.json","https://opendata.rdw.nl/resource/kmfi-hrps.json"
"00PLB3","Personenauto","RENAULT","LAGUNA","20230425",,"12271","stationwagen","5","GRIJS","Niet geregistreerd","4","1998","1386","2038","1486","650","1300","20110215","20110215","Geen verstrekking in Open Data","41060","Nee",,,,,,,"4","4","0","0",,"480","0","M1",,,"r. tegen schutbord onder motorkap","2038","T",,"e2*2001/116*0363*23","KTD5","KTD50E","0","0.08","276","Ja","Nee",,"Nee","3338","0","0.00","2022","Logisch","00","Nee","2023-04-25T00:00:00.000",,"2011-02-15T00:00:00.000","2011-02-15T00:00:00.000",,,,,,,,,,,,,,,,,,,,,"D",,,,,,,"https://opendata.rdw.nl/resource/3huj-srit.json","https://opendata.rdw.nl/resource/8ys7-d773.json","https://opendata.rdw.nl/resource/vezc-m2t6.json","https://opendata.rdw.nl/resource/jhie-znh9.json","https://opendata.rdw.nl/resource/kmfi-hrps.json"
"00RSK8","Personenauto","RENAULT","MEGANE","20240722","20240513","5101","stationwagen","5","GRIJS","Niet geregistreerd","4","1598","1190","1780","1290","645","1500","20111128","20111128","Geen verstrekking in Open Data","23575","Ja",,,,,,,"4","4","0","0",,"456","0","M1",,,"r. deurstyl","1780","Z",,"e2*2001/116*0373*25","KZ1U","KZ1U06","0","0.06","270","Ja","Nee",,"Nee","3080","0","0.00","2024","Logisch","00","Nee","2024-07-22T00:00:00.000","2024-05-13T00:00:00.000","2011-11-28T00:00:00.000","2011-11-28T00:00:00.000",,,,,,,,,,,,,,,,,,,,,"B",,,,,,,"https://opendata.rdw.nl/resource/3huj-srit.json","https://opendata.rdw.nl/resource/8ys7-d773.json","https://opendata.rdw.nl/resource/vezc-m2t6.json","https://opendata.rdw.nl/resource/jhie-znh9.json","https://opendata.rdw.nl/resource/kmfi-hrps.json"
"00SFJ4","Personenauto","RENAULT","MEGANE","20230403",,"5311","stationwagen","5","WIT","Niet geregistreerd","4","1461","1240","1825","1340","670","1500","20110913","20110913","Geen verstrekking in Open Data","28025","Nee",,,,,,,"4","4","0","0",,"456","0","M1",,,"r. deurstyl","1825","Z",,"e2*2001/116*0373*25","KZ5G","KZ5G06","0","0.06","270","Ja","Nee",,"Nee","3125","0","0.00","2023","Logisch","00","Nee","2023-04-03T00:00:00.000",,"2011-09-13T00:00:00.000","2011-09-13T00:00:00.000",,,,,,,,,,,,,,,,,,,,,"A",,,,,,,"https://opendata.rdw.nl/resource/3huj-srit.json","https://opendata.rdw.nl/resource/8ys7-d773.json","https://opendata.rdw.nl/resource/vezc-m2t6.json","https://opendata.rdw.nl/resource/jhie-znh9.json","https://opendata.rdw.nl/resource/kmfi-hrps.json"
"00SLK4","Personenauto","RENAULT","MEGANE","20240202",,"5265","stationwagen","5","GRIJS","Niet geregistreerd","4","1461","1240","1825","1340","670","1500","20111027","20111027","Geen verstrekking in Open Data","27695","Nee",,,,,,,"4","4","0","0",,"456","0","M1",,,"r. deurstyl","1825","Z",,"e2*2001/116*0373*26","KZ5G","KZ5G06","0","0.06","270","Ja","Nee",,"Nee","3125","0","0.00","2023","Logisch","00","Nee","2024-02-02T00:00:00.000",,"2011-10-27T00:00:00.000","2011-10-27T00:00:00.000",,,,,,,,,,,,,,,,,,,,,"A",,,,,,,"https://opendata.rdw.nl/resource/3huj-srit.json","https://opendata.rdw.nl/resource/8ys7-d773.json","https://opendata.rdw.nl/resource/vezc-m2t6.json","https://opendata.rdw.nl/resource/jhie-znh9.json","https://opendata.rdw.nl/resource/kmfi-hrps.json"
"00TXV3","Personenauto","RENAULT","MEGANE","20240315",,,"stationwagen","5","GRIJS","Niet geregistreerd","4","1461","1283","1864","1383","690","1500","20120503","20120503","Geen verstrekking in Open Data","24855","Nee",,,,,,,"4","4","0","0",,"456","0","M1",,,"r. deurstyl","1864","Z",,"e2*2001/116*0373*28","KZ14","KZ1406","0","0.06","270","Ja","Nee",,"Nee","3164","0","0.00","2023","Logisch","00","Nee","2024-03-15T00:00:00.000",,"2012-05-03T00:00:00.000","2012-05-03T00:00:00.000",,,,,,,,,,,,,,,,,,,,,"A",,,,,,,"https://opendata.rdw.nl/resource/3huj-srit.json","https://opendata.rdw.nl/resource/8ys7-d773.json","https://opendata.rdw.nl/resource/vezc-m2t6.json","https://opendata.rdw.nl/resource/jhie-znh9.json","https://opendata.rdw.nl/resource/kmfi-hrps.json"
"00TZJ5","Personenauto","RENAULT","MEGANE","20240912",,,"stationwagen","5","WIT","Niet geregistreerd","4","1461","1283","1864","1383","690","1500","20120504","20120504","Geen verstrekking in Open Data","26165","Nee",,,,,,,"4","4","0","0",,"456","0","M1",,,"r. deurstyl","1864","Z",,"e2*2001/116*0373*29","KZ14","KZ1406","0","0.06","270","Ja","Nee",,"Nee","3164","0","0.00","2024","Logisch","00","Nee","2024-09-12T00:00:00.000",,"2012-05-04T00:00:00.000","2012-05-04T00:00:00.000",,,,,,,,,,,,,,,,,,,,,"A",,,,,,,"https://opendata.rdw.nl/resource/3huj-srit.json","https://opendata.rdw.nl/resource/8ys7-d773.json","https://opendata.rdw.nl/resource/vezc-m2t6.json","https://opendata.rdw.nl/resource/jhie-znh9.json","https://opendata.rdw.nl/resource/kmfi-hrps.json"
"00TZZ6","Personenauto","RENAULT","MEGANE","20190507",,,"stationwagen","5","ZWART","Niet geregistreerd","4","1461","1283","1864","1383","690","1500","20120507","20120507","Geen verstrekking in Open Data","26660","Nee",,,,,,,"4","4","0","0",,"456","0","M1",,,"r. deurstyl","1864","Z",,"e2*2001/116*0373*29","KZ14","KZ1406","0","0.06","270","Ja","Nee",,"Nee","3164","0","0.00","2022","Logisch","00","Nee","2019-05-07T00:00:00.000",,"2012-05-07T00:00:00.000","2012-05-07T00:00:00.000",,,,,,,,,,,,,,,,,,,,,"A",,,,,,,"https://opendata.rdw.nl/resource/3huj-srit.json","https://opendata.rdw.nl/resource/8ys7-d773.json","https://opendata.rdw.nl/resource/vezc-m2t6.json","https://opendata.rdw.nl/resource/jhie-znh9.json","https://opendata.rdw.nl/resource/kmfi-hrps.json"
"00XHX7","Personenauto","RENAULT","MEGANE","20230119",,,"stationwagen","5","GRIJS","Niet geregistreerd","4","1461","1283","1864","1383","690","1500","20120618","20120618","Geen verstrekking in Open Data","25300","Nee",,,,,,,"4","4","0","0",,"456","0","M1",,,"r. deurstyl","1864","Z",,"e2*2001/116*0373*28","KZ14","KZ1406","0","0.06","270","Ja","Nee",,"Nee","3164","0","0.00","2022","Logisch","00","Nee","2023-01-19T00:00:00.000",,"2012-06-18T00:00:00.000","2012-06-18T00:00:00.000",,,,,,,,,,,,,,,,,,,,,"A",,,,,,,"https://opendata.rdw.nl/resource/3huj-srit.json","https://opendata.rdw.nl/resource/8ys7-d773.json","https://opendata.rdw.nl/resource/vezc-m2t6.json","https://opendata.rdw.nl/resource/jhie-znh9.json","https://opendata.rdw.nl/resource/kmfi-hrps.json"
"00XJF4","Personenauto","RENAULT","LAGUNA","20221210",,"6176","stationwagen","5","GRIJS","Niet geregistreerd","4","1461","1295","1957","1395","650","1500","20120615","20120615","Geen verstrekking in Open Data","34965","Nee",,,,,,,"4","4","0","0",,"480","0","M1",,,"r. tegen schutbord onder motorkap","1957","T",,"e2*2001/116*0363*30","KTER","KTERG6","0","0.06","276","Ja","Nee",,"Nee","3457","0","0.00","2022","Logisch","00","Nee","2022-12-10T00:00:00.000",,"2012-06-15T00:00:00.000","2012-06-15T00:00:00.000",,,,,,,,,,,,,,,,,,,,,"A",,,,,,,"https://opendata.rdw.nl/resource/3huj-srit.json","https://opendata.rdw.nl/resource/8ys7-d773.json","https://opendata.rdw.nl/resource/vezc-m2t6.json","https://opendata.rdw.nl/resource/jhie-znh9.json","https://opendata.rdw.nl/resource/kmfi-hrps.json"
"00XJL6","Personenauto","RENAULT","MEGANE","20230723",,,"stationwagen","5","ZWART","Niet geregistreerd","4","1461","1283","1864","1383","690","1500","20120621","20120621","Geen verstrekking in Open Data","27370","Nee",,,,,,,"4","4","0","0",,"456","0","M1",,,"r. deurstyl","1864","Z",,"e2*2001/116*0373*30","KZ14","KZ1406","0","0.06","270","Ja","Nee",,"Nee","3164","0","0.00","2022","Logisch","00","Nee","2023-07-23T00:00:00.000",,"2012-06-21T00:00:00.000","2012-06-21T00:00:00.000",,,,,,,,,,,,,,,,,,,,,"A",,,,,,,"https://opendata.rdw.nl/resource/3huj-srit.json","https://opendata.rdw.nl/resource/8ys7-d773.json","https://opendata.rdw.nl/resource/vezc-m2t6.json","https://opendata.rdw.nl/resource/jhie-znh9.json","https://opendata.rdw.nl/resource/kmfi-hrps.json"
"00XJX9","Personenauto","RENAULT","MEGANE","20241125",,,"stationwagen","5","ZWART","Niet geregistreerd","4","1461","1283","1864","1383","690","1500","20120622","20120622","Geen verstrekking in Open Data","27020","Nee",,,,,,,"4","4","0","0",,"456","0","M1",,,"r. deurstyl","1864","Z",,"e2*2001/116*0373*30","KZ14","KZ1406","0","0.06","270","Ja","Nee",,"Nee","3164","0","0.00","2023","Logisch","00","Nee","2024-11-25T00:00:00.000",,"2012-06-22T00:00:00.000","2012-06-22T00:00:00.000",,,,,,,,,,,,,,,,,,,,,"A",,,,,,,"https://opendata.rdw.nl/resource/3huj-srit.json","https://opendata.rdw.nl/resource/8ys7-d773.json","https://opendata.rdw.nl/resource/vezc-m2t6.json","https://opendata.rdw.nl/resource/jhie-znh9.json","https://opendata.rdw.nl/resource/kmfi-hrps.json"
"00XKX4","Personenauto","RENAULT","MEGANE","20220907",,,"stationwagen","5","ZWART","Niet geregistreerd","4","1461","1283","1864","1383","690","1500","20120626","20120626","Geen verstrekking in Open Data","26545","Nee",,,,,,,"4","4","0","0",,"456","0","M1",,,"r. deurstyl","1864","Z",,"e2*2001/116*0373*30","KZ14","KZ1406","0","0.06","270","Ja","Nee",,"Nee","3164","0","0.00","2022","Logisch","00","Nee","2022-09-07T00:00:00.000",,"2012-06-26T00:00:00.000","2012-06-26T00:00:00.000",,,,,,,,,,,,,,,,,,,,,"A",,,,,,,"https://opendata.rdw.nl/resource/3huj-srit.json","https://opendata.rdw.nl/resource/8ys7-d773.json","https://opendata.rdw.nl/resource/vezc-m2t6.json","https://opendata.rdw.nl/resource/jhie-znh9.json","https://opendata.rdw.nl/resource/kmfi-hrps.json"