"kenteken","voertuigsoort","merk","handelsbenaming","vervaldatum_apk","datum_tenaamstelling","bruto_bpm","inrichting","aantal_zitplaatsen","eerste_kleur","tweede_kleur","aantal_cilinders","cilinderinhoud","massa_ledig_voertuig","toegestane_maximum_massa_voertuig","massa_rijklaar","maximum_massa_trekken_ongeremd","maximum_trekken_massa_geremd","datum_eerste_toelating","datum_eerste_tenaamstelling_in_nederland","wacht_op_keuren","catalogusprijs","wam_verzekerd","maximale_constructiesnelheid","laadvermogen","oplegger_geremd","aanhangwagen_autonoom_geremd","aanhangwagen_middenas_geremd","aantal_staanplaatsen","aantal_deuren","aantal_wielen","afstand_hart_koppeling_tot_achterzijde_voertuig","afstand_voorzijde_voertuig_tot_hart_koppeling","afwijkende_maximum_snelheid","lengte","breedte","europese_voertuigcategorie","europese_voertuigcategorie_toevoeging","europese_uitvoeringcategorie_toevoeging","plaats_chassisnummer","technische_max_massa_voertuig","type","type_gasinstallatie","typegoedkeuringsnummer","variant","uitvoering","volgnummer_wijziging_eu_typegoedkeuring","vermogen_massarijklaar","wielbasis","export_indicator","openstaande_terugroepactie_indicator","vervaldatum_tachograaf","taxi_indicator","maximum_massa_samenstelling","aantal_rolstoelplaatsen","maximum_ondersteunende_snelheid","jaar_laatste_registratie_tellerstand","tellerstandoordeel","code_toelichting_tellerstandoordeel","tenaamstellen_mogelijk","vervaldatum_apk_dt","datum_tenaamstelling_dt","datum_eerste_toelating_dt","datum_eerste_tenaamstelling_in_nederland_dt","vervaldatum_tachograaf_dt","maximum_last_onder_de_vooras_sen_tezamen_koppeling","type_remsysteem_voertuig_code","rupsonderstelconfiguratiecode","wielbasis_voertuig_minimum","wielbasis_voertuig_maximum","lengte_voertuig_minimum","lengte_voertuig_maximum","breedte_voertuig_minimum","breedte_voertuig_maximum","hoogte_voertuig","hoogte_voertuig_minimum","hoogte_voertuig_maximum","massa_bedrijfsklaar_minimaal","massa_bedrijfsklaar_maximaal","technisch_toelaatbaar_massa_koppelpunt","maximum_massa_technisch_maximaal","maximum_massa_technisch_minimaal","subcategorie_nederland","verticale_belasting_koppelpunt_getrokken_voertuig","zuinigheidsclassificatie","registratie_datum_goedkeuring_afschrijvingsmoment_bpm","registratie_datum_goedkeuring_afschrijvingsmoment_bpm_dt","gem_lading_wrde","aerodyn_voorz","massa_alt_aandr","verl_cab_ind","api_gekentekende_voertuigen_assen","api_gekentekende_voertuigen_brandstof","api_gekentekende_voertuigen_carrosserie","api_gekentekende_voertuigen_carrosserie_specifiek","api_gekentekende_voertuigen_voertuigklasse"
"00JZP6","Personenauto","RENAULT","LAGUNA","20231115",,"10831","coupe","4","ZWART","Niet geregistreerd","4","1998","1403","1923","1503","650","1500","20090930","20090930","Geen verstrekking in Open Data",,"Nee",,,,,,,"2","4","0","0",,"464","0","M1",,,"r. tegen schutbord onder motorkap","1923","T",,"e2*2001/116*0363*09","DTBG","DTBG06","0","0.10","269","Ja","Nee",,"Nee","3423","0",,"2023","Logisch","00","Nee","2023-11-15T00:00:00.000",,"2009-09-30T00:00:00.000","2009-09-30T00:00:00.000",,,,,,,,,,,,,,,,,,,,,"C",,,,,,,"https://opendata.rdw.nl/resource/3huj-srit.json","https://opendata.rdw.nl/resource/8ys7-d773.json","https://opendata.rdw.nl/resource/vezc-m2t6.json","https://opendata.rdw.nl/resource/jhie-znh9.json","https://opendata.rdw.nl/resource/kmfi-hrps.json"
"00XFZ2","Personenauto","RENAULT","MEGANE","20221113",,,"coupe","5","ZWART","Niet geregistreerd","4","1461","1180","1805","1280","635","1300","20120531","20120531","Geen verstrekking in Open Data","30635","Nee",,,,,,,"2","4","0","0",,"430","0","M1",,,"r. deurstyl","1805","Z",,"e2*2001/116*0373*30","DZ14","DZ1406","0","0.06","264","Ja","Nee",,"Nee","3105","0","0.00","2022","Logisch","00","Nee","2022-11-13T00:00:00.000",,"2012-05-31T00:00:00.000","2012-05-31T00:00:00.000",,,,,,,,,,,,,,,,,,,,,"A",,,,,,,"https://opendata.rdw.nl/resource/3huj-srit.json","https://opendata.rdw.nl/resource/8ys7-d773.json","https://opendata.rdw.nl/resource/vezc-m2t6.json","https://opendata.rdw.nl/resource/jhie-znh9.json","https://opendata.rdw.nl/resource/kmfi-hrps.json"
"00XHJ5","Personenauto","RENAULT","MEGANE","20230319",,,"coupe","5","ZWART","Niet geregistreerd","4","1461","1180","1805","1280","635","1300","20120615","20120615","Geen verstrekking in Open Data","27445","Nee",,,,,,,"2","4","0","0",,"430","0","M1",,,"r. deurstyl","1805","Z",,"e2*2001/116*0373*30","DZ14","DZ1406","0","0.06","264","Ja","Nee",,"Nee","3105","0","0.00","2022","Logisch","00","Nee","2023-03-19T00:00:00.000",,"2012-06-15T00:00:00.000","2012-06-15T00:00:00.000",,,,,,,,,,,,,,,,,,,,,"A",,,,,,,"https://opendata.rdw.nl/resource/3huj-srit.json","https://opendata.rdw.nl/resource/8ys7-d773.json","https://opendata.rdw.nl/resource/vezc-m2t6.json","https://opendata.rdw.nl/resource/jhie-znh9.json","https://opendata.rdw.nl/resource/kmfi-hrps.json"
"00ZHN1","Personenauto","RENAULT","MEGANE","20240515",,"813","coupe","5","WIT","Niet geregistreerd","4","1461","1180","1805","1280","635","1300","20121117","20121117","Geen verstrekking in Open Data","27565","Nee",,,,,,,"2","4","0","0",,"430","0","M1",,,"r. deurstyl","1805","Z",,"e2*2001/116*0373*33","DZ14","DZ1406","0","0.06","264","Ja","Nee",,"Nee","3105","0","0.00","2023","Logisch","00","Nee","2024-05-15T00:00:00.000",,"2012-11-17T00:00:00.000","2012-11-17T00:00:00.000",,,,,,,,,,,,,,,,,,,,,"A",,,,,,,"https://opendata.rdw.nl/resource/3huj-srit.json","https://opendata.rdw.nl/resource/8ys7-d773.json","https://opendata.rdw.nl/resource/vezc-m2t6.json","https://opendata.rdw.nl/resource/jhie-znh9.json","https://opendata.rdw.nl/resource/kmfi-hrps.json"
"01HNZ8","Personenauto","RENAULT","AVANTIME","20250312","20240319","12061","coupe","5","GRIJS","Niet geregistreerd","4","2188","1728","2510","1828","750","2000","20030417","20090113","Geen verstrekking in Open Data",,"Ja",,,,,,,"2","4","0","0",,"464","0","M1",,,"r. tegen schutbord onder motorkap","2510",,,"e2*98/14*0247*03","DE01","DE0106","2","0.06","270","Ja","Nee",,"Nee","3940","0",,"2024","Onlogisch","04","Nee","2025-03-12T00:00:00.000","2024-03-19T00:00:00.000","2003-04-17T00:00:00.000","2009-01-13T00:00:00.000",,,,,,,,,,,,,,,,,,,,,"E",,,,,,,"https://opendata.rdw.nl/resource/3huj-srit.json","https://opendata.rdw.nl/resource/8ys7-d773.json","https://opendata.rdw.nl/resource/vezc-m2t6.json","https://opendata.rdw.nl/resource/jhie-znh9.json","https://opendata.rdw.nl/resource/kmfi-hrps.json"
"01NXD4","Personenauto","RENAULT","MEGANE","20250404","20240130","1475","coupe","5","ORANJE","Niet geregistreerd","4","1598","1180","1728","1280","640","1300","20100225","20101207","Geen verstrekking in Open Data","21478","Ja",,,,,,,"2","4","0","0",,"430","0","M1",,,"r. deurstyl","1728","Z",,"e2*2001/116*0373*09","DZ0V","DZ0V06","0","0.06","264","Ja","Nee",,"Nee","3028","0",,"2024","Niet geregistreerd","NG","Nee","2025-04-04T00:00:00.000","2024-01-30T00:00:00.000","2010-02-25T00:00:00.000","2010-12-07T00:00:00.000",,,,,,,,,,,,,,,,,,,,,"C",,,,,,,"https://opendata.rdw.nl/resource/3huj-srit.json","https://opendata.rdw.nl/resource/8ys7-d773.json","https://opendata.rdw.nl/resource/vezc-m2t6.json","https://opendata.rdw.nl/resource/jhie-znh9.json","https://opendata.rdw.nl/resource/kmfi-hrps.json"
"01XFZ2","Personenauto","RENAULT","MEGANE","20240616","20240326",,"coupe","5","BRUIN","Niet geregistreerd","4","1461","1180","1805","1280","635","1300","20120616","20120616","Geen verstrekking in Open Data","28475","Ja",,,,,,,"2","4","0","0",,"430","0","M1",,,"r. deurstyl","1805","Z",,"e2*2001/116*0373*30","DZ14","DZ1406","0","0.06","264","Ja","Nee",,"Nee","3105","0","0.00","2024","Logisch","00","Nee","2024-06-16T00:00:00.000","2024-03-26T00:00:00.000","2012-06-16T00:00:00.000","2012-06-16T00:00:00.000",,,,,,,,,,,,,,,,,,,,,"A",,,,,,,"https://opendata.rdw.nl/resource/3huj-srit.json","https://opendata.rdw.nl/resource/8ys7-d773.json","https://opendata.rdw.nl/resource/vezc-m2t6.json","https://opendata.rdw.nl/resource/jhie-znh9.json","https://opendata.rdw.nl/resource/kmfi-hrps.json"
"02HXS6","Personenauto","RENAULT","MEGANE","20231101",,"4422","coupe","5","ZWART","Niet geregistreerd","4","1598","1180","1728","1280","640","1300","20090512","20090512","Geen verstrekking in Open Data",,"Nee",,,,,,,"2","4","0","0",,"430","0","M1",,,"r. deurstyl","1728","Z",,"e2*2001/116*0373*04","DZ0V","DZ0V06","0","0.06","264","Ja","Nee",,"Nee","3028","0",,"2023","Logisch","00","Nee","2023-11-01T00:00:00.000",,"2009-05-12T00:00:00.000","2009-05-12T00:00:00.000",,,,,,,,,,,,,,,,,,,,,"C",,,,,,,"https://opendata.rdw.nl/resource/3huj-srit.json","https://opendata.rdw.nl/resource/8ys7-d773.json","https://opendata.rdw.nl/resource/vezc-m2t6.json","https://opendata.rdw.nl/resource/jhie-znh9.json","https://opendata.rdw.nl/resource/kmfi-hrps.json"
"02LLP3","Personenauto","RENAULT","MEGANE","20240522",,"5140","coupe","5","BLAUW","Niet geregistreerd","4","1598","1180","1728","1280","640","1300","20100522","20100522","Geen verstrekking in Open Data","25460","Nee",,,,,,,"2","4","0","0",,"430","0","M1",,,"r. deurstyl","1728","Z",,"e2*2001/116*0373*15","DZ0V","DZ0V06","0","0.06","264","Ja","Nee",,"Nee","3028","0",,"2023","Logisch","00","Nee","2024-05-22T00:00:00.000",,"2010-05-22T00:00:00.000","2010-05-22T00:00:00.000",,,,,,,,,,,,,,,,,,,,,"C",,,,,,,"https://opendata.rdw.nl/resource/3huj-srit.json","https://opendata.rdw.nl/resource/8ys7-d773.json","https://opendata.rdw.nl/resource/vezc-m2t6.json","https://opendata.rdw.nl/resource/jhie-znh9.json","https://opendata.rdw.nl/resource/kmfi-hrps.json"
"02PKV8","Personenauto","RENAULT","MEGANE","20240211",,"9708","coupe","5","WIT","Niet geregistreerd","4","1998","1362","1835","1462",,,"20110211","20110211","Geen verstrekking in Open Data","36360","Nee",,,,,,,"2","4","0","0",,"430","0","M1",,,"r. deurstyl","1835","Z",,"e2*2001/116*0373*20","DZ1N","DZ1N06","0","0.13","265","Ja","Nee",,"Nee","0","0",,"2023","Logisch","00","Nee","2024-02-11T00:00:00.000",,"2011-02-11T00:00:00.000","2011-02-11T00:00:00.000",,,,,,,,,,,,,,,,,,,,,"D",,,,,,,"https://opendata.rdw.nl/resource/3huj-srit.json","https://opendata.rdw.nl/resource/8ys7-d773.json","https://opendata.rdw.nl/resource/vezc-m2t6.json","https://opendata.rdw.nl/resource/jhie-znh9.json","https://opendata.rdw.nl/resource/kmfi-hrps.json"
"02ZHF8","Personenauto","RENAULT","MEGANE","20240308",,"813","coupe","5","WIT","Niet geregistreerd","4","1461","1180","1805","1280","635","1300","20121115","20121115","Geen verstrekking in Open Data","30945","Nee",,,,,,,"2","4","0","0",,"430","0","M1",,,"r. deurstyl","1805","Z",,"e2*2001/116*0373*33","DZ14","DZ1406","0","0.06","264","Ja","Nee",,"Nee","3105","0","0.00","2023","Logisch","00","Nee","2024-03-08T00:00:00.000",,"2012-11-15T00:00:00.000","2012-11-15T00:00:00.000",,,,,,,,,,,,,,,,,,,,,"A",,,,,,,"https://opendata.rdw.nl/resource/3huj-srit.json","https://opendata.rdw.nl/resource/8ys7-d773.json","https://opendata.rdw.nl/resource/vezc-m2t6.json","https://opendata.rdw.nl/resource/jhie-znh9.json","https://opendata.rdw.nl/resource/kmfi-hrps.json"
"03HPL7","Personenauto","RENAULT","MEGANE","20231121",,"7184","coupe","5","ZWART","Niet geregistreerd","4","1998","1295","1830","1395","695","1300","20090123","20090123","Geen verstrekking in Open Data",,"Nee",,,,,,,"2","4","0","0",,"430","0","M1",,,"r. deurstyl","1830","Z",,"e2*2001/116*0373*02","DZ0K","DZ0K06","0","0.09","264","Ja","Nee",,"Nee","3130","0",,"2023","Logisch","00","Nee","2023-11-21T00:00:00.000",,"2009-01-23T00:00:00.000","2009-01-23T00:00:00.000",,,,,,,,,,,,,,,,,,,,,"C",,,,,,,"https://opendata.rdw.nl/resource/3huj-srit.json","https://opendata.rdw.nl/resource/8ys7-d773.json","https://opendata.rdw.nl/resource/vezc-m2t6.json","https://opendata.rdw.nl/resource/jhie-znh9.json","https://opendata.rdw.nl/resource/kmfi-hrps.json"
"03XGV5","Personenauto","RENAULT","MEGANE","20240301",,,"coupe","5","WIT","Niet geregistreerd","4","1461","1180","1805","1280","635","1300","20120608","20120608","Geen verstrekking in Open Data","31340","Nee",,,,,,,"2","4",,,,"430",,"M1",,,"r. deurstyl","1805","Z",,,,,,"0.06","264","Ja","Nee",,"Nee","3105",,,"2023","Logisch","00","Nee","2024-03-01T00:00:00.000",,"2012-06-08T00:00:00.000","2012-06-08T00:00:00.000",,,,,,,,,,,,,,,,,,,,,"A",,,,,,,"https://opendata.rdw.nl/resource/3huj-srit.json","https://opendata.rdw.nl/resource/8ys7-d773.json","https://opendata.rdw.nl/resource/vezc-m2t6.json","https://opendata.rdw.nl/resource/jhie-znh9.json","https://opendata.rdw.nl/resource/kmfi-hrps.json"
"04JHB4","Personenauto","RENAULT","MEGANE","20240502","20240206","4466","coupe","5","ZWART","Niet geregistreerd","4","1461","1180","1756","1280","640","1300","20090610","20090610","Geen verstrekking in Open Data",,"Ja",,,,,,,"2","4","0","0",,"430","0","M1",,,"r. deurstyl","1756","Z",,"e2*2001/116*0373*06","DZ0C","DZ0C05","0","0.05","264","Ja","Nee",,"Nee","3056","0","0.00","2024","Onlogisch","04","Nee","2024-05-02T00:00:00.000","2024-02-06T00:00:00.000","2009-06-10T00:00:00.000","2009-06-10T00:00:00.000",,,,,,,,,,,,,,,,,,,,,"A",,,,,,,"https://opendata.rdw.nl/resource/3huj-srit.json","https://opendata.rdw.nl/resource/8ys7-d773.json","https://opendata.rdw.nl/resource/vezc-m2t6.json","https://opendata.rdw.nl/resource/jhie-znh9.json","https://opendata.rdw.nl/resource/kmfi-hrps.json"
"04JKZ6","Personenauto","RENAULT","MEGANE",,,"5246","coupe","5","GRIJS","Niet geregistreerd","4","1461","1180","1756","1280","640","1300","20090626","20090626","Geen verstrekking in Open Data",,"Nee",,,,,,,"2","4","0","0",,"430","0","M1",,,"r. deurstyl","1756","Z",,"e2*2001/116*0373*06","DZ0C","DZ0C05","0","0.05","264","Ja","Nee",,"Nee","3056","0","0.00","2020","Logisch","00","Nee",,,"2009-06-26T00:00:00.000","2009-06-26T00:00:00.000",,,,,,,,,,,,,,,,,,,,,"A",,,,,,,"https://opendata.rdw.nl/resource/3huj-srit.json","https://opendata.rdw.nl/resource/8ys7-d773.json","https://opendata.rdw.nl/resource/vezc-m2t6.json","https://opendata.rdw.nl/resource/jhie-znh9.json","https://opendata.rdw.nl/resource/kmfi-hrps.json"
"04JNV8","Personenauto","RENAULT","MEGANE","20230720",,"5278","coupe","5","WIT","Niet geregistreerd","4","1397","1170","1728","1270","635","1300","20090717","20090717","Geen verstrekking in Open Data",,"Nee",,,,,,,"2","4","0","0",,"430","0","M1",,,"r. deurstyl","1728","Z",,"e2*2001/116*0373*06","DZ0F","DZ0F06","0","0.08","264","Ja","Nee",,"Nee","3028","0",,"2023","Logisch","00","Nee","2023-07-20T00:00:00.000",,"2009-07-17T00:00:00.000","2009-07-17T00:00:00.000",,,,,,,,,,,,,,,,,,,,,"B",,,,,,,"https://opendata.rdw.nl/resource/3huj-srit.json","https://opendata.rdw.nl/resource/8ys7-d773.json","https://opendata.rdw.nl/resource/vezc-m2t6.json","https://opendata.rdw.nl/resource/jhie-znh9.json","https://opendata.rdw.nl/resource/kmfi-hrps.json"
"04SLS3","Personenauto","RENAULT","MEGANE","20240102",,"4589","coupe","5","ZWART","Niet geregistreerd","4","1397","1170","1728","1270","635","1300","20111028","20111028","Geen verstrekking in Open Data","25205","Nee",,,,,,,"2","4","0","0",,"430","0","M1",,,"r. deurstyl","1728","Z",,"e2*2001/116*0373*26","DZ1V","DZ1V06","0","0.08","264","Ja","Nee",,"Nee","3028","0","0.00","2024","Logisch","00","Nee","2024-01-02T00:00:00.000",,"2011-10-28T00:00:00.000","2011-10-28T00:00:00.000",,,,,,,,,,,,,,,,,,,,,"B",,,,,,,"https://opendata.rdw.nl/resource/3huj-srit.json","https://opendata.rdw.nl/resource/8ys7-d773.json","https://opendata.rdw.nl/resource/vezc-m2t6.json","https://opendata.rdw.nl/resource/jhie-znh9.json","https://opendata.rdw.nl/resource/kmfi-hrps.json"
"04SPX2","Personenauto","RENAULT","MEGANE","20240513",,"4817","coupe","5","WIT","Niet geregistreerd","4","1461","1180","1756","1280","640","1300","20111115","20111115","Geen verstrekking in Open Data","25205","Nee",,,,,,,"2","4","0","0",,"430","0","M1",,,"r. deurstyl","1756","Z",,"e2*2001/116*0373*26","DZ1A","DZ1A05","0","0.05","264","Ja","Nee",,"Nee","3056","0","0.00","2024","Logisch","00","Nee","2024-05-13T00:00:00.000",,"2011-11-15T00:00:00.000","2011-11-15T00:00:00.000",,,,,,,,,,,,,,,,,,,,,"A",,,,,,,"https://opendata.rdw.nl/resource/3huj-srit.json","https://opendata.rdw.nl/resource/8ys7-d773.json","https://opendata.rdw.nl/resource/vezc-m2t6.json","https://opendata.rdw.nl/resource/jhie-znh9.json","https://opendata.rdw.nl/resource/kmfi-hrps.json"
"04XRL2","Personenauto","RENAULT","MEGANE","20240707",,,"coupe","5","ZWART","Niet geregistreerd","4","1461","1180","1805","1280","635","1300","20120707","20120707","Geen verstrekking in Open Data","26505","Nee",,,,,,,"2","4","0","0",,"430","0","M1",,,"r. deurstyl","1805","Z",,"e2*2001/116*0373*28","DZ14","DZ1406","0","0.06","264","Ja","Nee",,"Nee","3105","0","0.00","2024","Logisch","00","Nee","2024-07-07T00:00:00.000",,"2012-07-07T00:00:00.000","2012-07-07T00:00:00.000",,,,,,,,,,,,,,,,,,,,,"A",,,,,,,"https://opendata.rdw.nl/resource/3huj-srit.json","https://opendata.rdw.nl/resource/8ys7-d773.json","https://opendata.rdw.nl/resource/vezc-m2t6.json","https://opendata.rdw.nl/resource/jhie-znh9.json","https://opendata.rdw.nl/resource/kmfi-hrps.json"
"05FNSF","Personenauto","RENAULT","MEGANE COUPE",,,"4475","coupe","4","GRIJS","Niet geregistreerd","4","1598","1035","1505","1135","565","1200","20000504","20000504","Geen verstrekking in Open Data",,"Nee",,,,,,,"2","4","0","0",,"397","0","M1",,,"op r. schroefveerkoker onder motorkap","1505",,,"e2*98/14*0009*14","DA04","DA04B5","1","0.07","246","Ja","Nee",,"Nee","2450","0",,"2020","Logisch","00","Nee",,,"2000-05-04T00:00:00.000","2000-05-04T00:00:00.000",,,,,,,,,,,,,,,,,,,,,,,,,,,,"https://opendata.rdw.nl/resource/3huj-srit.json","https://opendata.rdw.nl/resource/8ys7-d773.json","https://opendata.rdw.nl/resource/vezc-m2t6.json","https://opendata.rdw.nl/resource/jhie-znh9.json","https://opendata.rdw.nl/resource/kmfi-hrps.json"
"05JZP6","Personenauto","RENAULT","LAGUNA","20230202",,"9944","coupe","4","ZWART","Niet geregistreerd","4","1998","1455","1950","1555","650","1300","20091001","20091001","Geen verstrekking in Open Data",,"Nee",,,,,,,"2","4","0","0",,"464","0","M1",,,"r. tegen schutbord onder motorkap","1950","T",,"e2*2001/116*0363*13","DTEH","DTEH0E","0","0.08","269","Ja","Nee",,"Nee","3250","0",,"2022","Logisch","00","Nee","2023-02-02T00:00:00.000",,"2009-10-01T00:00:00.000","2009-10-01T00:00:00.000",,,,,,,,,,,,,,,,,,,,,"D",,,,,,,"https://opendata.rdw.nl/resource/3huj-srit.json","https://opendata.rdw.nl/resource/8ys7-d773.json","https://opendata.rdw.nl/resource/vezc-m2t6.json","https://opendata.rdw.nl/resource/jhie-znh9.json","https://opendata.rdw.nl/resource/kmfi-hrps.json"
"05ZHF8","Personenauto","RENAULT","MEGANE","20230429",,"11933","coupe","5","ZWART","Niet geregistreerd","4","1998","1409","1887","1509",,,"20121115","20121115","Geen verstrekking in Open Data","43355","Nee",,,,,,,"2","4","0","0",,"430","0","M1",,,"r. deurstyl","1887","Z","G3 gasinstallatie","e2*2001/116*0373*34","DZ18","DZ1802","0","0.13","265","Ja","Nee",,"Nee","0","0",,"2022","Logisch","00","Nee","2023-04-29T00:00:00.000",,"2012-11-15T00:00:00.000","2012-11-15T00:00:00.000",,"0",,,,,,,,,,,,,,,,,,,"E",,,,,,,"https://opendata.rdw.nl/resource/3huj-srit.json","https://opendata.rdw.nl/resource/8ys7-d773.json","https://opendata.rdw.nl/resource/vezc-m2t6.json","https://opendata.rdw.nl/resource/jhie-znh9.json","https://opendata.rdw.nl/resource/kmfi-hrps.json"
"06JZP6","Personenauto","RENAULT","LAGUNA","20240912","20240511","13370","coupe","4","BLAUW","Niet geregistreerd","4","1995","1514","2017","1614","650","1500","20090930","20090930","Geen verstrekking in Open Data",,"Ja",,,,,,,"2","4","0","0",,"464","0","M1",,,"r. tegen schutbord onder motorkap","2017","T",,"e2*2001/116*0363*08","DTE9","DTE90E","0","0.07","269","Ja","Nee",,"Nee","3517","0",,"2024","Logisch","00","Nee","2024-09-12T00:00:00.000","2024-05-11T00:00:00.000","2009-09-30T00:00:00.000","2009-09-30T00:00:00.000",,,,,,,,,,,,,,,,,,,,,"E",,,,,,,"https://opendata.rdw.nl/resource/3huj-srit.json","https://opendata.rdw.nl/resource/8ys7-d773.json","https://opendata.rdw.nl/resource/vezc-m2t6.json","https://opendata.rdw.nl/resource/jhie-znh9.json","https://opendata.rdw.nl/resource/kmfi-hrps.json"
"06NTL4","Personenauto","RENAULT","MEGANE","20231108",,"4879","coupe","5","ZWART","Niet geregistreerd","4","1397","1212","1728","1312","635","1300","20101120","20101120","Geen verstrekking in Open Data","26280","Nee",,,,,,,"2","4","0","0",,"430","0","M1",,,"r. deurstyl","1728","Z","G3 gasinstallatie","e2*2001/116*0373*17","DZ1V","DZ1V06","0","0.07","264","Ja","Nee",,"Nee","3028","0",,"2023","Logisch","00","Nee","2023-11-08T00:00:00.000",,"2010-11-20T00:00:00.000","2010-11-20T00:00:00.000",,"0",,,,,,,,,,,,,,,,,,,"B",,,,,,,"https://opendata.rdw.nl/resource/3huj-srit.json","https://opendata.rdw.nl/resource/8ys7-d773.json","https://opendata.rdw.nl/resource/vezc-m2t6.json","https://opendata.rdw.nl/resource/jhie-znh9.json","https://opendata.rdw.nl/resource/kmfi-hrps.json"
"07SJS4","Personenauto","RENAULT","MEGANE","20241007","20240308","4711","coupe","5","WIT","Niet geregistreerd","4","1397","1170","1728","1270","635","1300","20111007","20111007","Geen verstrekking in Open Data","26090","Ja",,,,,,,"2","4","0","0",,"430","0","M1",,,"r. deurstyl","1728","Z",,"e2*2001/116*0373*23","DZ1V","DZ1V06","0","0.08","264","Ja","Nee",,"Nee","3028","0","0.00","2024","Logisch","00","Nee","2024-10-07T00:00:00.000","2024-03-08T00:00:00.000","2011-10-07T00:00:00.000","2011-10-07T00:00:00.000",,,,,,,,,,,,,,,,,,,,,"B",,,,,,,"https://opendata.rdw.nl/resource/3huj-srit.json","https://opendata.rdw.nl/resource/8ys7-d773.json","https://opendata.rdw.nl/resource/vezc-m2t6.json","https://opendata.rdw.nl/resource/jhie-znh9.json","https://opendata.rdw.nl/resource/kmfi-hrps.json"
"08GFHZ","Personenauto","RENAULT","MEGANE COUPE","20240117",,"3887","coupe","4","ROOD","Niet geregistreerd","4","1598","1035","1505","1135","565","1200","20001012","20001012","Geen verstrekking in Open Data",,"Nee",,,,,,,"2","4","0","0",,"397","0","M1",,,"op r. schroefveerkoker onder motorkap","1505",,,"e2*98/14*0009*16","DA0B","DA0B05","1","0.07","246","Ja","Nee",,"Nee","2450","0",,"2023","Logisch","00","Nee","2024-01-17T00:00:00.000",,"2000-10-12T00:00:00.000","2000-10-12T00:00:00.000",,,,,,,,,,,,,,,,,,,,,,,,,,,,"https://opendata.rdw.nl/resource/3huj-srit.json","https://opendata.rdw.nl/resource/8ys7-d773.json","https://opendata.rdw.nl/resource/vezc-m2t6.json","https://opendata.rdw.nl/resource/jhie-znh9.json","https://opendata.rdw.nl/resource/kmfi-hrps.json"
"08JZD3","Personenauto","RENAULT","MEGANE","20240709","20210525","4499","coupe","5","ZWART","Niet geregistreerd","4","1397","1170","1728","1270","635","1300","20090926","20090926","Geen verstrekking in Open Data",,"Nee",,,,,,,"2","4","0","0",,"430","0","M1",,,"r. deurstyl","1728","Z",,"e2*2001/116*0373*08","DZ1V","DZ1V06","0","0.08","264","Ja","Nee",,"Nee","3028","0",,"2024","Logisch","00","Nee","2024-07-09T00:00:00.000","2021-05-25T00:00:00.000","2009-09-26T00:00:00.000","2009-09-26T00:00:00.000",,,,,,,,,,,,,,,,,,,,,"B",,,,,,,"https://opendata.rdw.nl/resource/3huj-srit.json","https://opendata.rdw.nl/resource/8ys7-d773.json","https://opendata.rdw.nl/resource/vezc-m2t6.json","https://opendata.rdw.nl/resource/jhie-znh9.json","https://opendata.rdw.nl/resource/kmfi-hrps.json"
"08RRB7","Personenauto","RENAULT","MEGANE","20240310",,"6817","coupe","5","BLAUW","Niet geregistreerd","4","1998","1295","1830","1395","695","1300","20110708","20110708","Geen verstrekking in Open Data","28775","Nee",,,,,,,"2","4","0","0",,"430","0","M1",,,"r. deurstyl","1830","Z",,"e2*2001/116*0373*25","DZ1T","DZ1T06","0","0.09","264","Ja","Nee",,"Nee","3130","0","0.00","2023","Logisch","00","Nee","2024-03-10T00:00:00.000",,"2011-07-08T00:00:00.000","2011-07-08T00:00:00.000",,,,,,,,,,,,,,,,,,,,,"D",,,,,,,"https://opendata.rdw.nl/resource/3huj-srit.json","https://opendata.rdw.nl/resource/8ys7-d773.json","https://opendata.rdw.nl/resource/vezc-m2t6.json","https://opendata.rdw.nl/resource/jhie-znh9.json","https://opendata.rdw.nl/resource/kmfi-hrps.json"