"kenteken","voertuigsoort","merk","handelsbenaming","vervaldatum_apk","datum_tenaamstelling","bruto_bpm","inrichting","aantal_zitplaatsen","eerste_kleur","tweede_kleur","aantal_cilinders","cilinderinhoud","massa_ledig_voertuig","toegestane_maximum_massa_voertuig","massa_rijklaar","maximum_massa_trekken_ongeremd","maximum_trekken_massa_geremd","datum_eerste_toelating","datum_eerste_tenaamstelling_in_nederland","wacht_op_keuren","catalogusprijs","wam_verzekerd","maximale_constructiesnelheid","laadvermogen","oplegger_geremd","aanhangwagen_autonoom_geremd","aanhangwagen_middenas_geremd","aantal_staanplaatsen","aantal_deuren","aantal_wielen","afstand_hart_koppeling_tot_achterzijde_voertuig","afstand_voorzijde_voertuig_tot_hart_koppeling","afwijkende_maximum_snelheid","lengte","breedte","europese_voertuigcategorie","europese_voertuigcategorie_toevoeging","europese_uitvoeringcategorie_toevoeging","plaats_chassisnummer","technische_max_massa_voertuig","type","type_gasinstallatie","typegoedkeuringsnummer","variant","uitvoering","volgnummer_wijziging_eu_typegoedkeuring","vermogen_massarijklaar","wielbasis","export_indicator","openstaande_terugroepactie_indicator","vervaldatum_tachograaf","taxi_indicator","maximum_massa_samenstelling","aantal_rolstoelplaatsen","maximum_ondersteunende_snelheid","jaar_laatste_registratie_tellerstand","tellerstandoordeel","code_toelichting_tellerstandoordeel","tenaamstellen_mogelijk","vervaldatum_apk_dt","datum_tenaamstelling_dt","datum_eerste_toelating_dt","datum_eerste_tenaamstelling_in_nederland_dt","vervaldatum_tachograaf_dt","maximum_last_onder_de_vooras_sen_tezamen_koppeling","type_remsysteem_voertuig_code","rupsonderstelconfiguratiecode","wielbasis_voertuig_minimum","wielbasis_voertuig_maximum","lengte_voertuig_minimum","lengte_voertuig_maximum","breedte_voertuig_minimum","breedte_voertuig_maximum","hoogte_voertuig","hoogte_voertuig_minimum","hoogte_voertuig_maximum","massa_bedrijfsklaar_minimaal","massa_bedrijfsklaar_maximaal","technisch_toelaatbaar_massa_koppelpunt","maximum_massa_technisch_maximaal","maximum_massa_technisch_minimaal","subcategorie_nederland","verticale_belasting_koppelpunt_getrokken_voertuig","zuinigheidsclassificatie","registratie_datum_goedkeuring_afschrijvingsmoment_bpm","registratie_datum_goedkeuring_afschrijvingsmoment_bpm_dt","gem_lading_wrde","aerodyn_voorz","massa_alt_aandr","verl_cab_ind","api_gekentekende_voertuigen_assen","api_gekentekende_voertuigen_brandstof","api_gekentekende_voertuigen_carrosserie","api_gekentekende_voertuigen_carrosserie_specifiek","api_gekentekende_voertuigen_voertuigklasse"
"G156KD","Personenauto","RENAULT","SCENIC HYBRID ASSIST","20231221",,"3536","hatchback","7","GRIJS","Niet geregistreerd","4","1461","1515","2301","1615","750","1850","20171220","20191008","Geen verstrekking in Open Data","36877","Nee","184",,,,,,"5","4","0","0",,"464","187","M1",,,,"2301","RFA",,"e2*2007/46*0574*02","RS2","AE6RVA017000","0","0.00","280","Ja","Nee",,"Nee","3801","0","0.00","2023","Geen oordeel","05","Nee","2023-12-21T00:00:00.000",,"2017-12-20T00:00:00.000","2019-10-08T00:00:00.000",,,,,,,,,,,"165",,,,,,,,,,"B",,,,,,,"https://opendata.rdw.nl/resource/3huj-srit.json","https://opendata.rdw.nl/resource/8ys7-d773.json","https://opendata.rdw.nl/resource/vezc-m2t6.json","https://opendata.rdw.nl/resource/jhie-znh9.json","https://opendata.rdw.nl/resource/kmfi-hrps.json"
"PL734X","Personenauto","RENAULT","SCENIC HYBRID ASSIST","20230912",,"4207","hatchback","5","BLAUW","Niet geregistreerd","4","1461","1513","2240","1613","750","1850","20170823","20170823","Geen verstrekking in Open Data","33910","Nee",,,,,,,"5","4","0","0",,"464","187","M1",,,"op r. deurstyl","2240","RFA",,"e2*2007/46*0574*02","RS2","AE6RVA015000","0","0.05","280","Ja","Nee",,"Nee","3740","0","0.00","2022","Logisch","00","Nee","2023-09-12T00:00:00.000",,"2017-08-23T00:00:00.000","2017-08-23T00:00:00.000",,,,,,,,,,,"165",,,,,,,,,,"B",,,,,,,"https://opendata.rdw.nl/resource/3huj-srit.json","https://opendata.rdw.nl/resource/8ys7-d773.json","https://opendata.rdw.nl/resource/vezc-m2t6.json","https://opendata.rdw.nl/resource/jhie-znh9.json","https://opendata.rdw.nl/resource/kmfi-hrps.json"
"PP171K","Personenauto","RENAULT","SCENIC HYBRID ASSIST","20240122",,"4207","hatchback","5","WIT","Niet geregistreerd","4","1461","1513","2240","1613","750","1850","20170817","20170817","Geen verstrekking in Open Data","33810","Nee",,,,,,,"5","4","0","0",,"464","187","M1",,,"op r. deurstyl","2240","RFA",,"e2*2007/46*0574*02","RS2","AE6RVA015000","0","0.05","280","Ja","Nee",,"Nee","3740","0","0.00","2023","Logisch","00","Nee","2024-01-22T00:00:00.000",,"2017-08-17T00:00:00.000","2017-08-17T00:00:00.000",,,,,,,,,,,"165",,,,,,,,,,"B",,,,,,,"https://opendata.rdw.nl/resource/3huj-srit.json","https://opendata.rdw.nl/resource/8ys7-d773.json","https://opendata.rdw.nl/resource/vezc-m2t6.json","https://opendata.rdw.nl/resource/jhie-znh9.json","https://opendata.rdw.nl/resource/kmfi-hrps.json"
"PP319V","Personenauto","RENAULT","SCENIC HYBRID ASSIST","20230912",,"4207","hatchback","5","WIT","Niet geregistreerd","4","1461","1483","2116","1583","750","1850","20170824","20170824","Geen verstrekking in Open Data","32410","Nee",,,,,,,"5","4","0","0",,"441","0","M1",,,"op r. deurstyl","2116","RFA",,"e2*2007/46*0574*02","JS2","AE6RVA015000","0","0.05","273","Ja","Nee",,"Nee","3616","0","0.00","2022","Logisch","00","Nee","2023-09-12T00:00:00.000",,"2017-08-24T00:00:00.000","2017-08-24T00:00:00.000",,,,,,,,,,,,,,,,,,,,,"B",,,,,,,"https://opendata.rdw.nl/resource/3huj-srit.json","https://opendata.rdw.nl/resource/8ys7-d773.json","https://opendata.rdw.nl/resource/vezc-m2t6.json","https://opendata.rdw.nl/resource/jhie-znh9.json","https://opendata.rdw.nl/resource/kmfi-hrps.json"
"PS479P","Personenauto","RENAULT","SCENIC HYBRID ASSIST","20230908",,"4207","hatchback","5","BLAUW","Niet geregistreerd","4","1461","1513","2240","1613","750","1850","20170908","20170908","Geen verstrekking in Open Data","38305","Nee",,,,,,,"5","4","0","0",,"464","187","M1",,,"op r. deurstyl","2240","RFA",,"e2*2007/46*0574*02","RS2","AE6RVA015000","0","0.05","280","Ja","Nee",,"Nee","3740","0","0.00","2022","Logisch","00","Nee","2023-09-08T00:00:00.000",,"2017-09-08T00:00:00.000","2017-09-08T00:00:00.000",,,,,,,,,,,"165",,,,,,,,,,"B",,,,,,,"https://opendata.rdw.nl/resource/3huj-srit.json","https://opendata.rdw.nl/resource/8ys7-d773.json","https://opendata.rdw.nl/resource/vezc-m2t6.json","https://opendata.rdw.nl/resource/jhie-znh9.json","https://opendata.rdw.nl/resource/kmfi-hrps.json"
"PT524N","Personenauto","RENAULT","SCENIC HYBRID ASSIST","20230702",,"4207","hatchback","5","BRUIN","Niet geregistreerd","4","1461","1513","2240","1613","750","1850","20170921","20170921","Geen verstrekking in Open Data","39350","Nee",,,,,,,"5","4","0","0",,"464","187","M1",,,"op r. deurstyl","2240","RFA",,"e2*2007/46*0574*02","RS2","AE6RVA015000","0","0.05","280","Ja","Nee",,"Nee","3740","0","0.00","2024","Logisch","00","Nee","2023-07-02T00:00:00.000",,"2017-09-21T00:00:00.000","2017-09-21T00:00:00.000",,,,,,,,,,,"165",,,,,,,,,,"B",,,,,,,"https://opendata.rdw.nl/resource/3huj-srit.json","https://opendata.rdw.nl/resource/8ys7-d773.json","https://opendata.rdw.nl/resource/vezc-m2t6.json","https://opendata.rdw.nl/resource/jhie-znh9.json","https://opendata.rdw.nl/resource/kmfi-hrps.json"
"PT582N","Personenauto","RENAULT","SCENIC HYBRID ASSIST","20220924",,"4207","hatchback","5","WIT","Niet geregistreerd","4","1461","1513","2240","1613","750","1850","20170922","20170922","Geen verstrekking in Open Data","37215","Ja",,,,,,,"5","4","0","0",,"464","0","M1",,,"op r. deurstyl","2240","RFA",,"e2*2007/46*0574*02","RS2","AE6RVA015000","0","0.05","280","Ja","Nee",,"Nee","3740","0","0.00","2022","Logisch","00","Nee","2022-09-24T00:00:00.000",,"2017-09-22T00:00:00.000","2017-09-22T00:00:00.000",,,,,,,,,,,,,,,,,,,,,"B",,,,,,,"https://opendata.rdw.nl/resource/3huj-srit.json","https://opendata.rdw.nl/resource/8ys7-d773.json","https://opendata.rdw.nl/resource/vezc-m2t6.json","https://opendata.rdw.nl/resource/jhie-znh9.json","https://opendata.rdw.nl/resource/kmfi-hrps.json"
"PT642Z","Personenauto","RENAULT","SCENIC HYBRID ASSIST","20230708",,"4207","hatchback","7","WIT","Niet geregistreerd","4","1461","1515","2301","1615","750","1850","20170928","20170928","Geen verstrekking in Open Data","38165","Nee",,,,,,,"5","4","0","0",,"464","0","M1",,,"op r. deurstyl","2301","RFA",,"e2*2007/46*0574*02","RS2","AE6RVA017000","0","0.05","280","Ja","Nee",,"Nee","3801","0","0.00","2022","Logisch","00","Nee","2023-07-08T00:00:00.000",,"2017-09-28T00:00:00.000","2017-09-28T00:00:00.000",,,,,,,,,,,,,,,,,,,,,"B",,,,,,,"https://opendata.rdw.nl/resource/3huj-srit.json","https://opendata.rdw.nl/resource/8ys7-d773.json","https://opendata.rdw.nl/resource/vezc-m2t6.json","https://opendata.rdw.nl/resource/jhie-znh9.json","https://opendata.rdw.nl/resource/kmfi-hrps.json"
"PT658H","Personenauto","RENAULT","SCENIC HYBRID ASSIST","20230504",,"4207","hatchback","5","BRUIN","Niet geregistreerd","4","1461","1513","2240","1613","750","1850","20170920","20170920","Geen verstrekking in Open Data","38755","Nee",,,,,,,"5","4","0","0",,"464","0","M1",,,"op r. deurstyl","2240","RFA",,"e2*2007/46*0574*02","RS2","AE6RVA015000","0","0.05","280","Ja","Nee",,"Nee","3740","0","0.00","2022","Logisch","00","Nee","2023-05-04T00:00:00.000",,"2017-09-20T00:00:00.000","2017-09-20T00:00:00.000",,,,,,,,,,,,,,,,,,,,,"B",,,,,,,"https://opendata.rdw.nl/resource/3huj-srit.json","https://opendata.rdw.nl/resource/8ys7-d773.json","https://opendata.rdw.nl/resource/vezc-m2t6.json","https://opendata.rdw.nl/resource/jhie-znh9.json","https://opendata.rdw.nl/resource/kmfi-hrps.json"
"PV051F","Personenauto","RENAULT","SCENIC HYBRID ASSIST","20230929",,"4207","hatchback","5","BLAUW","Niet geregistreerd","4","1461","1513","2240","1613","750","1850","20170929","20170929","Geen verstrekking in Open Data","36210","Nee",,,,,,,"5","4","0","0",,"464","187","M1",,,"op r. deurstyl","2240","RFA",,"e2*2007/46*0574*02","RS2","AE6RVA015000","0","0.05","280","Ja","Nee",,"Nee","3740","0","0.00","2022","Logisch","00","Nee","2023-09-29T00:00:00.000",,"2017-09-29T00:00:00.000","2017-09-29T00:00:00.000",,,,,,,,,,,"165",,,,,,,,,,"B",,,,,,,"https://opendata.rdw.nl/resource/3huj-srit.json","https://opendata.rdw.nl/resource/8ys7-d773.json","https://opendata.rdw.nl/resource/vezc-m2t6.json","https://opendata.rdw.nl/resource/jhie-znh9.json","https://opendata.rdw.nl/resource/kmfi-hrps.json"
"PV931K","Personenauto","RENAULT","SCENIC HYBRID ASSIST","20231011",,"4207","hatchback","5","ROOD","Niet geregistreerd","4","1461","1483","2116","1583","750","1850","20171011","20171011","Geen verstrekking in Open Data","36710","Ja",,,,,,,"5","4","0","0",,"441","187","M1",,,"op r. deurstyl","2116","RFA",,"e2*2007/46*0574*02","JS2","AE6RVA015000","0","0.05","273","Ja","Nee",,"Nee","3616","0","0.00","2023","Logisch","00","Nee","2023-10-11T00:00:00.000",,"2017-10-11T00:00:00.000","2017-10-11T00:00:00.000",,,,,,,,,,,"165",,,,,,,,,,"B",,,,,,,"https://opendata.rdw.nl/resource/3huj-srit.json","https://opendata.rdw.nl/resource/8ys7-d773.json","https://opendata.rdw.nl/resource/vezc-m2t6.json","https://opendata.rdw.nl/resource/jhie-znh9.json","https://opendata.rdw.nl/resource/kmfi-hrps.json"
"PV961D","Personenauto","RENAULT","SCENIC HYBRID ASSIST","20231004",,"4207","hatchback","5","GRIJS","Niet geregistreerd","4","1461","1483","2116","1583","750","1850","20171004","20171004","Geen verstrekking in Open Data","36610","Nee",,,,,,,"5","4","0","0",,"441","187","M1",,,"op r. deurstyl","2116","RFA",,"e2*2007/46*0574*02","JS2","AE6RVA015000","0","0.05","273","Ja","Nee",,"Nee","3616","0","0.00","2023","Logisch","00","Nee","2023-10-04T00:00:00.000",,"2017-10-04T00:00:00.000","2017-10-04T00:00:00.000",,,,,,,,,,,"165",,,,,,,,,,"B",,,,,,,"https://opendata.rdw.nl/resource/3huj-srit.json","https://opendata.rdw.nl/resource/8ys7-d773.json","https://opendata.rdw.nl/resource/vezc-m2t6.json","https://opendata.rdw.nl/resource/jhie-znh9.json","https://opendata.rdw.nl/resource/kmfi-hrps.json"
"PX551T","Personenauto","RENAULT","SCENIC HYBRID ASSIST","20230110",,"4207","hatchback","5","BLAUW","Niet geregistreerd","4","1461","1513","2240","1613","750","1850","20171009","20171009","Geen verstrekking in Open Data","37910","Nee",,,,,,,"5","4","0","0",,"464","0","M1",,,"op r. deurstyl","2240","RFA",,"e2*2007/46*0574*02","RS2","AE6RVA015000","0","0.05","280","Ja","Nee",,"Nee","3740","0","0.00","2022","Logisch","00","Nee","2023-01-10T00:00:00.000",,"2017-10-09T00:00:00.000","2017-10-09T00:00:00.000",,,,,,,,,,,,,,,,,,,,,"B",,,,,,,"https://opendata.rdw.nl/resource/3huj-srit.json","https://opendata.rdw.nl/resource/8ys7-d773.json","https://opendata.rdw.nl/resource/vezc-m2t6.json","https://opendata.rdw.nl/resource/jhie-znh9.json","https://opendata.rdw.nl/resource/kmfi-hrps.json"
"PZ037S","Personenauto","RENAULT","SCENIC HYBRID ASSIST","20221020",,"4207","hatchback","7","BLAUW","Niet geregistreerd","4","1461","1515","2301","1615","750","1850","20171020","20171020","Geen verstrekking in Open Data","39605","Nee",,,,,,,"5","4","0","0",,"464","0","M1",,,"op r. deurstyl","2301","RFA",,"e2*2007/46*0574*02","RS2","AE6RVA017000","0","0.05","280","Ja","Nee",,"Nee","3801","0","0.00","2022","Logisch","00","Nee","2022-10-20T00:00:00.000",,"2017-10-20T00:00:00.000","2017-10-20T00:00:00.000",,,,,,,,,,,,,,,,,,,,,"B",,,,,,,"https://opendata.rdw.nl/resource/3huj-srit.json","https://opendata.rdw.nl/resource/8ys7-d773.json","https://opendata.rdw.nl/resource/vezc-m2t6.json","https://opendata.rdw.nl/resource/jhie-znh9.json","https://opendata.rdw.nl/resource/kmfi-hrps.json"
"PZ368K","Personenauto","RENAULT","SCENIC HYBRID ASSIST","20231013",,"4207","hatchback","5","ROOD","Niet geregistreerd","4","1461","1513","2240","1613","750","1850","20171013","20171013","Geen verstrekking in Open Data","36755","Nee",,,,,,,"5","4","0","0",,"464","187","M1",,,"op r. deurstyl","2240","RFA",,"e2*2007/46*0574*02","RS2","AE6RVA015000","0","0.05","280","Ja","Nee",,"Nee","3740","0","0.00","2023","Logisch","00","Nee","2023-10-13T00:00:00.000",,"2017-10-13T00:00:00.000","2017-10-13T00:00:00.000",,,,,,,,,,,"165",,,,,,,,,,"B",,,,,,,"https://opendata.rdw.nl/resource/3huj-srit.json","https://opendata.rdw.nl/resource/8ys7-d773.json","https://opendata.rdw.nl/resource/vezc-m2t6.json","https://opendata.rdw.nl/resource/jhie-znh9.json","https://opendata.rdw.nl/resource/kmfi-hrps.json"
"PZ502K","Personenauto","RENAULT","SCENIC HYBRID ASSIST","20241106",,"4207","hatchback","7","GRIJS","Niet geregistreerd","4","1461","1515","2301","1615","750","1850","20171102","20171102","Geen verstrekking in Open Data","38710","Ja",,,,,,,"5","4","0","0",,"464","187","M1",,,"op r. deurstyl","2301","RFA",,"e2*2007/46*0574*02","RS2","AE6RVA017000","0","0.05","280","Ja","Nee",,"Nee","3801","0","0.00","2023","Logisch","00","Nee","2024-11-06T00:00:00.000",,"2017-11-02T00:00:00.000","2017-11-02T00:00:00.000",,,,,,,,,,,"165",,,,,,,,,,"B",,,,,,,"https://opendata.rdw.nl/resource/3huj-srit.json","https://opendata.rdw.nl/resource/8ys7-d773.json","https://opendata.rdw.nl/resource/vezc-m2t6.json","https://opendata.rdw.nl/resource/jhie-znh9.json","https://opendata.rdw.nl/resource/kmfi-hrps.json"
"PZ898N","Personenauto","RENAULT","SCENIC HYBRID ASSIST","20231020",,"4207","hatchback","5","BLAUW","Niet geregistreerd","4","1461","1483","2116","1583","750","1850","20171020","20171020","Geen verstrekking in Open Data","36710","Nee",,,,,,,"5","4","0","0",,"441","187","M1",,,"op r. deurstyl","2116","RFA",,"e2*2007/46*0574*02","JS2","AE6RVA015000","0","0.05","273","Ja","Nee",,"Nee","3616","0","0.00","2022","Niet geregistreerd","NG","Nee","2023-10-20T00:00:00.000",,"2017-10-20T00:00:00.000","2017-10-20T00:00:00.000",,,,,,,,,,,"165",,,,,,,,,,"B",,,,,,,"https://opendata.rdw.nl/resource/3huj-srit.json","https://opendata.rdw.nl/resource/8ys7-d773.json","https://opendata.rdw.nl/resource/vezc-m2t6.json","https://opendata.rdw.nl/resource/jhie-znh9.json","https://opendata.rdw.nl/resource/kmfi-hrps.json"
"RB432P","Personenauto","RENAULT","SCENIC HYBRID ASSIST","20231108",,"4207","hatchback","5","BLAUW","Niet geregistreerd","4","1461","1483","2116","1583","750","1850","20171108","20171108","Geen verstrekking in Open Data","35010","Ja",,,,,,,"5","4","0","0",,"441","187","M1",,,"op r. deurstyl","2116","RFA",,"e2*2007/46*0574*02","JS2","AE6RVA015000","0","0.05","273","Ja","Nee",,"Nee","3616","0","0.00","2023","Logisch","00","Nee","2023-11-08T00:00:00.000",,"2017-11-08T00:00:00.000","2017-11-08T00:00:00.000",,,,,,,,,,,"165",,,,,,,,,,"B",,,,,,,"https://opendata.rdw.nl/resource/3huj-srit.json","https://opendata.rdw.nl/resource/8ys7-d773.json","https://opendata.rdw.nl/resource/vezc-m2t6.json","https://opendata.rdw.nl/resource/jhie-znh9.json","https://opendata.rdw.nl/resource/kmfi-hrps.json"
"RB658H","Personenauto","RENAULT","SCENIC HYBRID ASSIST","20231116",,"4207","hatchback","5","BLAUW","Niet geregistreerd","4","1461","1513","2240","1613","750","1850","20171116","20171116","Geen verstrekking in Open Data","37105","Nee",,,,,,,"5","4","0","0",,"464","187","M1",,,"op r. deurstyl","2240","RFA",,"e2*2007/46*0574*02","RS2","AE6RVA015000","0","0.05","280","Ja","Nee",,"Nee","3740","0","0.00","2023","Logisch","00","Nee","2023-11-16T00:00:00.000",,"2017-11-16T00:00:00.000","2017-11-16T00:00:00.000",,,,,,,,,,,"165",,,,,,,,,,"B",,,,,,,"https://opendata.rdw.nl/resource/3huj-srit.json","https://opendata.rdw.nl/resource/8ys7-d773.json","https://opendata.rdw.nl/resource/vezc-m2t6.json","https://opendata.rdw.nl/resource/jhie-znh9.json","https://opendata.rdw.nl/resource/kmfi-hrps.json"
"RB821S","Personenauto","RENAULT","SCENIC HYBRID ASSIST","20230730",,"4207","hatchback","5","WIT","Niet geregistreerd","4","1461","1513","2240","1613","750","1850","20171026","20171026","Geen verstrekking in Open Data","36819","Nee",,,,,,,"5","4","0","0",,"464","187","M1",,,"op r. deurstyl","2240","RFA",,"e2*2007/46*0574*02","RS2","AE6RVA015000","0","0.05","280","Ja","Nee",,"Nee","3740","0","0.00","2023","Logisch","00","Nee","2023-07-30T00:00:00.000",,"2017-10-26T00:00:00.000","2017-10-26T00:00:00.000",,,,,,,,,,,"165",,,,,,,,,,"B",,,,,,,"https://opendata.rdw.nl/resource/3huj-srit.json","https://opendata.rdw.nl/resource/8ys7-d773.json","https://opendata.rdw.nl/resource/vezc-m2t6.json","https://opendata.rdw.nl/resource/jhie-znh9.json","https://opendata.rdw.nl/resource/kmfi-hrps.json"
"RB896K","Personenauto","RENAULT","SCENIC HYBRID ASSIST","20231104",,"4207","hatchback","5","BRUIN","Niet geregistreerd","4","1461","1513","2240","1613","750","1850","20171102","20171102","Geen verstrekking in Open Data","38455","Nee",,,,,,,"5","4","0","0",,"464","187","M1",,,"op r. deurstyl","2240","RFA",,"e2*2007/46*0574*02","RS2","AE6RVA015000","0","0.05","280","Ja","Nee",,"Nee","3740","0","0.00","2023","Logisch","00","Nee","2023-11-04T00:00:00.000",,"2017-11-02T00:00:00.000","2017-11-02T00:00:00.000",,,,,,,,,,,"165",,,,,,,,,,"B",,,,,,,"https://opendata.rdw.nl/resource/3huj-srit.json","https://opendata.rdw.nl/resource/8ys7-d773.json","https://opendata.rdw.nl/resource/vezc-m2t6.json","https://opendata.rdw.nl/resource/jhie-znh9.json","https://opendata.rdw.nl/resource/kmfi-hrps.json"
"RD206D","Personenauto","RENAULT","SCENIC HYBRID ASSIST","20230616",,"4207","hatchback","5","BLAUW","Niet geregistreerd","4","1461","1513","2240","1613","750","1850","20171027","20171027","Geen verstrekking in Open Data","34505","Ja",,,,,,,"5","4","0","0",,"464","187","M1",,,"op r. deurstyl","2240","RFA",,"e2*2007/46*0574*02","RS2","AE6RVA015000","0","0.05","280","Ja","Nee",,"Nee","3740","0","0.00","2023","Logisch","00","Nee","2023-06-16T00:00:00.000",,"2017-10-27T00:00:00.000","2017-10-27T00:00:00.000",,,,,,,,,,,"165",,,,,,,,,,"B",,,,,,,"https://opendata.rdw.nl/resource/3huj-srit.json","https://opendata.rdw.nl/resource/8ys7-d773.json","https://opendata.rdw.nl/resource/vezc-m2t6.json","https://opendata.rdw.nl/resource/jhie-znh9.json","https://opendata.rdw.nl/resource/kmfi-hrps.json"
"RD365V","Personenauto","RENAULT","SCENIC HYBRID ASSIST","20231120",,"4207","hatchback","7","GRIJS","Niet geregistreerd","4","1461","1515","2301","1615","750","1850","20171120","20171120","Geen verstrekking in Open Data","35305","Nee",,,,,,,"5","4","0","0",,"464","187","M1",,,"op r. deurstyl","2301","RFA",,"e2*2007/46*0574*02","RS2","AE6RVA017000","0","0.05","280","Ja","Nee",,"Nee","3801","0","0.00","2023","Onlogisch","04","Nee","2023-11-20T00:00:00.000",,"2017-11-20T00:00:00.000","2017-11-20T00:00:00.000",,,,,,,,,,,"165",,,,,,,,,,"B",,,,,,,"https://opendata.rdw.nl/resource/3huj-srit.json","https://opendata.rdw.nl/resource/8ys7-d773.json","https://opendata.rdw.nl/resource/vezc-m2t6.json","https://opendata.rdw.nl/resource/jhie-znh9.json","https://opendata.rdw.nl/resource/kmfi-hrps.json"
"RD846G","Personenauto","RENAULT","SCENIC HYBRID ASSIST","20240111",,"4207","hatchback","5","BLAUW","Niet geregistreerd","4","1461","1513","2240","1613","750","1850","20171031","20171031","Geen verstrekking in Open Data","36210","Nee",,,,,,,"5","4","0","0",,"464","187","M1",,,"op r. deurstyl","2240","RFA",,"e2*2007/46*0574*02","RS2","AE6RVA015000","0","0.05","280","Ja","Nee",,"Nee","3740","0","0.00","2023","Logisch","00","Nee","2024-01-11T00:00:00.000",,"2017-10-31T00:00:00.000","2017-10-31T00:00:00.000",,,,,,,,,,,"165",,,,,,,,,,"B",,,,,,,"https://opendata.rdw.nl/resource/3huj-srit.json","https://opendata.rdw.nl/resource/8ys7-d773.json","https://opendata.rdw.nl/resource/vezc-m2t6.json","https://opendata.rdw.nl/resource/jhie-znh9.json","https://opendata.rdw.nl/resource/kmfi-hrps.json"
"RF382F","Personenauto","RENAULT","SCENIC HYBRID ASSIST","20231107",,"4207","hatchback","5","WIT","Niet geregistreerd","4","1461","1513","2240","1613","750","1850","20171107","20171107","Geen verstrekking in Open Data","35120","Nee",,,,,,,"5","4","0","0",,"464","187","M1",,,"op r. deurstyl","2240","RFA",,"e2*2007/46*0574*02","RS2","AE6RVA015000","0","0.05","280","Ja","Nee",,"Nee","3740","0","0.00","2023","Logisch","00","Nee","2023-11-07T00:00:00.000",,"2017-11-07T00:00:00.000","2017-11-07T00:00:00.000",,,,,,,,,,,"165",,,,,,,,,,"B",,,,,,,"https://opendata.rdw.nl/resource/3huj-srit.json","https://opendata.rdw.nl/resource/8ys7-d773.json","https://opendata.rdw.nl/resource/vezc-m2t6.json","https://opendata.rdw.nl/resource/jhie-znh9.json","https://opendata.rdw.nl/resource/kmfi-hrps.json"
"RF408F","Personenauto","RENAULT","SCENIC HYBRID ASSIST","20231106",,"4207","hatchback","5","WIT","Niet geregistreerd","4","1461","1513","2240","1613","750","1850","20171106","20171106","Geen verstrekking in Open Data","36060","Nee",,,,,,,"5","4","0","0",,"464","187","M1",,,"op r. deurstyl","2240","RFA",,"e2*2007/46*0574*02","RS2","AE6RVA015000","0","0.05","280","Ja","Nee",,"Nee","3740","0","0.00","2023","Logisch","00","Nee","2023-11-06T00:00:00.000",,"2017-11-06T00:00:00.000","2017-11-06T00:00:00.000",,,,,,,,,,,"165",,,,,,,,,,"B",,,,,,,"https://opendata.rdw.nl/resource/3huj-srit.json","https://opendata.rdw.nl/resource/8ys7-d773.json","https://opendata.rdw.nl/resource/vezc-m2t6.json","https://opendata.rdw.nl/resource/jhie-znh9.json","https://opendata.rdw.nl/resource/kmfi-hrps.json"