"kenteken","voertuigsoort","merk","handelsbenaming","vervaldatum_apk","datum_tenaamstelling","bruto_bpm","inrichting","aantal_zitplaatsen","eerste_kleur","tweede_kleur","aantal_cilinders","cilinderinhoud","massa_ledig_voertuig","toegestane_maximum_massa_voertuig","massa_rijklaar","maximum_massa_trekken_ongeremd","maximum_trekken_massa_geremd","datum_eerste_toelating","datum_eerste_tenaamstelling_in_nederland","wacht_op_keuren","catalogusprijs","wam_verzekerd","maximale_constructiesnelheid","laadvermogen","oplegger_geremd","aanhangwagen_autonoom_geremd","aanhangwagen_middenas_geremd","aantal_staanplaatsen","aantal_deuren","aantal_wielen","afstand_hart_koppeling_tot_achterzijde_voertuig","afstand_voorzijde_voertuig_tot_hart_koppeling","afwijkende_maximum_snelheid","lengte","breedte","europese_voertuigcategorie","europese_voertuigcategorie_toevoeging","europese_uitvoeringcategorie_toevoeging","plaats_chassisnummer","technische_max_massa_voertuig","type","type_gasinstallatie","typegoedkeuringsnummer","variant","uitvoering","volgnummer_wijziging_eu_typegoedkeuring","vermogen_massarijklaar","wielbasis","export_indicator","openstaande_terugroepactie_indicator","vervaldatum_tachograaf","taxi_indicator","maximum_massa_samenstelling","aantal_rolstoelplaatsen","maximum_ondersteunende_snelheid","jaar_laatste_registratie_tellerstand","tellerstandoordeel","code_toelichting_tellerstandoordeel","tenaamstellen_mogelijk","vervaldatum_apk_dt","datum_tenaamstelling_dt","datum_eerste_toelating_dt","datum_eerste_tenaamstelling_in_nederland_dt","vervaldatum_tachograaf_dt","maximum_last_onder_de_vooras_sen_tezamen_koppeling","type_remsysteem_voertuig_code","rupsonderstelconfiguratiecode","wielbasis_voertuig_minimum","wielbasis_voertuig_maximum","lengte_voertuig_minimum","lengte_voertuig_maximum","breedte_voertuig_minimum","breedte_voertuig_maximum","hoogte_voertuig","hoogte_voertuig_minimum","hoogte_voertuig_maximum","massa_bedrijfsklaar_minimaal","massa_bedrijfsklaar_maximaal","technisch_toelaatbaar_massa_koppelpunt","maximum_massa_technisch_maximaal","maximum_massa_technisch_minimaal","subcategorie_nederland","verticale_belasting_koppelpunt_getrokken_voertuig","zuinigheidsclassificatie","registratie_datum_goedkeuring_afschrijvingsmoment_bpm","registratie_datum_goedkeuring_afschrijvingsmoment_bpm_dt","gem_lading_wrde","aerodyn_voorz","massa_alt_aandr","verl_cab_ind","api_gekentekende_voertuigen_assen","api_gekentekende_voertuigen_brandstof","api_gekentekende_voertuigen_carrosserie","api_gekentekende_voertuigen_carrosserie_specifiek","api_gekentekende_voertuigen_voertuigklasse"
"6TVR80","Personenauto","MINI","COOPER S ALL4","20240125",,"5609","coupe","4","BRUIN","Niet geregistreerd","4","1598","1345","1840","1445","500","750","20130110","20140523","Geen verstrekking in Open Data","51417","Nee",,,,,,,"2","4","0","0",,"412","0","M1",,,"r. motorruimte","1840","UKL-C/X",,"e1*2007/46*0563*01","SS71","5H0C0","0","0.09","260","Ja","Nee",,"Nee","2665","0",,"2023","Geen oordeel","05","Nee","2024-01-25T00:00:00.000",,"2013-01-10T00:00:00.000","2014-05-23T00:00:00.000",,"0",,,,,,,,,,,,,,,,,,,"D",,,,,,,"https://opendata.rdw.nl/resource/3huj-srit.json","https://opendata.rdw.nl/resource/8ys7-d773.json","https://opendata.rdw.nl/resource/vezc-m2t6.json","https://opendata.rdw.nl/resource/jhie-znh9.json","https://opendata.rdw.nl/resource/kmfi-hrps.json"
"HZ002R","Personenauto","MINI","COOPER S ALL4","20230615",,"8366","coupe","4","ZWART","Niet geregistreerd","4","1598","1370","1865","1470","500","1000","20130318","20160121","Geen verstrekking in Open Data","54617","Nee",,,,,,,"2","4","0","0",,"412","0","M1",,,"r. motorruimte","1865","UKL-C/X",,"e1*2007/46*0563*01","SS71","5A0C0","0","0.09","260","Ja","Nee",,"Nee","2940","0",,"2022","Geen oordeel","05","Nee","2023-06-15T00:00:00.000",,"2013-03-18T00:00:00.000","2016-01-21T00:00:00.000",,,,,,,,,,,,,,,,,,,,,"E",,,,,,,"https://opendata.rdw.nl/resource/3huj-srit.json","https://opendata.rdw.nl/resource/8ys7-d773.json","https://opendata.rdw.nl/resource/vezc-m2t6.json","https://opendata.rdw.nl/resource/jhie-znh9.json","https://opendata.rdw.nl/resource/kmfi-hrps.json"
"J165PS","Personenauto","MINI","COOPER S ALL4","20241113",,"10367","stationwagen","5","ZWART","Niet geregistreerd","4","1598","1390","1925","1490","500","1000","20150520","20200923","Geen verstrekking in Open Data","49875","Nee",,,,,,,"4","4","0","0",,"411","179","M1",,,"r. motorruimte","1925","UKL/X",,"e1*2007/46*0496*09","ZC51","6A2500C0","0","0.09","260","Ja","Nee",,"Nee","3000","0",,"2023","Geen oordeel","05","Nee","2024-11-13T00:00:00.000",,"2015-05-20T00:00:00.000","2020-09-23T00:00:00.000",,,,,,,,,,,"154",,,,,,,,,,"F",,,,,,,"https://opendata.rdw.nl/resource/3huj-srit.json","https://opendata.rdw.nl/resource/8ys7-d773.json","https://opendata.rdw.nl/resource/vezc-m2t6.json","https://opendata.rdw.nl/resource/jhie-znh9.json","https://opendata.rdw.nl/resource/kmfi-hrps.json"
"J523SP","Personenauto","MINI","COOPER S ALL4","20230405",,"13665","hatchback","5","BLAUW","WIT","4","1598","1380","1865","1480",,,"20111019","20201007","Geen verstrekking in Open Data","46041","Nee",,,,,,,"4","4",,,,,,"M1",,,,"1865",,,,,,,"0.09","260","Ja","Nee",,"Nee",,,,"2022","Geen oordeel","05","Nee","2023-04-05T00:00:00.000",,"2011-10-19T00:00:00.000","2020-10-07T00:00:00.000",,,,,,,,,,,,,,,,,,,,,,,,,,,,"https://opendata.rdw.nl/resource/3huj-srit.json","https://opendata.rdw.nl/resource/8ys7-d773.json","https://opendata.rdw.nl/resource/vezc-m2t6.json","https://opendata.rdw.nl/resource/jhie-znh9.json","https://opendata.rdw.nl/resource/kmfi-hrps.json"
"JP613K","Personenauto","MINI","CLUBMAN COOPER S ALL4","20240520",,"7844","stationwagen","5","GRIJS","ZWART","4","1998","1435","2050","1535","750","1500","20160520","20160520","Geen verstrekking in Open Data","56985","Nee",,,,,,,"4","4","0","0",,"425","180","M1",,,"in motorruimte r.","2050","UKL-L",,"e1*2007/46*0371*23","LU31","6A2500C0","0","0.09","267","Ja","Nee",,"Nee","3625","0","0.00","2023","Logisch","00","Nee","2024-05-20T00:00:00.000",,"2016-05-20T00:00:00.000","2016-05-20T00:00:00.000",,,,,,,,,,,"144",,,,,,,,,,"E",,,,,,,"https://opendata.rdw.nl/resource/3huj-srit.json","https://opendata.rdw.nl/resource/8ys7-d773.json","https://opendata.rdw.nl/resource/vezc-m2t6.json","https://opendata.rdw.nl/resource/jhie-znh9.json","https://opendata.rdw.nl/resource/kmfi-hrps.json"
"JR677N","Personenauto","MINI","COOPER S ALL4","20240909",,"12173","stationwagen","5","ZWART","Niet geregistreerd","4","1598","1390","1925","1490","500","1000","20160909","20160909","Geen verstrekking in Open Data","56547","Nee",,,,,,,"4","4","0","0",,"411","179","M1",,,"in motorruimte r.","1925","UKL/X",,"e1*2007/46*0496*09","ZC51","6A2500C0","0","0.09","260","Ja","Nee",,"Nee","3000","0",,"2023","Logisch","00","Nee","2024-09-09T00:00:00.000",,"2016-09-09T00:00:00.000","2016-09-09T00:00:00.000",,,,,,,,,,,"154",,,,,,,,,,"G",,,,,,,"https://opendata.rdw.nl/resource/3huj-srit.json","https://opendata.rdw.nl/resource/8ys7-d773.json","https://opendata.rdw.nl/resource/vezc-m2t6.json","https://opendata.rdw.nl/resource/jhie-znh9.json","https://opendata.rdw.nl/resource/kmfi-hrps.json"
"K607PH","Personenauto","MINI","CLUBMAN COOPER S ALL4",,,"6703","stationwagen","5","GRIJS","ZWART","4","1998","1460","2040","1560","750","1500","20200312","20210125","Geen verstrekking in Open Data","59001","Ja","225",,,,,,"4","4","0","0",,"427","180","M1",,,,"2040","FMK",,"e1*2007/46*1683*07","XJ11","DAW500L0","0","0.09","267","Ja","Nee",,"Nee","3540","0","0.00","2022","Geen oordeel","05","Nee",,,"2020-03-12T00:00:00.000","2021-01-25T00:00:00.000",,,,,,,,,,,"144",,,,,,,,,,,,,,,,,"https://opendata.rdw.nl/resource/3huj-srit.json","https://opendata.rdw.nl/resource/8ys7-d773.json","https://opendata.rdw.nl/resource/vezc-m2t6.json","https://opendata.rdw.nl/resource/jhie-znh9.json","https://opendata.rdw.nl/resource/kmfi-hrps.json"
"L374DL","Personenauto","MINI","COOPER S ALL4","20230603",,"1256","stationwagen","5","WIT","Niet geregistreerd","4","1598","1380","1915","1480","500","1000","20130315","20210507","Geen verstrekking in Open Data","50784","Nee","205",,,,,,"4","4","0","0",,"411","179","M1",,,,"1915","UKL/X",,"e1*2007/46*0496*05","ZC51","5A05C","0","0.09","260","Ja","Nee",,"Nee","2990","0",,"2023","Geen oordeel","05","Nee","2023-06-03T00:00:00.000",,"2013-03-15T00:00:00.000","2021-05-07T00:00:00.000",,,,,,,,,,,"156",,,,,,,,,,,,,,,,,"https://opendata.rdw.nl/resource/3huj-srit.json","https://opendata.rdw.nl/resource/8ys7-d773.json","https://opendata.rdw.nl/resource/vezc-m2t6.json","https://opendata.rdw.nl/resource/jhie-znh9.json","https://opendata.rdw.nl/resource/kmfi-hrps.json"
"L628FK","Personenauto","MINI","CLUBMAN COOPER S ALL4","20231209",,"5953","stationwagen","5","GRIJS","WIT","4","1998","1425","2030","1525","750","1500","20161215","20211210","Geen verstrekking in Open Data","47772","Nee","225",,,,,,"4","4",,,,"425","180","M1",,,,"2030","FMK",,"e1*2007/46*1683*00","LU31","6H2500C0","0","0.09","267","Ja","Nee",,"Nee","3605",,,"2021","Geen oordeel","05","Nee","2023-12-09T00:00:00.000",,"2016-12-15T00:00:00.000","2021-12-10T00:00:00.000",,,,,,,,,,,"144",,,,,,,,,,,,,,,,,"https://opendata.rdw.nl/resource/3huj-srit.json","https://opendata.rdw.nl/resource/8ys7-d773.json","https://opendata.rdw.nl/resource/vezc-m2t6.json","https://opendata.rdw.nl/resource/jhie-znh9.json","https://opendata.rdw.nl/resource/kmfi-hrps.json"
"N405JX","Personenauto","MINI","COOPER S ALL4",,,"7863","stationwagen","5","ZWART","ROOD","4","1598","1355","1890","1455","500","750","20130926","20220527","Geen verstrekking in Open Data","38495","Nee","210",,,,,,"4","4","0","0",,"411","179","M1",,,,"1890","UKL/X",,"e1*2007/46*0496*06","ZC51","5H05C","0","0.09","260","Ja","Nee",,"Nee","2715","0",,"2022","Geen oordeel","05","Nee",,,"2013-09-26T00:00:00.000","2022-05-27T00:00:00.000",,,,,,,,,,,"156",,,,,,,,,,,"20211025","2021-10-25T00:00:00.000",,,,,"https://opendata.rdw.nl/resource/3huj-srit.json","https://opendata.rdw.nl/resource/8ys7-d773.json","https://opendata.rdw.nl/resource/vezc-m2t6.json","https://opendata.rdw.nl/resource/jhie-znh9.json","https://opendata.rdw.nl/resource/kmfi-hrps.json"
"NH409T","Personenauto","MINI","CLUBMAN COOPER S ALL4","20250203",,"9036","stationwagen","5","GRIJS","ZWART","4","1998","1435","2050","1535","750","1500","20170203","20170203","Geen verstrekking in Open Data","53254","Nee",,,,,,,"4","4","0","0",,"425","180","M1",,,"in motorruimte r.","2050","UKL-L",,"e1*2007/46*0371*23","LU31","6A2500C0","0","0.09","267","Ja","Nee",,"Nee","3625","0","0.00","2023","Logisch","00","Nee","2025-02-03T00:00:00.000",,"2017-02-03T00:00:00.000","2017-02-03T00:00:00.000",,,,,,,,,,,"144",,,,,,,,,,"E",,,,,,,"https://opendata.rdw.nl/resource/3huj-srit.json","https://opendata.rdw.nl/resource/8ys7-d773.json","https://opendata.rdw.nl/resource/vezc-m2t6.json","https://opendata.rdw.nl/resource/jhie-znh9.json","https://opendata.rdw.nl/resource/kmfi-hrps.json"
"PD588S","Personenauto","MINI","COUNTRYMAN COOPER S ALL4",,,"8601","stationwagen","5","ZWART","Niet geregistreerd","4","1998","1505","2120","1605","750","1800","20170612","20170612","Geen verstrekking in Open Data","59860","Nee",,,,,,,"4","4","0","0",,"430","182","M1",,,"in motorruimte r.","2120","FMX",,"e1*2007/46*1682*01","YT11","CA1500L0","0","0.09","267","Ja","Nee",,"Nee","3995","0","0.00","2023","Niet geregistreerd","NG","Nee",,,"2017-06-12T00:00:00.000","2017-06-12T00:00:00.000",,,,,,,,,,,"156",,,,,,,,,,"D",,,,,,,"https://opendata.rdw.nl/resource/3huj-srit.json","https://opendata.rdw.nl/resource/8ys7-d773.json","https://opendata.rdw.nl/resource/vezc-m2t6.json","https://opendata.rdw.nl/resource/jhie-znh9.json","https://opendata.rdw.nl/resource/kmfi-hrps.json"
"PF533K","Personenauto","MINI","COUNTRYMAN COOPER S ALL4","20250821",,"8601","stationwagen","5","GRIJS","ZWART","4","1998","1505","2120","1605","750","1800","20170616","20170616","Geen verstrekking in Open Data","46072","Nee",,,,,,,"4","4","0","0",,"430","182","M1",,,"in motorruimte r.","2120","FMX",,"e1*2007/46*1682*01","YT11","CA1500L0","0","0.09","267","Ja","Nee",,"Nee","3995","0","0.00","2024","Niet geregistreerd","NG","Nee","2025-08-21T00:00:00.000",,"2017-06-16T00:00:00.000","2017-06-16T00:00:00.000",,,,,,,,,,,"156",,,,,,,,,,"D",,,,,,,"https://opendata.rdw.nl/resource/3huj-srit.json","https://opendata.rdw.nl/resource/8ys7-d773.json","https://opendata.rdw.nl/resource/vezc-m2t6.json","https://opendata.rdw.nl/resource/jhie-znh9.json","https://opendata.rdw.nl/resource/kmfi-hrps.json"
"PN731P","Personenauto","MINI","CLUBMAN COOPER S ALL4","20230802",,"12037","stationwagen","5","BLAUW","Niet geregistreerd","4","1998","1425","2030","1525","750","1500","20170802","20170802","Geen verstrekking in Open Data","46296","Nee",,,,,,,"4","4","0","0",,"425","0","M1",,,"r. motorruimte","2030","FMK",,"e1*2007/46*1683*01","LU31","6H2500C0","0","0.09","267","Ja","Nee",,"Nee","3605","0","0.00","2022","Logisch","00","Nee","2023-08-02T00:00:00.000",,"2017-08-02T00:00:00.000","2017-08-02T00:00:00.000",,,,,,,,,,,,,,,,,,,,,"F",,,,,,,"https://opendata.rdw.nl/resource/3huj-srit.json","https://opendata.rdw.nl/resource/8ys7-d773.json","https://opendata.rdw.nl/resource/vezc-m2t6.json","https://opendata.rdw.nl/resource/jhie-znh9.json","https://opendata.rdw.nl/resource/kmfi-hrps.json"
"PS118K","Personenauto","MINI","COOPER S ALL4","20230706",,"7537","coupe","4","BLAUW","ZWART","4","1598","1345","1840","1445","500","750","20130910","20170928","Geen verstrekking in Open Data","46782","Ja",,,,,,,"2","4","0","0",,"412","0","M1",,,"r. motorruimte","1840","UKL-C/X",,"e1*2007/46*0563*02","SS71","5H0C0","0","0.09","260","Ja","Nee",,"Nee","2665","0",,"2022","Onlogisch","04","Nee","2023-07-06T00:00:00.000",,"2013-09-10T00:00:00.000","2017-09-28T00:00:00.000",,,,,,,,,,,,,,,,,,,,,"D",,,,,,,"https://opendata.rdw.nl/resource/3huj-srit.json","https://opendata.rdw.nl/resource/8ys7-d773.json","https://opendata.rdw.nl/resource/vezc-m2t6.json","https://opendata.rdw.nl/resource/jhie-znh9.json","https://opendata.rdw.nl/resource/kmfi-hrps.json"
"PT789X","Personenauto","MINI","COOPER S ALL4","20231214",,"7863","coupe","4","BRUIN","ZWART","4","1598","1345","1840","1445","500","750","20130321","20171219","Geen verstrekking in Open Data","40747","Nee",,,,,,,"2","4","0","0",,"412","0","M1",,,"r. motorruimte","1840","UKL-C/X",,"e1*2007/46*0563*01","SS71","5H0C0","0","0.09","260","Ja","Nee",,"Nee","2665","0",,"2022","Geen oordeel","05","Nee","2023-12-14T00:00:00.000",,"2013-03-21T00:00:00.000","2017-12-19T00:00:00.000",,,,,,,,,,,,,,,,,,,,,"D",,,,,,,"https://opendata.rdw.nl/resource/3huj-srit.json","https://opendata.rdw.nl/resource/8ys7-d773.json","https://opendata.rdw.nl/resource/vezc-m2t6.json","https://opendata.rdw.nl/resource/jhie-znh9.json","https://opendata.rdw.nl/resource/kmfi-hrps.json"
"R290TJ","Personenauto","MINI","COUNTRYMAN COOPER S ALL4",,,"5796","stationwagen","5","ZWART","Niet geregistreerd","4","1998","1545","2130","1645","750","1800","20220525","20230406","Geen verstrekking in Open Data","59342","Nee","222",,,,,,"4","4","0","0",,"430","182","M1",,,,"2130","FMX",,"e1*2007/46*1682*12","81BR","IAW500B0","0","0.08","267","Ja","Nee",,"Nee","3930","0","0.00","2023","Geen oordeel","05","Nee",,,"2022-05-25T00:00:00.000","2023-04-06T00:00:00.000",,,,,,,,,,,"156",,,,,,,,,,,"20221116","2022-11-16T00:00:00.000",,,,,"https://opendata.rdw.nl/resource/3huj-srit.json","https://opendata.rdw.nl/resource/8ys7-d773.json","https://opendata.rdw.nl/resource/vezc-m2t6.json","https://opendata.rdw.nl/resource/jhie-znh9.json","https://opendata.rdw.nl/resource/kmfi-hrps.json"
"RG584T","Personenauto","MINI","COUNTRYMAN COOPER S ALL4","20251124",,"9181","stationwagen","5","ZWART","Niet geregistreerd","4","1998","1505","2120","1605","750","1800","20171124","20171124","Geen verstrekking in Open Data","61666","Nee",,,,,,,"4","4","0","0",,"430","182","M1",,,"in motorruimte r.","2120","FMX",,"e1*2007/46*1682*02","YT11","CA2500L0","0","0.09","267","Ja","Nee",,"Nee","3995","0","0.00","2023","Logisch","00","Nee","2025-11-24T00:00:00.000",,"2017-11-24T00:00:00.000","2017-11-24T00:00:00.000",,,,,,,,,,,"156",,,,,,,,,,"E",,,,,,,"https://opendata.rdw.nl/resource/3huj-srit.json","https://opendata.rdw.nl/resource/8ys7-d773.json","https://opendata.rdw.nl/resource/vezc-m2t6.json","https://opendata.rdw.nl/resource/jhie-znh9.json","https://opendata.rdw.nl/resource/kmfi-hrps.json"
"RK713S","Personenauto","MINI","COOPER S ALL4","20230829",,"3625","stationwagen","5","GRIJS","ZWART","4","1598","1355","1890","1455","500","750","20140814","20171219","Geen verstrekking in Open Data","47469","Nee",,,,,,,"4","4","0","0",,"411","0","M1",,,"r. motorruimte","1890","UKL/X",,"e1*2007/46*0496*06","ZC51","5H05C","0","0.09","260","Ja","Nee",,"Nee","2715","0",,"2023","Geen oordeel","05","Nee","2023-08-29T00:00:00.000",,"2014-08-14T00:00:00.000","2017-12-19T00:00:00.000",,,,,,,,,,,,,,,,,,,,,"E",,,,,,,"https://opendata.rdw.nl/resource/3huj-srit.json","https://opendata.rdw.nl/resource/8ys7-d773.json","https://opendata.rdw.nl/resource/vezc-m2t6.json","https://opendata.rdw.nl/resource/jhie-znh9.json","https://opendata.rdw.nl/resource/kmfi-hrps.json"
"TK965L","Personenauto","MINI","COOPER S ALL4",,,"5557","stationwagen","5","ZWART","Niet geregistreerd","4","1598","1365","1900","1465","500","750","20150210","20180823","Geen verstrekking in Open Data","49498","Nee",,,,,,,"4","4","0","0",,"411","0","M1",,,"r. motorruimte","1900","UKL/X",,"e1*2007/46*0496*08","ZC51","6H2500C0","0","0.10","260","Ja","Nee",,"Nee","2725","0","0.00","2022","Geen oordeel","05","Nee",,,"2015-02-10T00:00:00.000","2018-08-23T00:00:00.000",,,,,,,,,,,,,,,,,,,,,"D",,,,,,,"https://opendata.rdw.nl/resource/3huj-srit.json","https://opendata.rdw.nl/resource/8ys7-d773.json","https://opendata.rdw.nl/resource/vezc-m2t6.json","https://opendata.rdw.nl/resource/jhie-znh9.json","https://opendata.rdw.nl/resource/kmfi-hrps.json"
"TS044N","Personenauto","MINI","CLUBMAN COOPER S ALL4","20240817",,"7237","stationwagen","5","GRIJS","Niet geregistreerd","4","1998","1435","2050","1535","750","1500","20160809","20181008","Geen verstrekking in Open Data","50300","Nee",,,,,,,"4","4","0","0",,"425","0","M1",,,"r. motorruimte","2050","UKL-L",,"e1*2007/46*0371*24","LU31","6A2500C0","0","0.09","267","Ja","Nee",,"Nee","3625","0","0.00","2022","Geen oordeel","05","Nee","2024-08-17T00:00:00.000",,"2016-08-09T00:00:00.000","2018-10-08T00:00:00.000",,,,,,,,,,,,,,,,,,,,,"E",,,,,,,"https://opendata.rdw.nl/resource/3huj-srit.json","https://opendata.rdw.nl/resource/8ys7-d773.json","https://opendata.rdw.nl/resource/vezc-m2t6.json","https://opendata.rdw.nl/resource/jhie-znh9.json","https://opendata.rdw.nl/resource/kmfi-hrps.json"
"TZ737L","Personenauto","MINI","COOPER S ALL4","20231216",,"16444","stationwagen","5","GRIJS","ZWART","4","1598","1497","1925","1597","500","1000","20151216","20181115","Geen verstrekking in Open Data","63475","Nee",,,,,,,"4","4",,,,,,"M1",,,"r. motorruimte","1925","UKL/X",,,,,,"0.08","260","Ja","Nee",,"Nee","3000",,,"2022","Geen oordeel","05","Nee","2023-12-16T00:00:00.000",,"2015-12-16T00:00:00.000","2018-11-15T00:00:00.000",,,,,,,,,,,,,,,,,,,,,,,,,,,,"https://opendata.rdw.nl/resource/3huj-srit.json","https://opendata.rdw.nl/resource/8ys7-d773.json","https://opendata.rdw.nl/resource/vezc-m2t6.json","https://opendata.rdw.nl/resource/jhie-znh9.json","https://opendata.rdw.nl/resource/kmfi-hrps.json"
