"kenteken","voertuigsoort","merk","handelsbenaming","vervaldatum_apk","datum_tenaamstelling","bruto_bpm","inrichting","aantal_zitplaatsen","eerste_kleur","tweede_kleur","aantal_cilinders","cilinderinhoud","massa_ledig_voertuig","toegestane_maximum_massa_voertuig","massa_rijklaar","maximum_massa_trekken_ongeremd","maximum_trekken_massa_geremd","datum_eerste_toelating","datum_eerste_tenaamstelling_in_nederland","wacht_op_keuren","catalogusprijs","wam_verzekerd","maximale_constructiesnelheid","laadvermogen","oplegger_geremd","aanhangwagen_autonoom_geremd","aanhangwagen_middenas_geremd","aantal_staanplaatsen","aantal_deuren","aantal_wielen","afstand_hart_koppeling_tot_achterzijde_voertuig","afstand_voorzijde_voertuig_tot_hart_koppeling","afwijkende_maximum_snelheid","lengte","breedte","europese_voertuigcategorie","europese_voertuigcategorie_toevoeging","europese_uitvoeringcategorie_toevoeging","plaats_chassisnummer","technische_max_massa_voertuig","type","type_gasinstallatie","typegoedkeuringsnummer","variant","uitvoering","volgnummer_wijziging_eu_typegoedkeuring","vermogen_massarijklaar","wielbasis","export_indicator","openstaande_terugroepactie_indicator","vervaldatum_tachograaf","taxi_indicator","maximum_massa_samenstelling","aantal_rolstoelplaatsen","maximum_ondersteunende_snelheid","jaar_laatste_registratie_tellerstand","tellerstandoordeel","code_toelichting_tellerstandoordeel","tenaamstellen_mogelijk","vervaldatum_apk_dt","datum_tenaamstelling_dt","datum_eerste_toelating_dt","datum_eerste_tenaamstelling_in_nederland_dt","vervaldatum_tachograaf_dt","maximum_last_onder_de_vooras_sen_tezamen_koppeling","type_remsysteem_voertuig_code","rupsonderstelconfiguratiecode","wielbasis_voertuig_minimum","wielbasis_voertuig_maximum","lengte_voertuig_minimum","lengte_voertuig_maximum","breedte_voertuig_minimum","breedte_voertuig_maximum","hoogte_voertuig","hoogte_voertuig_minimum","hoogte_voertuig_maximum","massa_bedrijfsklaar_minimaal","massa_bedrijfsklaar_maximaal","technisch_toelaatbaar_massa_koppelpunt","maximum_massa_technisch_maximaal","maximum_massa_technisch_minimaal","subcategorie_nederland","verticale_belasting_koppelpunt_getrokken_voertuig","zuinigheidsclassificatie","registratie_datum_goedkeuring_afschrijvingsmoment_bpm","registratie_datum_goedkeuring_afschrijvingsmoment_bpm_dt","gem_lading_wrde","aerodyn_voorz","massa_alt_aandr","verl_cab_ind","api_gekentekende_voertuigen_assen","api_gekentekende_voertuigen_brandstof","api_gekentekende_voertuigen_carrosserie","api_gekentekende_voertuigen_carrosserie_specifiek","api_gekentekende_voertuigen_voertuigklasse"
"L672XH","Personenauto","MERCEDES-BENZ","GLC 250 D 4MATIC","20230518",,"6994","hatchback","5","GRIJS","Niet geregistreerd","4","2143","1775","2540","1875","750","2170","20180625","20210813","Geen verstrekking in Open Data","95848","Nee","222",,,,,,"5","4","0","0",,"0","0","M1",,,,"2540","204 X",,"e1*2001/116*0480*27","R804P1","CZAA053A","0","0.08","287","Ja","Nee",,"Nee","4810","0","0.00","2022","Geen oordeel","05","Nee","2023-05-18T00:00:00.000",,"2018-06-25T00:00:00.000","2021-08-13T00:00:00.000",,,,,,,,,,,,,,,,,,,,,,,,,,,,"https://opendata.rdw.nl/resource/3huj-srit.json","https://opendata.rdw.nl/resource/8ys7-d773.json","https://opendata.rdw.nl/resource/vezc-m2t6.json","https://opendata.rdw.nl/resource/jhie-znh9.json","https://opendata.rdw.nl/resource/kmfi-hrps.json"
"NG389R","Personenauto","MERCEDES-BENZ","GLC 250 D 4MATIC","20240207",,"12147","hatchback","5","BLAUW","Niet geregistreerd","4","2143","1745","2520","1845","750","2500","20170128","20170128","Geen verstrekking in Open Data","79445","Nee",,,,,,,"5","4","0","0",,"474","193","M1",,,"onder r. voorzitting","2520","204 X",,"e1*2001/116*0480*22","R804P1","CZAA0501","0","0.08","287","Ja","Nee",,"Nee","5120","0","0.00","2024","Logisch","00","Nee","2024-02-07T00:00:00.000",,"2017-01-28T00:00:00.000","2017-01-28T00:00:00.000",,,,,,,,,,,"163",,,,,,,,,,"D",,,,,,,"https://opendata.rdw.nl/resource/3huj-srit.json","https://opendata.rdw.nl/resource/8ys7-d773.json","https://opendata.rdw.nl/resource/vezc-m2t6.json","https://opendata.rdw.nl/resource/jhie-znh9.json","https://opendata.rdw.nl/resource/kmfi-hrps.json"
"NN896G","Personenauto","MERCEDES-BENZ","GLC 250 D 4MATIC","20240715","20240314","14927","hatchback","5","GRIJS","Niet geregistreerd","4","2143","1745","2520","1845","750","2500","20170310","20170310","Geen verstrekking in Open Data","82909","Ja",,,,,,,"5","4","0","0",,"474","193","M1",,,"onder r. voorzitting","2520","204 X",,"e1*2001/116*0480*22","R804P1","CZAA0514","0","0.08","287","Ja","Nee",,"Nee","5120","0","0.00","2024","Logisch","00","Nee","2024-07-15T00:00:00.000","2024-03-14T00:00:00.000","2017-03-10T00:00:00.000","2017-03-10T00:00:00.000",,,,,,,,,,,"163",,,,,,,,,,"E",,,,,,,"https://opendata.rdw.nl/resource/3huj-srit.json","https://opendata.rdw.nl/resource/8ys7-d773.json","https://opendata.rdw.nl/resource/vezc-m2t6.json","https://opendata.rdw.nl/resource/jhie-znh9.json","https://opendata.rdw.nl/resource/kmfi-hrps.json"
"NT994N","Personenauto","MERCEDES-BENZ","GLC 250 D 4MATIC","20240109",,"9864","hatchback","5","GRIJS","Niet geregistreerd","4","2143","1745","2520","1845","750","2500","20161123","20170505","Geen verstrekking in Open Data","80927","Nee",,,,,,,"5","4","0","0",,"0","0","M1",,,"by r. voorzitting","2520","204 X",,"e1*2001/116*0480*21","R804P1","CZAA0514","0","0.08","287","Ja","Nee",,"Nee","5120","0","0.00","2023","Geen oordeel","05","Nee","2024-01-09T00:00:00.000",,"2016-11-23T00:00:00.000","2017-05-05T00:00:00.000",,,,,,,,,,,,,,,,,,,,,"E",,,,,,,"https://opendata.rdw.nl/resource/3huj-srit.json","https://opendata.rdw.nl/resource/8ys7-d773.json","https://opendata.rdw.nl/resource/vezc-m2t6.json","https://opendata.rdw.nl/resource/jhie-znh9.json","https://opendata.rdw.nl/resource/kmfi-hrps.json"
"NV048H","Personenauto","MERCEDES-BENZ","GLC 250 D 4MATIC","20230629",,"14927","hatchback","5","ZWART","Niet geregistreerd","4","2143","1745","2520","1845","750","2500","20170428","20170428","Geen verstrekking in Open Data","94899","Nee",,,,,,,"5","4","0","0",,"474","193","M1",,,"onder r. voorzitting","2520","204 X",,"e1*2001/116*0480*22","R804P1","CZAA0514","0","0.08","287","Ja","Nee",,"Nee","5120","0","0.00","2023","Logisch","00","Nee","2023-06-29T00:00:00.000",,"2017-04-28T00:00:00.000","2017-04-28T00:00:00.000",,,,,,,,,,,"163",,,,,,,,,,"E",,,,,,,"https://opendata.rdw.nl/resource/3huj-srit.json","https://opendata.rdw.nl/resource/8ys7-d773.json","https://opendata.rdw.nl/resource/vezc-m2t6.json","https://opendata.rdw.nl/resource/jhie-znh9.json","https://opendata.rdw.nl/resource/kmfi-hrps.json"
"PF665R","Personenauto","MERCEDES-BENZ","GLC 250 D 4MATIC","20230628",,"12147","hatchback","5","BLAUW","Niet geregistreerd","4","2143","1745","2520","1845","750","2500","20170621","20170621","Geen verstrekking in Open Data","79174","Nee",,,,,,,"5","4","0","0",,"474","193","M1",,,"onder r. voorzitting","2520","204 X",,"e1*2001/116*0480*23","R804P1","CZAA0501","0","0.08","287","Ja","Nee",,"Nee","5120","0","0.00","2023","Logisch","00","Nee","2023-06-28T00:00:00.000",,"2017-06-21T00:00:00.000","2017-06-21T00:00:00.000",,,,,,,,,,,"163",,,,,,,,,,"D",,,,,,,"https://opendata.rdw.nl/resource/3huj-srit.json","https://opendata.rdw.nl/resource/8ys7-d773.json","https://opendata.rdw.nl/resource/vezc-m2t6.json","https://opendata.rdw.nl/resource/jhie-znh9.json","https://opendata.rdw.nl/resource/kmfi-hrps.json"
"PS053Z","Personenauto","MERCEDES-BENZ","GLC 250 D 4MATIC","20231224",,"14927","hatchback","5","ZWART","Niet geregistreerd","4","2143","1745","2520","1845","750","2500","20170923","20170923","Geen verstrekking in Open Data","85486","Nee",,,,,,,"5","4","0","0",,"474","193","M1",,,"onder r. voorzitting","2520","204 X",,"e1*2001/116*0480*23","R804P1","CZAA0514","0","0.08","287","Ja","Nee",,"Nee","5120","0","0.00","2023","Logisch","00","Nee","2023-12-24T00:00:00.000",,"2017-09-23T00:00:00.000","2017-09-23T00:00:00.000",,,,,,,,,,,"163",,,,,,,,,,"E",,,,,,,"https://opendata.rdw.nl/resource/3huj-srit.json","https://opendata.rdw.nl/resource/8ys7-d773.json","https://opendata.rdw.nl/resource/vezc-m2t6.json","https://opendata.rdw.nl/resource/jhie-znh9.json","https://opendata.rdw.nl/resource/kmfi-hrps.json"
"R521XT","Personenauto","MERCEDES-BENZ","GLC 250 D 4MATIC",,,,"hatchback","5","ZWART","Niet geregistreerd","4","2143","1745","2520","1845","750","2500","20180601",,"Geen verstrekking in Open Data",,"Nee","222",,,,,,"5","4",,,,,,"M1",,,"by r. voorzitting","2520","204 X",,"e1*2001/116*0480*23",,,,"0.08","287","Ja","Ja",,"Nee","5120",,,,"Niet geregistreerd","NG","Nee",,,"2018-06-01T00:00:00.000",,,,,,,,,,,,,,,,,,,,,,,"20221214","2022-12-14T00:00:00.000",,,,,"https://opendata.rdw.nl/resource/3huj-srit.json","https://opendata.rdw.nl/resource/8ys7-d773.json","https://opendata.rdw.nl/resource/vezc-m2t6.json","https://opendata.rdw.nl/resource/jhie-znh9.json","https://opendata.rdw.nl/resource/kmfi-hrps.json"
"RD847K","Personenauto","MERCEDES-BENZ","GLC 250 D 4MATIC","20240119",,"14927","hatchback","5","GRIJS","Niet geregistreerd","4","2143","1745","2520","1845","750","2500","20171027","20171027","Geen verstrekking in Open Data","86867","Ja",,,,,,,"5","4","0","0",,"474","193","M1",,,"onder r. voorzitting","2520","204 X",,"e1*2001/116*0480*23","R804P1","CZAA0514","0","0.08","287","Ja","Nee",,"Nee","5120","0","0.00","2023","Logisch","00","Nee","2024-01-19T00:00:00.000",,"2017-10-27T00:00:00.000","2017-10-27T00:00:00.000",,,,,,,,,,,"163",,,,,,,,,,"E",,,,,,,"https://opendata.rdw.nl/resource/3huj-srit.json","https://opendata.rdw.nl/resource/8ys7-d773.json","https://opendata.rdw.nl/resource/vezc-m2t6.json","https://opendata.rdw.nl/resource/jhie-znh9.json","https://opendata.rdw.nl/resource/kmfi-hrps.json"
"RR106L","Personenauto","MERCEDES-BENZ","GLC 250 D 4MATIC","20230704",,"14927","hatchback","5","GRIJS","Niet geregistreerd","4","2143","1745","2520","1845","750","2500","20180112","20180112","Geen verstrekking in Open Data","92777","Nee",,,,,,,"5","4","0","0",,"474","193","M1",,,"onder r. voorzitting","2520","204 X",,"e1*2001/116*0480*23","R804P1","CZAA0514","0","0.08","287","Ja","Nee",,"Nee","5120","0","0.00","2023","Logisch","00","Nee","2023-07-04T00:00:00.000",,"2018-01-12T00:00:00.000","2018-01-12T00:00:00.000",,,,,,,,,,,"163",,,,,,,,,,"F",,,,,,,"https://opendata.rdw.nl/resource/3huj-srit.json","https://opendata.rdw.nl/resource/8ys7-d773.json","https://opendata.rdw.nl/resource/vezc-m2t6.json","https://opendata.rdw.nl/resource/jhie-znh9.json","https://opendata.rdw.nl/resource/kmfi-hrps.json"
"RV034T","Personenauto","MERCEDES-BENZ","GLC 250 D 4MATIC","20240616","20180209","11527","hatchback","5","BLAUW","Niet geregistreerd","4","2143","1745","2520","1845","750","2500","20170616","20180209","Geen verstrekking in Open Data","87589","Nee",,,,,,,"5","4","0","0",,"0","0","M1",,,"r. bodemplaat by voorzitting","2520","204 X",,"e1*2001/116*0480*22","R804P1","CZAA0514","0","0.08","287","Ja","Nee",,"Nee","5120","0","0.00","2024","Geen oordeel","05","Nee","2024-06-16T00:00:00.000","2018-02-09T00:00:00.000","2017-06-16T00:00:00.000","2018-02-09T00:00:00.000",,,,,,,,,,,,,,,,,,,,,"E",,,,,,,"https://opendata.rdw.nl/resource/3huj-srit.json","https://opendata.rdw.nl/resource/8ys7-d773.json","https://opendata.rdw.nl/resource/vezc-m2t6.json","https://opendata.rdw.nl/resource/jhie-znh9.json","https://opendata.rdw.nl/resource/kmfi-hrps.json"
"RX486B","Personenauto","MERCEDES-BENZ","GLC 250 D 4MATIC","20240202",,"10814","hatchback","5","GRIJS","Niet geregistreerd","4","2143","1745","2520","1845","750","2500","20170427","20180215","Geen verstrekking in Open Data","91567","Nee",,,,,,,"5","4","0","0",,"0","0","M1",,,"by r. voorzitting","2520","204 X",,"e1*2001/116*0480*22","R804P1","CZAA0514","0","0.08","287","Ja","Nee",,"Nee","5120","0","0.00","2023","Geen oordeel","05","Nee","2024-02-02T00:00:00.000",,"2017-04-27T00:00:00.000","2018-02-15T00:00:00.000",,,,,,,,,,,,,,,,,,,,,"E",,,,,,,"https://opendata.rdw.nl/resource/3huj-srit.json","https://opendata.rdw.nl/resource/8ys7-d773.json","https://opendata.rdw.nl/resource/vezc-m2t6.json","https://opendata.rdw.nl/resource/jhie-znh9.json","https://opendata.rdw.nl/resource/kmfi-hrps.json"
"SF269S","Personenauto","MERCEDES-BENZ","GLC 250 D 4MATIC","20240121",,"12605","hatchback","5","ZWART","Niet geregistreerd","4","2143","1745","2520","1845","750","2500","20180323","20180323","Geen verstrekking in Open Data","82736","Nee",,,,,,,"5","4","0","0",,"474","193","M1",,,"onder r. voorzitting","2520","204 X",,"e1*2001/116*0480*23","R804P1","CZAA0501","0","0.08","287","Ja","Nee",,"Nee","5120","0","0.00","2023","Logisch","00","Nee","2024-01-21T00:00:00.000",,"2018-03-23T00:00:00.000","2018-03-23T00:00:00.000",,,,,,,,,,,"163",,,,,,,,,,"E",,,,,,,"https://opendata.rdw.nl/resource/3huj-srit.json","https://opendata.rdw.nl/resource/8ys7-d773.json","https://opendata.rdw.nl/resource/vezc-m2t6.json","https://opendata.rdw.nl/resource/jhie-znh9.json","https://opendata.rdw.nl/resource/kmfi-hrps.json"
"SF298S","Personenauto","MERCEDES-BENZ","GLC 250 D 4MATIC","20231025",,"15322","hatchback","5","BLAUW","Niet geregistreerd","4","2143","1745","2520","1845","750","2500","20180326","20180326","Geen verstrekking in Open Data","88641","Nee",,,,,,,"5","4","0","0",,"474","193","M1",,,"onder r. voorzitting","2520","204 X",,"e1*2001/116*0480*23","R804P1","CZAA0514","0","0.08","287","Ja","Ja",,"Nee","5120","0","0.00","2022","Logisch","00","Nee","2023-10-25T00:00:00.000",,"2018-03-26T00:00:00.000","2018-03-26T00:00:00.000",,,,,,,,,,,"163",,,,,,,,,,"F",,,,,,,"https://opendata.rdw.nl/resource/3huj-srit.json","https://opendata.rdw.nl/resource/8ys7-d773.json","https://opendata.rdw.nl/resource/vezc-m2t6.json","https://opendata.rdw.nl/resource/jhie-znh9.json","https://opendata.rdw.nl/resource/kmfi-hrps.json"
"SG395V","Personenauto","MERCEDES-BENZ","GLC 250 D 4MATIC","20240501",,"15322","hatchback","5","ZWART","Niet geregistreerd","4","2143","1745","2520","1845","750","2500","20180330","20180330","Geen verstrekking in Open Data","86197","Nee",,,,,,,"5","4","0","0",,"474","193","M1",,,"onder r. voorzitting","2520","204 X",,"e1*2001/116*0480*23","R804P1","CZAA0514","0","0.08","287","Ja","Nee",,"Nee","5120","0","0.00","2023","Logisch","00","Nee","2024-05-01T00:00:00.000",,"2018-03-30T00:00:00.000","2018-03-30T00:00:00.000",,,,,,,,,,,"163",,,,,,,,,,"F",,,,,,,"https://opendata.rdw.nl/resource/3huj-srit.json","https://opendata.rdw.nl/resource/8ys7-d773.json","https://opendata.rdw.nl/resource/vezc-m2t6.json","https://opendata.rdw.nl/resource/jhie-znh9.json","https://opendata.rdw.nl/resource/kmfi-hrps.json"
"TB633Z","Personenauto","MERCEDES-BENZ","GLC 250 D 4MATIC","20230706",,"20927","hatchback","5","ZWART","Niet geregistreerd","4","2143","1775","2540","1875","750","2500","20180706","20180706","Geen verstrekking in Open Data","82618","Nee",,,,,,,"5","4","0","0",,"0","0","M1",,,,"2540","204 X",,"e1*2001/116*0480*27","R804P1","CZAA050A","0","0.08","287","Ja","Nee",,"Nee","5140","0","0.00","2022","Logisch","00","Nee","2023-07-06T00:00:00.000",,"2018-07-06T00:00:00.000","2018-07-06T00:00:00.000",,,,,,,,,,,,,,,,,,,,,,,,,,,,"https://opendata.rdw.nl/resource/3huj-srit.json","https://opendata.rdw.nl/resource/8ys7-d773.json","https://opendata.rdw.nl/resource/vezc-m2t6.json","https://opendata.rdw.nl/resource/jhie-znh9.json","https://opendata.rdw.nl/resource/kmfi-hrps.json"
"TD067L","Personenauto","MERCEDES-BENZ","GLC 250 D 4MATIC","20230710",,"21789","hatchback","5","GRIJS","Niet geregistreerd","4","2143","1775","2540","1875","750","2500","20180710","20180710","Geen verstrekking in Open Data","86705","Nee",,,,,,,"5","4","0","0",,"475","193","M1",,,,"2540","204 X",,"e1*2001/116*0480*27","R804P1","CZAA050A","0","0.08","287","Ja","Nee",,"Nee","5140","0","0.00","2023","Logisch","00","Nee","2023-07-10T00:00:00.000",,"2018-07-10T00:00:00.000","2018-07-10T00:00:00.000",,,,,,,,,,,"163",,,,,,,,,,,,,,,,,"https://opendata.rdw.nl/resource/3huj-srit.json","https://opendata.rdw.nl/resource/8ys7-d773.json","https://opendata.rdw.nl/resource/vezc-m2t6.json","https://opendata.rdw.nl/resource/jhie-znh9.json","https://opendata.rdw.nl/resource/kmfi-hrps.json"
