"kenteken","voertuigsoort","merk","handelsbenaming","vervaldatum_apk","datum_tenaamstelling","bruto_bpm","inrichting","aantal_zitplaatsen","eerste_kleur","tweede_kleur","aantal_cilinders","cilinderinhoud","massa_ledig_voertuig","toegestane_maximum_massa_voertuig","massa_rijklaar","maximum_massa_trekken_ongeremd","maximum_trekken_massa_geremd","datum_eerste_toelating","datum_eerste_tenaamstelling_in_nederland","wacht_op_keuren","catalogusprijs","wam_verzekerd","maximale_constructiesnelheid","laadvermogen","oplegger_geremd","aanhangwagen_autonoom_geremd","aanhangwagen_middenas_geremd","aantal_staanplaatsen","aantal_deuren","aantal_wielen","afstand_hart_koppeling_tot_achterzijde_voertuig","afstand_voorzijde_voertuig_tot_hart_koppeling","afwijkende_maximum_snelheid","lengte","breedte","europese_voertuigcategorie","europese_voertuigcategorie_toevoeging","europese_uitvoeringcategorie_toevoeging","plaats_chassisnummer","technische_max_massa_voertuig","type","type_gasinstallatie","typegoedkeuringsnummer","variant","uitvoering","volgnummer_wijziging_eu_typegoedkeuring","vermogen_massarijklaar","wielbasis","export_indicator","openstaande_terugroepactie_indicator","vervaldatum_tachograaf","taxi_indicator","maximum_massa_samenstelling","aantal_rolstoelplaatsen","maximum_ondersteunende_snelheid","jaar_laatste_registratie_tellerstand","tellerstandoordeel","code_toelichting_tellerstandoordeel","tenaamstellen_mogelijk","vervaldatum_apk_dt","datum_tenaamstelling_dt","datum_eerste_toelating_dt","datum_eerste_tenaamstelling_in_nederland_dt","vervaldatum_tachograaf_dt","maximum_last_onder_de_vooras_sen_tezamen_koppeling","type_remsysteem_voertuig_code","rupsonderstelconfiguratiecode","wielbasis_voertuig_minimum","wielbasis_voertuig_maximum","lengte_voertuig_minimum","lengte_voertuig_maximum","breedte_voertuig_minimum","breedte_voertuig_maximum","hoogte_voertuig","hoogte_voertuig_minimum","hoogte_voertuig_maximum","massa_bedrijfsklaar_minimaal","massa_bedrijfsklaar_maximaal","technisch_toelaatbaar_massa_koppelpunt","maximum_massa_technisch_maximaal","maximum_massa_technisch_minimaal","subcategorie_nederland","verticale_belasting_koppelpunt_getrokken_voertuig","zuinigheidsclassificatie","registratie_datum_goedkeuring_afschrijvingsmoment_bpm","registratie_datum_goedkeuring_afschrijvingsmoment_bpm_dt","gem_lading_wrde","aerodyn_voorz","massa_alt_aandr","verl_cab_ind","api_gekentekende_voertuigen_assen","api_gekentekende_voertuigen_brandstof","api_gekentekende_voertuigen_carrosserie","api_gekentekende_voertuigen_carrosserie_specifiek","api_gekentekende_voertuigen_voertuigklasse"
"H420LB","Personenauto","MERCEDES-BENZ","C 220 D","20221008",,"3209","coupe","4","ROOD","Niet geregistreerd","4","2143","1515","2095","1615","750","1800","20170914","20200309","Geen verstrekking in Open Data","65477","Nee","234",,,,,,"2","4",,,,,,"M1",,,"r. bodemplaat by voorzitting","2095","204",,"e1*2001/116*0431*44","R30RP0","CZAA0474","0","0.08","284","Ja","Nee",,"Nee","3965",,,"2022","Geen oordeel","05","Nee","2022-10-08T00:00:00.000",,"2017-09-14T00:00:00.000","2020-03-09T00:00:00.000",,,,,,,,,,,,,,,,,,,,,"E",,,,,,,"https://opendata.rdw.nl/resource/3huj-srit.json","https://opendata.rdw.nl/resource/8ys7-d773.json","https://opendata.rdw.nl/resource/vezc-m2t6.json","https://opendata.rdw.nl/resource/jhie-znh9.json","https://opendata.rdw.nl/resource/kmfi-hrps.json"
"H751LP","Personenauto","MERCEDES-BENZ","E 220 D",,,"13707","coupe","4","GRIJS","Niet geregistreerd","4","1950","1690","2320","1790","750","1800","20200323","20200323","Geen verstrekking in Open Data","80535","Nee","242",,,,,,"2","4","0","0",,"486","186","M1",,,,"2320","R1EC",,"e1*2007/46*1666*16","T314T0","CZAA04AA","0","0.08","287","Ja","Nee",,"Nee","4190","0","0.00","2022","Logisch","00","Nee",,,"2020-03-23T00:00:00.000","2020-03-23T00:00:00.000",,,,,,,,,,,"146",,,,,,,,,,"D",,,,,,,"https://opendata.rdw.nl/resource/3huj-srit.json","https://opendata.rdw.nl/resource/8ys7-d773.json","https://opendata.rdw.nl/resource/vezc-m2t6.json","https://opendata.rdw.nl/resource/jhie-znh9.json","https://opendata.rdw.nl/resource/kmfi-hrps.json"
"H963HV","Personenauto","MERCEDES-BENZ","E 220 D","20240804","20240410","9367","coupe","4","GROEN","Niet geregistreerd","4","1950","1635","2300","1735","750","1800","20170504","20200707","Geen verstrekking in Open Data","63066","Ja","242",,,,,,"2","4","0","0",,"0","186","M1",,,,"2300","R1EC",,"e1*2007/46*1666*00","T314P0","CZAA14A2","1","0.08","287","Ja","Ja",,"Nee","4170","0","0.00","2024","Geen oordeel","05","Nee","2024-08-04T00:00:00.000","2024-04-10T00:00:00.000","2017-05-04T00:00:00.000","2020-07-07T00:00:00.000",,,,,,,,,,,,,,,,,,,,,"C",,,,,,,"https://opendata.rdw.nl/resource/3huj-srit.json","https://opendata.rdw.nl/resource/8ys7-d773.json","https://opendata.rdw.nl/resource/vezc-m2t6.json","https://opendata.rdw.nl/resource/jhie-znh9.json","https://opendata.rdw.nl/resource/kmfi-hrps.json"
"J315DK","Personenauto","MERCEDES-BENZ","C 220 D","20221005",,"3567","coupe","4","BLAUW","Niet geregistreerd","4","2143","1505","2085","1605","750","1800","20180309","20201006","Geen verstrekking in Open Data","53494","Nee","234",,,,,,"2","4",,,,,,"M1",,,,"2085","204",,"e1*2001/116*0431*44","R30RP0","EZAA0401","0","0.08","284","Ja","Ja",,"Nee","3955",,,"2022","Geen oordeel","05","Nee","2022-10-05T00:00:00.000",,"2018-03-09T00:00:00.000","2020-10-06T00:00:00.000",,,,,,,,,,,,,,,,,,,,,"D",,,,,,,"https://opendata.rdw.nl/resource/3huj-srit.json","https://opendata.rdw.nl/resource/8ys7-d773.json","https://opendata.rdw.nl/resource/vezc-m2t6.json","https://opendata.rdw.nl/resource/jhie-znh9.json","https://opendata.rdw.nl/resource/kmfi-hrps.json"
"JB183J","Personenauto","MERCEDES-BENZ","C 220 D","20230318",,"5882","coupe","4","GRIJS","Niet geregistreerd","4","2143","1515","2095","1615","750","1800","20160203","20160203","Geen verstrekking in Open Data","59598","Nee",,,,,,,"2","4","0","0",,"475","190","M1",,,"onder r. voorzitting","2095","204",,"e1*2001/116*0431*37","R30RP0","CZAA0401","0","0.08","284","Ja","Nee",,"Nee","3965","0","0.00","2023","Logisch","00","Nee","2023-03-18T00:00:00.000",,"2016-02-03T00:00:00.000","2016-02-03T00:00:00.000",,,,,,,,,,,"143",,,,,,,,,,"D",,,,,,,"https://opendata.rdw.nl/resource/3huj-srit.json","https://opendata.rdw.nl/resource/8ys7-d773.json","https://opendata.rdw.nl/resource/vezc-m2t6.json","https://opendata.rdw.nl/resource/jhie-znh9.json","https://opendata.rdw.nl/resource/kmfi-hrps.json"
"JK504G","Personenauto","MERCEDES-BENZ","C 220 D","20230603",,"7355","coupe","4","ZWART","Niet geregistreerd","4","2143","1515","2095","1615","750","1800","20160502","20160502","Geen verstrekking in Open Data","66426","Nee",,,,,,,"2","4","0","0",,"0","0","M1",,,"op dwarsbalk v. r. voorzitting","2095","204",,"e1*2001/116*0431*38","R30QP0","CZAA0414","0","0.07","284","Ja","Nee",,"Nee","3965","0","0.00","2022","Logisch","00","Nee","2023-06-03T00:00:00.000",,"2016-05-02T00:00:00.000","2016-05-02T00:00:00.000",,,,,,,,,,,,,,,,,,,,,"D",,,,,,,"https://opendata.rdw.nl/resource/3huj-srit.json","https://opendata.rdw.nl/resource/8ys7-d773.json","https://opendata.rdw.nl/resource/vezc-m2t6.json","https://opendata.rdw.nl/resource/jhie-znh9.json","https://opendata.rdw.nl/resource/kmfi-hrps.json"
"JK576H","Personenauto","MERCEDES-BENZ","C 220 D","20230413",,"6514","coupe","4","GRIJS","Niet geregistreerd","4","2143","1515","2095","1615","750","1800","20160413","20160413","Geen verstrekking in Open Data","64653","Nee",,,,,,,"2","4","0","0",,"0","0","M1",,,"onder r. voorzitting","2095","204",,"e1*2001/116*0431*38","R30RP0","CZAA0402","0","0.08","284","Ja","Nee",,"Nee","3965","0","0.00","2022","Logisch","00","Nee","2023-04-13T00:00:00.000",,"2016-04-13T00:00:00.000","2016-04-13T00:00:00.000",,,,,,,,,,,,,,,,,,,,,"D",,,,,,,"https://opendata.rdw.nl/resource/3huj-srit.json","https://opendata.rdw.nl/resource/8ys7-d773.json","https://opendata.rdw.nl/resource/vezc-m2t6.json","https://opendata.rdw.nl/resource/jhie-znh9.json","https://opendata.rdw.nl/resource/kmfi-hrps.json"
"JP232N","Personenauto","MERCEDES-BENZ","C 220 D","20220614",,"5882","coupe","4","WIT","Niet geregistreerd","4","2143","1515","2095","1615","750","1800","20160520","20160520","Geen verstrekking in Open Data","57686","Nee",,,,,,,"2","4","0","0",,"0","0","M1",,,"onder r. voorzitting","2095","204",,"e1*2001/116*0431*38","R30RP0","CZAA0401","0","0.08","284","Ja","Nee",,"Nee","3965","0","0.00","2022","Logisch","00","Nee","2022-06-14T00:00:00.000",,"2016-05-20T00:00:00.000","2016-05-20T00:00:00.000",,,,,,,,,,,,,,,,,,,,,"D",,,,,,,"https://opendata.rdw.nl/resource/3huj-srit.json","https://opendata.rdw.nl/resource/8ys7-d773.json","https://opendata.rdw.nl/resource/vezc-m2t6.json","https://opendata.rdw.nl/resource/jhie-znh9.json","https://opendata.rdw.nl/resource/kmfi-hrps.json"
"JS605F","Personenauto","MERCEDES-BENZ","C 220 D","20230713",,"5293","coupe","4","WIT","Niet geregistreerd","4","2143","1515","2095","1615","750","1800","20160111","20160603","Geen verstrekking in Open Data","60831","Nee",,,,,,,"2","4","0","0",,"0","0","M1",,,"op dwarsbalk v. r. voorzitting","2095","204",,"e1*2001/116*0431*37","R30RP0","CZAA0474","0","0.08","284","Ja","Nee",,"Nee","3965","0","0.00","2023","Geen oordeel","05","Nee","2023-07-13T00:00:00.000",,"2016-01-11T00:00:00.000","2016-06-03T00:00:00.000",,,,,,,,,,,,,,,,,,,,,"D",,,,,,,"https://opendata.rdw.nl/resource/3huj-srit.json","https://opendata.rdw.nl/resource/8ys7-d773.json","https://opendata.rdw.nl/resource/vezc-m2t6.json","https://opendata.rdw.nl/resource/jhie-znh9.json","https://opendata.rdw.nl/resource/kmfi-hrps.json"
"K862XH","Personenauto","MERCEDES-BENZ","C 220 D","20240401",,"7050","coupe","4","GRIJS","Niet geregistreerd","4","2143","1515","2095","1615","750","1800","20170111","20210322","Geen verstrekking in Open Data","48549","Nee","231",,,,,,"2","4","0","0",,"0","0","M1",,,,"2095","204",,"e1*2001/116*0431*39","R30QP0","CZAZ0472","0","0.07","284","Ja","Nee",,"Nee","3965","0","0.00","2023","Niet geregistreerd","NG","Nee","2024-04-01T00:00:00.000",,"2017-01-11T00:00:00.000","2021-03-22T00:00:00.000",,,,,,,,,,,,,,,,,,,,,"D",,,,,,,"https://opendata.rdw.nl/resource/3huj-srit.json","https://opendata.rdw.nl/resource/8ys7-d773.json","https://opendata.rdw.nl/resource/vezc-m2t6.json","https://opendata.rdw.nl/resource/jhie-znh9.json","https://opendata.rdw.nl/resource/kmfi-hrps.json"
"KH267K","Personenauto","MERCEDES-BENZ","C 220 D","20241229","20240410","6078","coupe","4","ZWART","Niet geregistreerd","4","2143","1515","2095","1615","750","1800","20160202","20160905","Geen verstrekking in Open Data","51138","Ja",,,,,,,"2","4","0","0",,"0","0","M1",,,"r. bodemplaat by voorzitting","2095","204",,"e1*2001/116*0431*37","R30RP0","CZAA0474","0","0.08","284","Ja","Nee",,"Nee","3965","0","0.00","2024","Geen oordeel","05","Nee","2024-12-29T00:00:00.000","2024-04-10T00:00:00.000","2016-02-02T00:00:00.000","2016-09-05T00:00:00.000",,,,,,,,,,,,,,,,,,,,,"D",,,,,,,"https://opendata.rdw.nl/resource/3huj-srit.json","https://opendata.rdw.nl/resource/8ys7-d773.json","https://opendata.rdw.nl/resource/vezc-m2t6.json","https://opendata.rdw.nl/resource/jhie-znh9.json","https://opendata.rdw.nl/resource/kmfi-hrps.json"
"KH501N","Personenauto","MERCEDES-BENZ","C 220 D","20231010",,"7355","coupe","4","BLAUW","Niet geregistreerd","4","2143","1505","2085","1605","750","1800","20160923","20160923","Geen verstrekking in Open Data","56933","Nee",,,,,,,"2","4","0","0",,"475","190","M1",,,"onder r. voorzitting","2085","204",,"e1*2001/116*0431*37","R30RP0","EZAA0412","0","0.08","284","Ja","Nee",,"Nee","3955","0","0.00","2023","Logisch","00","Nee","2023-10-10T00:00:00.000",,"2016-09-23T00:00:00.000","2016-09-23T00:00:00.000",,,,,,,,,,,"143",,,,,,,,,,"D",,,,,,,"https://opendata.rdw.nl/resource/3huj-srit.json","https://opendata.rdw.nl/resource/8ys7-d773.json","https://opendata.rdw.nl/resource/vezc-m2t6.json","https://opendata.rdw.nl/resource/jhie-znh9.json","https://opendata.rdw.nl/resource/kmfi-hrps.json"
"KJ543Z","Personenauto","MERCEDES-BENZ","C 220 D","20231127",,"5882","coupe","4","GRIJS","Niet geregistreerd","4","2143","1515","2095","1615","750","1800","20161027","20161027","Geen verstrekking in Open Data","57845","Nee",,,,,,,"2","4","0","0",,"476","188","M1",,,"onder r. voorzitting","2095","204",,"e1*2001/116*0431*39","R30RP0","CZAA0401","0","0.08","284","Ja","Nee",,"Nee","3965","0","0.00","2022","Logisch","00","Nee","2023-11-27T00:00:00.000",,"2016-10-27T00:00:00.000","2016-10-27T00:00:00.000",,,,,,,,,,,"142",,,,,,,,,,"D",,,,,,,"https://opendata.rdw.nl/resource/3huj-srit.json","https://opendata.rdw.nl/resource/8ys7-d773.json","https://opendata.rdw.nl/resource/vezc-m2t6.json","https://opendata.rdw.nl/resource/jhie-znh9.json","https://opendata.rdw.nl/resource/kmfi-hrps.json"
"KP984N","Personenauto","MERCEDES-BENZ","C 220 D","20221106",,"7355","coupe","4","ZWART","Niet geregistreerd","4","2143","1515","2095","1615","750","1800","20161104","20161104","Geen verstrekking in Open Data","70172","Nee",,,,,,,"2","4","0","0",,"0","0","M1",,,"onder r. voorzitting","2095","204",,"e1*2001/116*0431*39","R30RP0","CZAA0414","0","0.08","284","Ja","Nee",,"Nee","3965","0","0.00","2022","Logisch","00","Nee","2022-11-06T00:00:00.000",,"2016-11-04T00:00:00.000","2016-11-04T00:00:00.000",,,,,,,,,,,,,,,,,,,,,"D",,,,,,,"https://opendata.rdw.nl/resource/3huj-srit.json","https://opendata.rdw.nl/resource/8ys7-d773.json","https://opendata.rdw.nl/resource/vezc-m2t6.json","https://opendata.rdw.nl/resource/jhie-znh9.json","https://opendata.rdw.nl/resource/kmfi-hrps.json"
"L426RR","Personenauto","MERCEDES-BENZ","C 220 D","20241014",,"1426","coupe","4","WIT","Niet geregistreerd","4","2143","1515","2095","1615","750","1800","20160323","20210712","Geen verstrekking in Open Data","60625","Nee","234",,,,,,"2","4","0","0",,"0","0","M1",,,,"2095","204",,"e1*2001/116*0431*38","R30RP0","CZAA0472","0","0.08","284","Ja","Nee",,"Nee","3965","0","0.00","2023","Geen oordeel","05","Nee","2024-10-14T00:00:00.000",,"2016-03-23T00:00:00.000","2021-07-12T00:00:00.000",,,,,,,,,,,,,,,,,,,,,,,,,,,,"https://opendata.rdw.nl/resource/3huj-srit.json","https://opendata.rdw.nl/resource/8ys7-d773.json","https://opendata.rdw.nl/resource/vezc-m2t6.json","https://opendata.rdw.nl/resource/jhie-znh9.json","https://opendata.rdw.nl/resource/kmfi-hrps.json"
"L605JN","Personenauto","MERCEDES-BENZ","C 220 D","20250208",,"2824","coupe","4","ZWART","Niet geregistreerd","4","2143","1515","2095","1615","750","1800","20170106","20210528","Geen verstrekking in Open Data","50307","Nee","231",,,,,,"2","4","0","0",,"0","0","M1",,,"r. bodemplaat by voorzitting","2095","204",,"e1*2001/116*0431*39","R30QP0","CZAA0472","0","0.07","284","Ja","Nee",,"Nee","3965","0","0.00","2024","Geen oordeel","05","Nee","2025-02-08T00:00:00.000",,"2017-01-06T00:00:00.000","2021-05-28T00:00:00.000",,,,,,,,,,,,,,,,,,,,,,,,,,,,"https://opendata.rdw.nl/resource/3huj-srit.json","https://opendata.rdw.nl/resource/8ys7-d773.json","https://opendata.rdw.nl/resource/vezc-m2t6.json","https://opendata.rdw.nl/resource/jhie-znh9.json","https://opendata.rdw.nl/resource/kmfi-hrps.json"
"N007NV","Personenauto","MERCEDES-BENZ","E 220 D","20240313",,"1811","coupe","4","WIT","Niet geregistreerd","4","1950","1635","2300","1735","750","1800","20170328","20211123","Geen verstrekking in Open Data","77496","Nee","242",,,,,,"2","4","0","0",,"0","186","M1",,,,"2300","R1EC",,"e1*2007/46*1666*00","T314P0","CZAA14A2","1","0.08","287","Ja","Nee",,"Nee","4170","0","0.00","2023","Geen oordeel","05","Nee","2024-03-13T00:00:00.000",,"2017-03-28T00:00:00.000","2021-11-23T00:00:00.000",,,,,,,,,,,,,,,,,,,,,,"20211116","2021-11-16T00:00:00.000",,,,,"https://opendata.rdw.nl/resource/3huj-srit.json","https://opendata.rdw.nl/resource/8ys7-d773.json","https://opendata.rdw.nl/resource/vezc-m2t6.json","https://opendata.rdw.nl/resource/jhie-znh9.json","https://opendata.rdw.nl/resource/kmfi-hrps.json"
"ND615G","Personenauto","MERCEDES-BENZ","C 220 D","20231021",,"7355","coupe","4","GRIJS","Niet geregistreerd","4","2143","1515","2095","1615","750","1800","20160602","20161227","Geen verstrekking in Open Data","51622","Nee",,,,,,,"2","4","0","0",,"0","0","M1",,,"r. bodemplaat by voorzitting","2095","204",,"e1*2001/116*0431*39","R30RP0","CZAZ0474","0","0.08","284","Ja","Nee",,"Nee","3965","0","0.00","2023","Geen oordeel","05","Nee","2023-10-21T00:00:00.000",,"2016-06-02T00:00:00.000","2016-12-27T00:00:00.000",,,,,,,,,,,,,,,,,,,,,"D",,,,,,,"https://opendata.rdw.nl/resource/3huj-srit.json","https://opendata.rdw.nl/resource/8ys7-d773.json","https://opendata.rdw.nl/resource/vezc-m2t6.json","https://opendata.rdw.nl/resource/jhie-znh9.json","https://opendata.rdw.nl/resource/kmfi-hrps.json"
"NG311G","Personenauto","MERCEDES-BENZ","C 220 D","20240112",,"6355","coupe","4","ZWART","Niet geregistreerd","4","2143","1515","2095","1615","750","1800","20170112","20170112","Geen verstrekking in Open Data","55662","Nee",,,,,,,"2","4","0","0",,"476","188","M1",,,"onder r. voorzitting","2095","204",,"e1*2001/116*0431*39","R30RP0","CZAZ0401","0","0.08","284","Ja","Nee",,"Nee","3965","0","0.00","2022","Logisch","00","Nee","2024-01-12T00:00:00.000",,"2017-01-12T00:00:00.000","2017-01-12T00:00:00.000",,,,,,,,,,,"142",,,,,,,,,,"D",,,,,,,"https://opendata.rdw.nl/resource/3huj-srit.json","https://opendata.rdw.nl/resource/8ys7-d773.json","https://opendata.rdw.nl/resource/vezc-m2t6.json","https://opendata.rdw.nl/resource/jhie-znh9.json","https://opendata.rdw.nl/resource/kmfi-hrps.json"
"P470SF","Personenauto","MERCEDES-BENZ","E 220 D",,,"10854","coupe","4","WIT","Niet geregistreerd","4","1950","1690","2320","1790","750","1800","20201001","20220601","Geen verstrekking in Open Data","75958","Nee","242",,,,,,"2","4",,,,,"186","M1",,,,"2320","R1EC",,"e1*2007/46*1666*15","T314T0","CZAA14AA","0","0.08","287","Ja","Ja",,"Nee","4190",,,"2022","Geen oordeel","05","Nee",,,"2020-10-01T00:00:00.000","2022-06-01T00:00:00.000",,,,,,,,,,,,,,,,,,,,,,"20220422","2022-04-22T00:00:00.000",,,,,"https://opendata.rdw.nl/resource/3huj-srit.json","https://opendata.rdw.nl/resource/8ys7-d773.json","https://opendata.rdw.nl/resource/vezc-m2t6.json","https://opendata.rdw.nl/resource/jhie-znh9.json","https://opendata.rdw.nl/resource/kmfi-hrps.json"
"PF443J","Personenauto","MERCEDES-BENZ","C 220 D","20230124",,"4969","coupe","4","ZWART","Niet geregistreerd","4","2143","1515","2095","1615","750","1800","20160915","20180605","Geen verstrekking in Open Data","49888","Nee",,,,,,,"2","4","0","0",,"0","0","M1",,,"r. bodemplaat by voorzitting","2095","204",,"e1*2001/116*0431*39","R30RP0","CZAZ0472","0","0.08","284","Ja","Ja",,"Nee","3965","0","0.00","2023","Geen oordeel","05","Nee","2023-01-24T00:00:00.000",,"2016-09-15T00:00:00.000","2018-06-05T00:00:00.000",,,,,,,,,,,,,,,,,,,,,"D",,,,,,,"https://opendata.rdw.nl/resource/3huj-srit.json","https://opendata.rdw.nl/resource/8ys7-d773.json","https://opendata.rdw.nl/resource/vezc-m2t6.json","https://opendata.rdw.nl/resource/jhie-znh9.json","https://opendata.rdw.nl/resource/kmfi-hrps.json"
"PJ886T","Personenauto","MERCEDES-BENZ","C 220 D","20240113",,"5151","coupe","4","ZWART","Niet geregistreerd","4","2143","1515","2095","1615","750","1800","20170113","20170719","Geen verstrekking in Open Data","58994","Nee",,,,,,,"2","4","0","0",,"0","0","M1",,,"r. bodemplaat by voorzitting","2095","204",,"e1*2001/116*0431*39","R30RP0","CZAA0414","0","0.08","284","Ja","Ja",,"Nee","3965","0","0.00","2023","Geen oordeel","05","Nee","2024-01-13T00:00:00.000",,"2017-01-13T00:00:00.000","2017-07-19T00:00:00.000",,,,,,,,,,,,,,,,,,,,,"D",,,,,,,"https://opendata.rdw.nl/resource/3huj-srit.json","https://opendata.rdw.nl/resource/8ys7-d773.json","https://opendata.rdw.nl/resource/vezc-m2t6.json","https://opendata.rdw.nl/resource/jhie-znh9.json","https://opendata.rdw.nl/resource/kmfi-hrps.json"
"PK464N","Personenauto","MERCEDES-BENZ","E 220 D","20240403",,"6508","coupe","4","GRIJS","Niet geregistreerd","4","1950","1635","2300","1735","750","1800","20170321","20170712","Geen verstrekking in Open Data","73248","Nee",,,,,,,"2","4","0","0",,"0","0","M1",,,"r. voorzitting","2300","R1EC",,"e1*2007/46*1666*00","T314P0","CZAA14A2","0","0.08","287","Ja","Nee",,"Nee","4170","0","0.00","2023","Geen oordeel","05","Nee","2024-04-03T00:00:00.000",,"2017-03-21T00:00:00.000","2017-07-12T00:00:00.000",,,,,,,,,,,,,,,,,,,,,"C",,,,,,,"https://opendata.rdw.nl/resource/3huj-srit.json","https://opendata.rdw.nl/resource/8ys7-d773.json","https://opendata.rdw.nl/resource/vezc-m2t6.json","https://opendata.rdw.nl/resource/jhie-znh9.json","https://opendata.rdw.nl/resource/kmfi-hrps.json"
"PR452T","Personenauto","MERCEDES-BENZ","E 220 D","20230913",,"9367","coupe","4","WIT","Niet geregistreerd","4","1950","1635","2300","1735","750","1800","20170913","20170913","Geen verstrekking in Open Data","89487","Nee",,,,,,,"2","4","0","0",,"485","186","M1",,,"onder r. voorzitting","2300","R1EC",,"e1*2007/46*1666*00","T314P0","CZAA14A2","0","0.08","287","Ja","Nee",,"Nee","4170","0","0.00","2022","Logisch","00","Nee","2023-09-13T00:00:00.000",,"2017-09-13T00:00:00.000","2017-09-13T00:00:00.000",,,,,,,,,,,"146",,,,,,,,,,"C",,,,,,,"https://opendata.rdw.nl/resource/3huj-srit.json","https://opendata.rdw.nl/resource/8ys7-d773.json","https://opendata.rdw.nl/resource/vezc-m2t6.json","https://opendata.rdw.nl/resource/jhie-znh9.json","https://opendata.rdw.nl/resource/kmfi-hrps.json"
"PV948V","Personenauto","MERCEDES-BENZ","C 220 D","20230705",,"4812","coupe","4","ZWART","Niet geregistreerd","4","2143","1515","2095","1615","750","1800","20160624","20171122","Geen verstrekking in Open Data","71384","Nee",,,,,,,"2","4","0","0",,"0","0","M1",,,"op dwarsbalk v. r. voorzitting","2095","204",,"e1*2001/116*0431*39","R30RP0","CZAZ0474","0","0.08","284","Ja","Nee",,"Nee","3965","0","0.00","2022","Geen oordeel","05","Nee","2023-07-05T00:00:00.000",,"2016-06-24T00:00:00.000","2017-11-22T00:00:00.000",,,,,,,,,,,,,,,,,,,,,"D",,,,,,,"https://opendata.rdw.nl/resource/3huj-srit.json","https://opendata.rdw.nl/resource/8ys7-d773.json","https://opendata.rdw.nl/resource/vezc-m2t6.json","https://opendata.rdw.nl/resource/jhie-znh9.json","https://opendata.rdw.nl/resource/kmfi-hrps.json"
"RH321K","Personenauto","MERCEDES-BENZ","E 220 D","20230703",,"2823","coupe","4","GRIJS","Niet geregistreerd","4","1950","1635","2300","1735","750","1800","20170703","20180426","Geen verstrekking in Open Data","72700","Nee",,,,,,,"2","4","0","0",,"0","0","M1",,,"r. voorzitting","2300","R1EC",,"e1*2007/46*1666*00","T314P0","CZAA1401","0","0.08","287","Ja","Ja",,"Nee","4170","0","0.00","2022","Geen oordeel","05","Nee","2023-07-03T00:00:00.000",,"2017-07-03T00:00:00.000","2018-04-26T00:00:00.000",,,,,,,,,,,,,,,,,,,,,"B",,,,,,,"https://opendata.rdw.nl/resource/3huj-srit.json","https://opendata.rdw.nl/resource/8ys7-d773.json","https://opendata.rdw.nl/resource/vezc-m2t6.json","https://opendata.rdw.nl/resource/jhie-znh9.json","https://opendata.rdw.nl/resource/kmfi-hrps.json"
"RK978J","Personenauto","MERCEDES-BENZ","C 220 D","20230922",,"4064","coupe","4","GRIJS","Niet geregistreerd","4","2143","1515","2095","1615","750","1800","20160309","20171214","Geen verstrekking in Open Data","60328","Ja",,,,,,,"2","4","0","0",,"0","0","M1",,,"op dwarsbalk v. r. voorzitting","2095","204",,"e1*2001/116*0431*37","R30RP0","CZAA0474","0","0.08","284","Ja","Ja",,"Nee","3965","0","0.00","2023","Onlogisch","04","Nee","2023-09-22T00:00:00.000",,"2016-03-09T00:00:00.000","2017-12-14T00:00:00.000",,,,,,,,,,,,,,,,,,,,,"D",,,,,,,"https://opendata.rdw.nl/resource/3huj-srit.json","https://opendata.rdw.nl/resource/8ys7-d773.json","https://opendata.rdw.nl/resource/vezc-m2t6.json","https://opendata.rdw.nl/resource/jhie-znh9.json","https://opendata.rdw.nl/resource/kmfi-hrps.json"