"kenteken","voertuigsoort","merk","handelsbenaming","vervaldatum_apk","datum_tenaamstelling","bruto_bpm","inrichting","aantal_zitplaatsen","eerste_kleur","tweede_kleur","aantal_cilinders","cilinderinhoud","massa_ledig_voertuig","toegestane_maximum_massa_voertuig","massa_rijklaar","maximum_massa_trekken_ongeremd","maximum_trekken_massa_geremd","datum_eerste_toelating","datum_eerste_tenaamstelling_in_nederland","wacht_op_keuren","catalogusprijs","wam_verzekerd","maximale_constructiesnelheid","laadvermogen","oplegger_geremd","aanhangwagen_autonoom_geremd","aanhangwagen_middenas_geremd","aantal_staanplaatsen","aantal_deuren","aantal_wielen","afstand_hart_koppeling_tot_achterzijde_voertuig","afstand_voorzijde_voertuig_tot_hart_koppeling","afwijkende_maximum_snelheid","lengte","breedte","europese_voertuigcategorie","europese_voertuigcategorie_toevoeging","europese_uitvoeringcategorie_toevoeging","plaats_chassisnummer","technische_max_massa_voertuig","type","type_gasinstallatie","typegoedkeuringsnummer","variant","uitvoering","volgnummer_wijziging_eu_typegoedkeuring","vermogen_massarijklaar","wielbasis","export_indicator","openstaande_terugroepactie_indicator","vervaldatum_tachograaf","taxi_indicator","maximum_massa_samenstelling","aantal_rolstoelplaatsen","maximum_ondersteunende_snelheid","jaar_laatste_registratie_tellerstand","tellerstandoordeel","code_toelichting_tellerstandoordeel","tenaamstellen_mogelijk","vervaldatum_apk_dt","datum_tenaamstelling_dt","datum_eerste_toelating_dt","datum_eerste_tenaamstelling_in_nederland_dt","vervaldatum_tachograaf_dt","maximum_last_onder_de_vooras_sen_tezamen_koppeling","type_remsysteem_voertuig_code","rupsonderstelconfiguratiecode","wielbasis_voertuig_minimum","wielbasis_voertuig_maximum","lengte_voertuig_minimum","lengte_voertuig_maximum","breedte_voertuig_minimum","breedte_voertuig_maximum","hoogte_voertuig","hoogte_voertuig_minimum","hoogte_voertuig_maximum","massa_bedrijfsklaar_minimaal","massa_bedrijfsklaar_maximaal","technisch_toelaatbaar_massa_koppelpunt","maximum_massa_technisch_maximaal","maximum_massa_technisch_minimaal","subcategorie_nederland","verticale_belasting_koppelpunt_getrokken_voertuig","zuinigheidsclassificatie","registratie_datum_goedkeuring_afschrijvingsmoment_bpm","registratie_datum_goedkeuring_afschrijvingsmoment_bpm_dt","gem_lading_wrde","aerodyn_voorz","massa_alt_aandr","verl_cab_ind","api_gekentekende_voertuigen_assen","api_gekentekende_voertuigen_brandstof","api_gekentekende_voertuigen_carrosserie","api_gekentekende_voertuigen_carrosserie_specifiek","api_gekentekende_voertuigen_voertuigklasse"
"G968BJ","Personenauto","MERCEDES-BENZ","GLA 180 D","20240523",,"4584","stationwagen","5","WIT","Niet geregistreerd","4","1461","1340","1970","1440","720","1200","20180523","20190913","Geen verstrekking in Open Data","48339","Nee","190",,,,,,"5","4","0","0",,"0","180","M1",,,,"1970","245 G",,"e1*2001/116*0470*20","2712P2","AZAA1501","0","0.06","270","Ja","Ja",,"Nee","3205","0","0.00","2023","Geen oordeel","05","Nee","2024-05-23T00:00:00.000",,"2018-05-23T00:00:00.000","2019-09-13T00:00:00.000",,,,,,,,,,,,,,,,,,,,,"D",,,,,,,"https://opendata.rdw.nl/resource/3huj-srit.json","https://opendata.rdw.nl/resource/8ys7-d773.json","https://opendata.rdw.nl/resource/vezc-m2t6.json","https://opendata.rdw.nl/resource/jhie-znh9.json","https://opendata.rdw.nl/resource/kmfi-hrps.json"
"HV031D","Personenauto","MERCEDES-BENZ","GLA 180 D","20241230","20240430","5264","stationwagen","5","ZWART","Niet geregistreerd","4","1461","1340","1960","1440","720","1200","20151230","20151230","Geen verstrekking in Open Data","39709","Ja",,,,,,,"5","4","0","0",,"447","180","M1",,,"onder r. voorzitting","1960","245 G",,"e1*2001/116*0470*15","2712P2","AZAAA501","0","0.06","270","Ja","Nee",,"Nee","3205","0","0.00","2024","Logisch","00","Nee","2024-12-30T00:00:00.000","2024-04-30T00:00:00.000","2015-12-30T00:00:00.000","2015-12-30T00:00:00.000",,,,,,,,,,,"154",,,,,,,,,,"C",,,,,,,"https://opendata.rdw.nl/resource/3huj-srit.json","https://opendata.rdw.nl/resource/8ys7-d773.json","https://opendata.rdw.nl/resource/vezc-m2t6.json","https://opendata.rdw.nl/resource/jhie-znh9.json","https://opendata.rdw.nl/resource/kmfi-hrps.json"
"HV094D","Personenauto","MERCEDES-BENZ","GLA 180 D","20240125",,"5264","stationwagen","5","ZWART","Niet geregistreerd","4","1461","1340","1960","1440","720","1200","20160107","20160107","Geen verstrekking in Open Data","40090","Nee",,,,,,,"5","4","0","0",,"447","180","M1",,,"onder r. voorzitting","1960","245 G",,"e1*2001/116*0470*15","2712P2","AZAAA501","0","0.06","270","Ja","Nee",,"Nee","3205","0","0.00","2023","Logisch","00","Nee","2024-01-25T00:00:00.000",,"2016-01-07T00:00:00.000","2016-01-07T00:00:00.000",,,,,,,,,,,"154",,,,,,,,,,"D",,,,,,,"https://opendata.rdw.nl/resource/3huj-srit.json","https://opendata.rdw.nl/resource/8ys7-d773.json","https://opendata.rdw.nl/resource/vezc-m2t6.json","https://opendata.rdw.nl/resource/jhie-znh9.json","https://opendata.rdw.nl/resource/kmfi-hrps.json"
"JD342B","Personenauto","MERCEDES-BENZ","GLA 180 D","20230215",,"5727","stationwagen","5","ZWART","Niet geregistreerd","4","1461","1340","1960","1440","720","1200","20160215","20160215","Geen verstrekking in Open Data","40172","Nee",,,,,,,"5","4","0","0",,"447","180","M1",,,"onder r. voorzitting","1960","245 G",,"e1*2001/116*0470*15","2712P2","AZAAA501","0","0.06","270","Ja","Nee",,"Nee","3205","0","0.00","2022","Logisch","00","Nee","2023-02-15T00:00:00.000",,"2016-02-15T00:00:00.000","2016-02-15T00:00:00.000",,,,,,,,,,,"154",,,,,,,,,,"D",,,,,,,"https://opendata.rdw.nl/resource/3huj-srit.json","https://opendata.rdw.nl/resource/8ys7-d773.json","https://opendata.rdw.nl/resource/vezc-m2t6.json","https://opendata.rdw.nl/resource/jhie-znh9.json","https://opendata.rdw.nl/resource/kmfi-hrps.json"
"JD391T","Personenauto","MERCEDES-BENZ","GLA 180 D","20240527","20231227","5416","stationwagen","5","ZWART","Niet geregistreerd","4","1461","1370","1960","1470","735","1200","20160302","20160302","Geen verstrekking in Open Data","42075","Ja",,,,,,,"5","4","0","0",,"447","180","M1",,,"onder r. voorzitting","1960","245 G",,"e1*2001/116*0470*15","2712P2","MZAAA501","0","0.05","270","Ja","Ja",,"Nee","3205","0","0.00","2024","Logisch","00","Nee","2024-05-27T00:00:00.000","2023-12-27T00:00:00.000","2016-03-02T00:00:00.000","2016-03-02T00:00:00.000",,,,,,,,,,,"154",,,,,,,,,,"D",,,,,,,"https://opendata.rdw.nl/resource/3huj-srit.json","https://opendata.rdw.nl/resource/8ys7-d773.json","https://opendata.rdw.nl/resource/vezc-m2t6.json","https://opendata.rdw.nl/resource/jhie-znh9.json","https://opendata.rdw.nl/resource/kmfi-hrps.json"
"JK817P","Personenauto","MERCEDES-BENZ","GLA 180 D","20230922",,"6514","stationwagen","5","GRIJS","Niet geregistreerd","4","1461","1370","1960","1470","735","1200","20160428","20160428","Geen verstrekking in Open Data","50443","Nee",,,,,,,"5","4","0","0",,"447","180","M1",,,"onder r. voorzitting","1960","245 G",,"e1*2001/116*0470*15","2712P2","MZAAA502","0","0.05","270","Ja","Nee",,"Nee","3205","0","0.00","2023","Logisch","00","Nee","2023-09-22T00:00:00.000",,"2016-04-28T00:00:00.000","2016-04-28T00:00:00.000",,,,,,,,,,,"154",,,,,,,,,,"E",,,,,,,"https://opendata.rdw.nl/resource/3huj-srit.json","https://opendata.rdw.nl/resource/8ys7-d773.json","https://opendata.rdw.nl/resource/vezc-m2t6.json","https://opendata.rdw.nl/resource/jhie-znh9.json","https://opendata.rdw.nl/resource/kmfi-hrps.json"
"JR185G","Personenauto","MERCEDES-BENZ","GLA 180 D","20230604",,"5727","stationwagen","5","WIT","Niet geregistreerd","4","1461","1340","1960","1440","720","1200","20160604","20160604","Geen verstrekking in Open Data","39894","Nee",,,,,,,"5","4","0","0",,"0","0","M1",,,"onder r. voorzitting","1960","245 G",,"e1*2001/116*0470*15","2712P2","AZAAA501","0","0.06","270","Ja","Nee",,"Nee","3205","0","0.00","2022","Logisch","00","Nee","2023-06-04T00:00:00.000",,"2016-06-04T00:00:00.000","2016-06-04T00:00:00.000",,,,,,,,,,,,,,,,,,,,,"D",,,,,,,"https://opendata.rdw.nl/resource/3huj-srit.json","https://opendata.rdw.nl/resource/8ys7-d773.json","https://opendata.rdw.nl/resource/vezc-m2t6.json","https://opendata.rdw.nl/resource/jhie-znh9.json","https://opendata.rdw.nl/resource/kmfi-hrps.json"
"JT196S","Personenauto","MERCEDES-BENZ","GLA 180 D","20230623",,"5416","stationwagen","5","GRIJS","Niet geregistreerd","4","1461","1370","1960","1470","735","1200","20160623","20160623","Geen verstrekking in Open Data","45642","Nee",,,,,,,"5","4","0","0",,"447","180","M1",,,"onder r. voorzitting","1960","245 G",,"e1*2001/116*0470*16","2712P2","MZAZ1501","0","0.05","270","Ja","Nee",,"Nee","3205","0","0.00","2023","Logisch","00","Nee","2023-06-23T00:00:00.000",,"2016-06-23T00:00:00.000","2016-06-23T00:00:00.000",,,,,,,,,,,"154",,,,,,,,,,"D",,,,,,,"https://opendata.rdw.nl/resource/3huj-srit.json","https://opendata.rdw.nl/resource/8ys7-d773.json","https://opendata.rdw.nl/resource/vezc-m2t6.json","https://opendata.rdw.nl/resource/jhie-znh9.json","https://opendata.rdw.nl/resource/kmfi-hrps.json"
"JV560H","Personenauto","MERCEDES-BENZ","GLA 180 D","20230628",,"5727","stationwagen","5","ZWART","Niet geregistreerd","4","1461","1340","1960","1440","720","1200","20160628","20160628","Geen verstrekking in Open Data","40088","Nee",,,,,,,"5","4","0","0",,"447","180","M1",,,"onder r. voorzitting","1960","245 G",,"e1*2001/116*0470*16","2712P2","AZAZ1501","0","0.06","270","Ja","Nee",,"Nee","3205","0","0.00","2023","Logisch","00","Nee","2023-06-28T00:00:00.000",,"2016-06-28T00:00:00.000","2016-06-28T00:00:00.000",,,,,,,,,,,"154",,,,,,,,,,"D",,,,,,,"https://opendata.rdw.nl/resource/3huj-srit.json","https://opendata.rdw.nl/resource/8ys7-d773.json","https://opendata.rdw.nl/resource/vezc-m2t6.json","https://opendata.rdw.nl/resource/jhie-znh9.json","https://opendata.rdw.nl/resource/kmfi-hrps.json"
"JV617T","Personenauto","MERCEDES-BENZ","GLA 180 D","20230218",,"5416","stationwagen","5","WIT","Niet geregistreerd","4","1461","1370","1960","1470","735","1200","20160629","20160629","Geen verstrekking in Open Data","41798","Nee",,,,,,,"5","4","0","0",,"0","0","M1",,,"onder r. voorzitting","1960","245 G",,"e1*2001/116*0470*16","2712P2","MZAZ1501","0","0.05","270","Ja","Nee",,"Nee","3205","0","0.00","2022","Logisch","00","Nee","2023-02-18T00:00:00.000",,"2016-06-29T00:00:00.000","2016-06-29T00:00:00.000",,,,,,,,,,,,,,,,,,,,,"D",,,,,,,"https://opendata.rdw.nl/resource/3huj-srit.json","https://opendata.rdw.nl/resource/8ys7-d773.json","https://opendata.rdw.nl/resource/vezc-m2t6.json","https://opendata.rdw.nl/resource/jhie-znh9.json","https://opendata.rdw.nl/resource/kmfi-hrps.json"
"K427FP","Personenauto","MERCEDES-BENZ","GLA 180 D","20230607",,"6036","stationwagen","5","ZWART","Niet geregistreerd","4","1461","1340","1970","1440","720","1200","20180607","20201202","Geen verstrekking in Open Data","45671","Nee","190",,,,,,"5","4",,,,,"180","M1",,,,"1970","245 G",,"e1*2001/116*0470*20","2712P2","AZAA15A2","0","0.06","270","Ja","Ja",,"Nee","3205",,,"2022","Geen oordeel","05","Nee","2023-06-07T00:00:00.000",,"2018-06-07T00:00:00.000","2020-12-02T00:00:00.000",,,,,,,,,,,,,,,,,,,,,"E",,,,,,,"https://opendata.rdw.nl/resource/3huj-srit.json","https://opendata.rdw.nl/resource/8ys7-d773.json","https://opendata.rdw.nl/resource/vezc-m2t6.json","https://opendata.rdw.nl/resource/jhie-znh9.json","https://opendata.rdw.nl/resource/kmfi-hrps.json"
"KB214R","Personenauto","MERCEDES-BENZ","GLA 180 D","20221214",,"6514","stationwagen","5","WIT","Niet geregistreerd","4","1461","1370","1960","1470","735","1200","20160727","20160727","Geen verstrekking in Open Data","49003","Nee",,,,,,,"5","4","0","0",,"0","0","M1",,,"onder r. voorzitting","1960","245 G",,"e1*2001/116*0470*16","2712P2","MZAZ1502","0","0.05","270","Ja","Nee",,"Nee","3205","0","0.00","2022","Logisch","00","Nee","2022-12-14T00:00:00.000",,"2016-07-27T00:00:00.000","2016-07-27T00:00:00.000",,,,,,,,,,,,,,,,,,,,,"E",,,,,,,"https://opendata.rdw.nl/resource/3huj-srit.json","https://opendata.rdw.nl/resource/8ys7-d773.json","https://opendata.rdw.nl/resource/vezc-m2t6.json","https://opendata.rdw.nl/resource/jhie-znh9.json","https://opendata.rdw.nl/resource/kmfi-hrps.json"
"KF192J","Personenauto","MERCEDES-BENZ","GLA 180 D","20231004",,"5416","stationwagen","5","GRIJS","Niet geregistreerd","4","1461","1370","1960","1470","735","1200","20160829","20160829","Geen verstrekking in Open Data","44327","Nee",,,,,,,"5","4","0","0",,"0","0","M1",,,"onder r. voorzitting","1960","245 G",,"e1*2001/116*0470*16","2712P2","MZAZ1501","0","0.05","270","Ja","Nee",,"Nee","3205","0","0.00","2022","Logisch","00","Nee","2023-10-04T00:00:00.000",,"2016-08-29T00:00:00.000","2016-08-29T00:00:00.000",,,,,,,,,,,,,,,,,,,,,"D",,,,,,,"https://opendata.rdw.nl/resource/3huj-srit.json","https://opendata.rdw.nl/resource/8ys7-d773.json","https://opendata.rdw.nl/resource/vezc-m2t6.json","https://opendata.rdw.nl/resource/jhie-znh9.json","https://opendata.rdw.nl/resource/kmfi-hrps.json"
"KJ496Z","Personenauto","MERCEDES-BENZ","GLA 180 D","20240825","20240506","5416","stationwagen","5","WIT","Niet geregistreerd","4","1461","1370","1960","1470","735","1200","20160928","20160928","Geen verstrekking in Open Data","42542","Ja",,,,,,,"5","4","0","0",,"447","180","M1",,,"onder r. voorzitting","1960","245 G",,"e1*2001/116*0470*15","2712P2","MZAAA501","0","0.05","270","Ja","Nee",,"Nee","3205","0","0.00","2024","Logisch","00","Nee","2024-08-25T00:00:00.000","2024-05-06T00:00:00.000","2016-09-28T00:00:00.000","2016-09-28T00:00:00.000",,,,,,,,,,,"154",,,,,,,,,,"D",,,,,,,"https://opendata.rdw.nl/resource/3huj-srit.json","https://opendata.rdw.nl/resource/8ys7-d773.json","https://opendata.rdw.nl/resource/vezc-m2t6.json","https://opendata.rdw.nl/resource/jhie-znh9.json","https://opendata.rdw.nl/resource/kmfi-hrps.json"
"KL193N","Personenauto","MERCEDES-BENZ","GLA 180 D","20221020",,"5727","stationwagen","5","BLAUW","Niet geregistreerd","4","1461","1340","1960","1440","720","1200","20161017","20161017","Geen verstrekking in Open Data","40802","Nee",,,,,,,"5","4","0","0",,"0","0","M1",,,"onder r. voorzitting","1960","245 G",,"e1*2001/116*0470*16","2712P2","AZAA1501","0","0.06","270","Ja","Nee",,"Nee","3205","0","0.00","2022","Logisch","00","Nee","2022-10-20T00:00:00.000",,"2016-10-17T00:00:00.000","2016-10-17T00:00:00.000",,,,,,,,,,,,,,,,,,,,,"D",,,,,,,"https://opendata.rdw.nl/resource/3huj-srit.json","https://opendata.rdw.nl/resource/8ys7-d773.json","https://opendata.rdw.nl/resource/vezc-m2t6.json","https://opendata.rdw.nl/resource/jhie-znh9.json","https://opendata.rdw.nl/resource/kmfi-hrps.json"
"KT453N","Personenauto","MERCEDES-BENZ","GLA 180 D","20230923",,"5416","stationwagen","5","ZWART","Niet geregistreerd","4","1461","1370","1960","1470","735","1200","20161203","20161203","Geen verstrekking in Open Data","45811","Nee",,,,,,,"5","4","0","0",,"447","180","M1",,,"onder r. voorzitting","1960","245 G",,"e1*2001/116*0470*16","2712P2","MZAA1501","0","0.05","270","Ja","Nee",,"Nee","3205","0","0.00","2022","Onlogisch","04","Nee","2023-09-23T00:00:00.000",,"2016-12-03T00:00:00.000","2016-12-03T00:00:00.000",,,,,,,,,,,"154",,,,,,,,,,"D",,,,,,,"https://opendata.rdw.nl/resource/3huj-srit.json","https://opendata.rdw.nl/resource/8ys7-d773.json","https://opendata.rdw.nl/resource/vezc-m2t6.json","https://opendata.rdw.nl/resource/jhie-znh9.json","https://opendata.rdw.nl/resource/kmfi-hrps.json"
"KX380N","Personenauto","MERCEDES-BENZ","GLA 180 D","20221222",,"5727","stationwagen","5","ZWART","Niet geregistreerd","4","1461","1340","1960","1440","720","1200","20161222","20161222","Geen verstrekking in Open Data","46534","Nee",,,,,,,"5","4","0","0",,"447","180","M1",,,"onder r. voorzitting","1960","245 G",,"e1*2001/116*0470*16","2712P2","AZAA1501","0","0.06","270","Ja","Nee",,"Nee","3205","0","0.00","2022","Logisch","00","Nee","2022-12-22T00:00:00.000",,"2016-12-22T00:00:00.000","2016-12-22T00:00:00.000",,,,,,,,,,,"154",,,,,,,,,,"D",,,,,,,"https://opendata.rdw.nl/resource/3huj-srit.json","https://opendata.rdw.nl/resource/8ys7-d773.json","https://opendata.rdw.nl/resource/vezc-m2t6.json","https://opendata.rdw.nl/resource/jhie-znh9.json","https://opendata.rdw.nl/resource/kmfi-hrps.json"
"KX574D","Personenauto","MERCEDES-BENZ","GLA 180 D","20230108",,"5416","stationwagen","5","BLAUW","Niet geregistreerd","4","1461","1370","1960","1470","735","1200","20161214","20161214","Geen verstrekking in Open Data","43159","Nee",,,,,,,"5","4","0","0",,"0","0","M1",,,"onder r. voorzitting","1960","245 G",,"e1*2001/116*0470*16","2712P2","MZAA1501","0","0.05","270","Ja","Nee",,"Nee","3205","0","0.00","2022","Logisch","00","Nee","2023-01-08T00:00:00.000",,"2016-12-14T00:00:00.000","2016-12-14T00:00:00.000",,,,,,,,,,,,,,,,,,,,,"D",,,,,,,"https://opendata.rdw.nl/resource/3huj-srit.json","https://opendata.rdw.nl/resource/8ys7-d773.json","https://opendata.rdw.nl/resource/vezc-m2t6.json","https://opendata.rdw.nl/resource/jhie-znh9.json","https://opendata.rdw.nl/resource/kmfi-hrps.json"
"NB938L","Personenauto","MERCEDES-BENZ","GLA 180 D","20240102",,"5416","stationwagen","5","GRIJS","Niet geregistreerd","4","1461","1370","1960","1470","735","1200","20170102","20170102","Geen verstrekking in Open Data","41386","Nee",,,,,,,"5","4","0","0",,"447","180","M1",,,"onder r. voorzitting","1960","245 G",,"e1*2001/116*0470*16","2712P2","MZAA1501","0","0.05","270","Ja","Nee",,"Nee","3205","0","0.00","2023","Logisch","00","Nee","2024-01-02T00:00:00.000",,"2017-01-02T00:00:00.000","2017-01-02T00:00:00.000",,,,,,,,,,,"154",,,,,,,,,,"D",,,,,,,"https://opendata.rdw.nl/resource/3huj-srit.json","https://opendata.rdw.nl/resource/8ys7-d773.json","https://opendata.rdw.nl/resource/vezc-m2t6.json","https://opendata.rdw.nl/resource/jhie-znh9.json","https://opendata.rdw.nl/resource/kmfi-hrps.json"
"ND806F","Personenauto","MERCEDES-BENZ","GLA 180 D","20230116",,"5727","stationwagen","5","ROOD","Niet geregistreerd","4","1461","1340","1960","1440","720","1200","20170116","20170116","Geen verstrekking in Open Data","40046","Nee",,,,,,,"5","4","0","0",,"0","0","M1",,,"onder r. voorzitting","1960","245 G",,"e1*2001/116*0470*16","2712P2","AZAA1501","0","0.06","270","Ja","Nee",,"Nee","3205","0","0.00","2022","Logisch","00","Nee","2023-01-16T00:00:00.000",,"2017-01-16T00:00:00.000","2017-01-16T00:00:00.000",,,,,,,,,,,,,,,,,,,,,"D",,,,,,,"https://opendata.rdw.nl/resource/3huj-srit.json","https://opendata.rdw.nl/resource/8ys7-d773.json","https://opendata.rdw.nl/resource/vezc-m2t6.json","https://opendata.rdw.nl/resource/jhie-znh9.json","https://opendata.rdw.nl/resource/kmfi-hrps.json"
"ND962J","Personenauto","MERCEDES-BENZ","GLA 180 D","20230309",,"5416","stationwagen","5","ZWART","Niet geregistreerd","4","1461","1370","1960","1470","735","1200","20170113","20170113","Geen verstrekking in Open Data","43776","Nee",,,,,,,"5","4","0","0",,"0","0","M1",,,"onder r. voorzitting","1960","245 G",,"e1*2001/116*0470*16","2712P2","MZAZ1501","0","0.05","270","Ja","Nee",,"Nee","3205","0","0.00","2022","Logisch","00","Nee","2023-03-09T00:00:00.000",,"2017-01-13T00:00:00.000","2017-01-13T00:00:00.000",,,,,,,,,,,,,,,,,,,,,"D",,,,,,,"https://opendata.rdw.nl/resource/3huj-srit.json","https://opendata.rdw.nl/resource/8ys7-d773.json","https://opendata.rdw.nl/resource/vezc-m2t6.json","https://opendata.rdw.nl/resource/jhie-znh9.json","https://opendata.rdw.nl/resource/kmfi-hrps.json"
"NH065X","Personenauto","MERCEDES-BENZ","GLA 180 D","20250315","20240503","1422","stationwagen","5","ZWART","Niet geregistreerd","4","1461","1370","1960","1470","735","1200","20170203","20170203","Geen verstrekking in Open Data","49207","Nee","190",,,,,,"5","4","0","0",,"447","180","M1",,,"onder r. voorzitting","1960","245 G",,"e1*2001/116*0470*16","2712P2","MZAA1501","0","0.05","270","Ja","Nee",,"Nee","3205","0","0.00","2024","Onlogisch","04","Nee","2025-03-15T00:00:00.000","2024-05-03T00:00:00.000","2017-02-03T00:00:00.000","2017-02-03T00:00:00.000",,,,,,,,,,,"154",,,,,,,,,,"D",,,,,,,"https://opendata.rdw.nl/resource/3huj-srit.json","https://opendata.rdw.nl/resource/8ys7-d773.json","https://opendata.rdw.nl/resource/vezc-m2t6.json","https://opendata.rdw.nl/resource/jhie-znh9.json","https://opendata.rdw.nl/resource/kmfi-hrps.json"
"NH562F","Personenauto","MERCEDES-BENZ","GLA 180 D","20240203",,"6123","stationwagen","5","ZWART","Niet geregistreerd","4","1461","1340","1960","1440","720","1200","20170127","20170127","Geen verstrekking in Open Data","41367","Nee",,,,,,,"5","4","0","0",,"447","180","M1",,,"onder r. voorzitting","1960","245 G",,"e1*2001/116*0470*15","2712P2","AZAAA501","0","0.06","270","Ja","Nee",,"Nee","3205","0","0.00","2023","Logisch","00","Nee","2024-02-03T00:00:00.000",,"2017-01-27T00:00:00.000","2017-01-27T00:00:00.000",,,,,,,,,,,"154",,,,,,,,,,"D",,,,,,,"https://opendata.rdw.nl/resource/3huj-srit.json","https://opendata.rdw.nl/resource/8ys7-d773.json","https://opendata.rdw.nl/resource/vezc-m2t6.json","https://opendata.rdw.nl/resource/jhie-znh9.json","https://opendata.rdw.nl/resource/kmfi-hrps.json"
"NJ174K","Personenauto","MERCEDES-BENZ","GLA 180 D","20240211",,"5423","stationwagen","5","GRIJS","Niet geregistreerd","4","1461","1340","1960","1440","720","1200","20160211","20171002","Geen verstrekking in Open Data","51447","Nee",,,,,,,"5","4","0","0",,"0","0","M1",,,"r. bodemplaat by voorzitting","1960","245 G",,"e1*2001/116*0470*15","2712P2","AZAAA502","0","0.06","270","Ja","Ja",,"Nee","3205","0","0.00","2023","Geen oordeel","05","Nee","2024-02-11T00:00:00.000",,"2016-02-11T00:00:00.000","2017-10-02T00:00:00.000",,,,,,,,,,,,,,,,,,,,,"E",,,,,,,"https://opendata.rdw.nl/resource/3huj-srit.json","https://opendata.rdw.nl/resource/8ys7-d773.json","https://opendata.rdw.nl/resource/vezc-m2t6.json","https://opendata.rdw.nl/resource/jhie-znh9.json","https://opendata.rdw.nl/resource/kmfi-hrps.json"
"NT962J","Personenauto","MERCEDES-BENZ","GLA 180 D","20230502",,"6123","stationwagen","5","ZWART","Niet geregistreerd","4","1461","1340","1970","1440","720","1200","20170425","20170425","Geen verstrekking in Open Data","39994","Nee",,,,,,,"5","4","0","0",,"0","0","M1",,,"onder r. voorzitting","1970","245 G",,"e1*2001/116*0470*17","2712P2","AZAA1501","0","0.06","270","Ja","Nee",,"Nee","3205","0","0.00","2022","Logisch","00","Nee","2023-05-02T00:00:00.000",,"2017-04-25T00:00:00.000","2017-04-25T00:00:00.000",,,,,,,,,,,,,,,,,,,,,"D",,,,,,,"https://opendata.rdw.nl/resource/3huj-srit.json","https://opendata.rdw.nl/resource/8ys7-d773.json","https://opendata.rdw.nl/resource/vezc-m2t6.json","https://opendata.rdw.nl/resource/jhie-znh9.json","https://opendata.rdw.nl/resource/kmfi-hrps.json"
"NX559B","Personenauto","MERCEDES-BENZ","GLA 180 D","20230602",,"7050","stationwagen","5","BLAUW","Niet geregistreerd","4","1461","1370","1970","1470","735","1200","20170508","20170508","Geen verstrekking in Open Data","46790","Nee",,,,,,,"5","4","0","0",,"0","0","M1",,,"onder r. voorzitting","1970","245 G",,"e1*2001/116*0470*17","2712P2","MZAA15A2","0","0.05","270","Ja","Nee",,"Nee","3205","0","0.00","2022","Logisch","00","Nee","2023-06-02T00:00:00.000",,"2017-05-08T00:00:00.000","2017-05-08T00:00:00.000",,,,,,,,,,,,,,,,,,,,,"E",,,,,,,"https://opendata.rdw.nl/resource/3huj-srit.json","https://opendata.rdw.nl/resource/8ys7-d773.json","https://opendata.rdw.nl/resource/vezc-m2t6.json","https://opendata.rdw.nl/resource/jhie-znh9.json","https://opendata.rdw.nl/resource/kmfi-hrps.json"