"kenteken","voertuigsoort","merk","handelsbenaming","vervaldatum_apk","datum_tenaamstelling","bruto_bpm","inrichting","aantal_zitplaatsen","eerste_kleur","tweede_kleur","aantal_cilinders","cilinderinhoud","massa_ledig_voertuig","toegestane_maximum_massa_voertuig","massa_rijklaar","maximum_massa_trekken_ongeremd","maximum_trekken_massa_geremd","datum_eerste_toelating","datum_eerste_tenaamstelling_in_nederland","wacht_op_keuren","catalogusprijs","wam_verzekerd","maximale_constructiesnelheid","laadvermogen","oplegger_geremd","aanhangwagen_autonoom_geremd","aanhangwagen_middenas_geremd","aantal_staanplaatsen","aantal_deuren","aantal_wielen","afstand_hart_koppeling_tot_achterzijde_voertuig","afstand_voorzijde_voertuig_tot_hart_koppeling","afwijkende_maximum_snelheid","lengte","breedte","europese_voertuigcategorie","europese_voertuigcategorie_toevoeging","europese_uitvoeringcategorie_toevoeging","plaats_chassisnummer","technische_max_massa_voertuig","type","type_gasinstallatie","typegoedkeuringsnummer","variant","uitvoering","volgnummer_wijziging_eu_typegoedkeuring","vermogen_massarijklaar","wielbasis","export_indicator","openstaande_terugroepactie_indicator","vervaldatum_tachograaf","taxi_indicator","maximum_massa_samenstelling","aantal_rolstoelplaatsen","maximum_ondersteunende_snelheid","jaar_laatste_registratie_tellerstand","tellerstandoordeel","code_toelichting_tellerstandoordeel","tenaamstellen_mogelijk","vervaldatum_apk_dt","datum_tenaamstelling_dt","datum_eerste_toelating_dt","datum_eerste_tenaamstelling_in_nederland_dt","vervaldatum_tachograaf_dt","maximum_last_onder_de_vooras_sen_tezamen_koppeling","type_remsysteem_voertuig_code","rupsonderstelconfiguratiecode","wielbasis_voertuig_minimum","wielbasis_voertuig_maximum","lengte_voertuig_minimum","lengte_voertuig_maximum","breedte_voertuig_minimum","breedte_voertuig_maximum","hoogte_voertuig","hoogte_voertuig_minimum","hoogte_voertuig_maximum","massa_bedrijfsklaar_minimaal","massa_bedrijfsklaar_maximaal","technisch_toelaatbaar_massa_koppelpunt","maximum_massa_technisch_maximaal","maximum_massa_technisch_minimaal","subcategorie_nederland","verticale_belasting_koppelpunt_getrokken_voertuig","zuinigheidsclassificatie","registratie_datum_goedkeuring_afschrijvingsmoment_bpm","registratie_datum_goedkeuring_afschrijvingsmoment_bpm_dt","gem_lading_wrde","aerodyn_voorz","massa_alt_aandr","verl_cab_ind","api_gekentekende_voertuigen_assen","api_gekentekende_voertuigen_brandstof","api_gekentekende_voertuigen_carrosserie","api_gekentekende_voertuigen_carrosserie_specifiek","api_gekentekende_voertuigen_voertuigklasse"
"G331VZ","Personenauto","MERCEDES-BENZ","CLA 220 D","20230910",,"2483","stationwagen","5","GRIJS","Niet geregistreerd","4","2143","1455","2050","1555","750","1500","20151123","20200915","Geen verstrekking in Open Data","52663","Nee","228",,,,,,"5","4","0","0",,"0","178","M1",,,,"2050","245 G",,"e1*2001/116*0470*15","22S2P2","MZAAA502","0","0.08","270","Ja","Nee",,"Nee","3590","0","0.00","2022","Geen oordeel","05","Nee","2023-09-10T00:00:00.000",,"2015-11-23T00:00:00.000","2020-09-15T00:00:00.000",,,,,,,,,,,,,,,,,,,,,"C",,,,,,,"https://opendata.rdw.nl/resource/3huj-srit.json","https://opendata.rdw.nl/resource/8ys7-d773.json","https://opendata.rdw.nl/resource/vezc-m2t6.json","https://opendata.rdw.nl/resource/jhie-znh9.json","https://opendata.rdw.nl/resource/kmfi-hrps.json"
"G429TF","Personenauto","MERCEDES-BENZ","CLA 220 D 4MATIC","20230128",,"3353","stationwagen","5","ZWART","Niet geregistreerd","4","2143","1515","2100","1615","750","1500","20151111","20200129","Geen verstrekking in Open Data","54058","Nee","225",,,,,,"5","4","0","0",,"0","178","M1",,,,"2100","245 G",,"e1*2001/116*0470*15","22S2P1","MZAAA524","0","0.08","270","Ja","Nee",,"Nee","3645","0","0.00","2022","Geen oordeel","05","Nee","2023-01-28T00:00:00.000",,"2015-11-11T00:00:00.000","2020-01-29T00:00:00.000",,,,,,,,,,,,,,,,,,,,,"E",,,,,,,"https://opendata.rdw.nl/resource/3huj-srit.json","https://opendata.rdw.nl/resource/8ys7-d773.json","https://opendata.rdw.nl/resource/vezc-m2t6.json","https://opendata.rdw.nl/resource/jhie-znh9.json","https://opendata.rdw.nl/resource/kmfi-hrps.json"
"G481PV","Personenauto","MERCEDES-BENZ","CLA 220 D","20240713","20240423","2458","stationwagen","5","ZWART","Niet geregistreerd","4","2143","1455","2050","1555","750","1500","20170228","20191109","Geen verstrekking in Open Data","54190","Ja","228",,,,,,"5","4","0","0",,"0","178","M1",,,,"2050","245 G",,"e1*2001/116*0470*16","22S2P2","MZBA1522","0","0.08","270","Ja","Ja",,"Nee","3590","0","0.00","2024","Geen oordeel","05","Nee","2024-07-13T00:00:00.000","2024-04-23T00:00:00.000","2017-02-28T00:00:00.000","2019-11-09T00:00:00.000",,,,,,,,,,,,,,,,,,,,,"D",,,,,,,"https://opendata.rdw.nl/resource/3huj-srit.json","https://opendata.rdw.nl/resource/8ys7-d773.json","https://opendata.rdw.nl/resource/vezc-m2t6.json","https://opendata.rdw.nl/resource/jhie-znh9.json","https://opendata.rdw.nl/resource/kmfi-hrps.json"
"HF859B","Personenauto","MERCEDES-BENZ","CLA 220 D","20231222",,"5729","stationwagen","5","GRIJS","Niet geregistreerd","4","2143","1455","2050","1555","750","1500","20151013","20151013","Geen verstrekking in Open Data","58601","Nee",,,,,,,"5","4","0","0",,"0","0","M1",,,"by dwarsbalk r. voorzitting","2050","245 G",,"e1*2001/116*0470*15","22S2P2","MZAAA522","0","0.08","270","Ja","Ja",,"Nee","3590","0","0.00","2023","Logisch","00","Nee","2023-12-22T00:00:00.000",,"2015-10-13T00:00:00.000","2015-10-13T00:00:00.000",,,,,,,,,,,,,,,,,,,,,"C",,,,,,,"https://opendata.rdw.nl/resource/3huj-srit.json","https://opendata.rdw.nl/resource/8ys7-d773.json","https://opendata.rdw.nl/resource/vezc-m2t6.json","https://opendata.rdw.nl/resource/jhie-znh9.json","https://opendata.rdw.nl/resource/kmfi-hrps.json"
"HF869B","Personenauto","MERCEDES-BENZ","CLA 220 D","20220823",,"5729","stationwagen","5","GRIJS","Niet geregistreerd","4","2143","1455","2050","1555","750","1500","20151013","20151013","Geen verstrekking in Open Data","58601","Nee",,,,,,,"5","4","0","0",,"0","0","M1",,,"by dwarsbalk r. voorzitting","2050","245 G",,"e1*2001/116*0470*15","22S2P2","MZAAA522","0","0.08","270","Ja","Nee",,"Nee","3590","0","0.00","2022","Niet geregistreerd","NG","Nee","2022-08-23T00:00:00.000",,"2015-10-13T00:00:00.000","2015-10-13T00:00:00.000",,,,,,,,,,,,,,,,,,,,,"C",,,,,,,"https://opendata.rdw.nl/resource/3huj-srit.json","https://opendata.rdw.nl/resource/8ys7-d773.json","https://opendata.rdw.nl/resource/vezc-m2t6.json","https://opendata.rdw.nl/resource/jhie-znh9.json","https://opendata.rdw.nl/resource/kmfi-hrps.json"
"HJ963T","Personenauto","MERCEDES-BENZ","CLA 220 D","20250329","20240329","5729","stationwagen","5","GRIJS","Niet geregistreerd","4","2143","1455","2050","1555","750","1500","20151118","20151118","Geen verstrekking in Open Data","59759","Ja",,,,,,,"5","4","0","0",,"469","178","M1",,,"onder r. voorzitting","2050","245 G",,"e1*2001/116*0470*15","22S2P2","MZAAA522","0","0.08","270","Ja","Nee",,"Nee","3590","0","0.00","2024","Logisch","00","Nee","2025-03-29T00:00:00.000","2024-03-29T00:00:00.000","2015-11-18T00:00:00.000","2015-11-18T00:00:00.000",,,,,,,,,,,"146",,,,,,,,,,"C",,,,,,,"https://opendata.rdw.nl/resource/3huj-srit.json","https://opendata.rdw.nl/resource/8ys7-d773.json","https://opendata.rdw.nl/resource/vezc-m2t6.json","https://opendata.rdw.nl/resource/jhie-znh9.json","https://opendata.rdw.nl/resource/kmfi-hrps.json"
"J344TP","Personenauto","MERCEDES-BENZ","A 220 D","20221019",,"1989","stationwagen","5","ZWART","Niet geregistreerd","4","2143","1385","2010","1485","740","1500","20160224","20201015","Geen verstrekking in Open Data","50256","Nee","224",,,,,,"5","4","0","0",,"0","178","M1",,,"by dwarsbalk r. voorzitting","2010","245 G",,"e1*2001/116*0470*15","12S2P2","MZAAA502","0","0.09","270","Ja","Nee",,"Nee","3510","0","0.00","2022","Geen oordeel","05","Nee","2022-10-19T00:00:00.000",,"2016-02-24T00:00:00.000","2020-10-15T00:00:00.000",,,,,,,,,,,,,,,,,,,,,"E",,,,,,,"https://opendata.rdw.nl/resource/3huj-srit.json","https://opendata.rdw.nl/resource/8ys7-d773.json","https://opendata.rdw.nl/resource/vezc-m2t6.json","https://opendata.rdw.nl/resource/jhie-znh9.json","https://opendata.rdw.nl/resource/kmfi-hrps.json"
"J713KN","Personenauto","MERCEDES-BENZ","A 220 D","20241015",,"6895","stationwagen","5","ZWART","Niet geregistreerd","4","1950","1420","2015","1520","750","1600","20191015","20200826","Geen verstrekking in Open Data","62949","Ja","235",,,,,,"5","4","0","0",,"0","0","M1",,,,"2015","F2A",,"e1*2007/46*1829*07","X21ET2","HZAZ152A","0","0.09","273","Ja","Nee",,"Nee","3680","0","0.00","2024","Geen oordeel","05","Nee","2024-10-15T00:00:00.000",,"2019-10-15T00:00:00.000","2020-08-26T00:00:00.000",,,,,,,,,,,,,,,,,,,,,,,,,,,,"https://opendata.rdw.nl/resource/3huj-srit.json","https://opendata.rdw.nl/resource/8ys7-d773.json","https://opendata.rdw.nl/resource/vezc-m2t6.json","https://opendata.rdw.nl/resource/jhie-znh9.json","https://opendata.rdw.nl/resource/kmfi-hrps.json"
"JB573N","Personenauto","MERCEDES-BENZ","CLA 220 D","20230204",,"6303","stationwagen","5","GRIJS","Niet geregistreerd","4","2143","1455","2050","1555","750","1500","20160204","20160204","Geen verstrekking in Open Data","54877","Nee",,,,,,,"5","4","0","0",,"469","178","M1",,,"onder r. voorzitting","2050","245 G",,"e1*2001/116*0470*15","22S2P2","MZAAA522","0","0.08","270","Ja","Nee",,"Nee","3590","0","0.00","2023","Logisch","00","Nee","2023-02-04T00:00:00.000",,"2016-02-04T00:00:00.000","2016-02-04T00:00:00.000",,,,,,,,,,,"146",,,,,,,,,,"E",,,,,,,"https://opendata.rdw.nl/resource/3huj-srit.json","https://opendata.rdw.nl/resource/8ys7-d773.json","https://opendata.rdw.nl/resource/vezc-m2t6.json","https://opendata.rdw.nl/resource/jhie-znh9.json","https://opendata.rdw.nl/resource/kmfi-hrps.json"
"JR209K","Personenauto","MERCEDES-BENZ","GLA 220 D 4MATIC","20240612","20240507","7671","stationwagen","5","GRIJS","Niet geregistreerd","4","2143","1495","2075","1595","750","1800","20150610","20160616","Geen verstrekking in Open Data","59367","Ja",,,,,,,"5","4","0","0",,"0","0","M1",,,"by dwarsbalk r. voorzitting","2075","245 G",,"e1*2001/116*0470*14","27S2P1","MZAAA501","0","0.08","270","Ja","Nee",,"Nee","3930","0","0.00","2024","Geen oordeel","05","Nee","2024-06-12T00:00:00.000","2024-05-07T00:00:00.000","2015-06-10T00:00:00.000","2016-06-16T00:00:00.000",,,,,,,,,,,,,,,,,,,,,"E",,,,,,,"https://opendata.rdw.nl/resource/3huj-srit.json","https://opendata.rdw.nl/resource/8ys7-d773.json","https://opendata.rdw.nl/resource/vezc-m2t6.json","https://opendata.rdw.nl/resource/jhie-znh9.json","https://opendata.rdw.nl/resource/kmfi-hrps.json"
"KF328G","Personenauto","MERCEDES-BENZ","A 220 D","20230311",,"1215","stationwagen","5","ZWART","Niet geregistreerd","4","2143","1385","2010","1485","740","1500","20160203","20170705","Geen verstrekking in Open Data","55783","Nee",,,,,,,"5","4","0","0",,"0","0","M1",,,"by dwarsbalk r. voorzitting","2010","245 G",,"e1*2001/116*0470*15","12S2P2","MZAAA502","0","0.09","270","Ja","Nee",,"Nee","3510","0","0.00","2023","Geen oordeel","05","Nee","2023-03-11T00:00:00.000",,"2016-02-03T00:00:00.000","2017-07-05T00:00:00.000",,,,,,,,,,,,,,,,,,,,,"E",,,,,,,"https://opendata.rdw.nl/resource/3huj-srit.json","https://opendata.rdw.nl/resource/8ys7-d773.json","https://opendata.rdw.nl/resource/vezc-m2t6.json","https://opendata.rdw.nl/resource/jhie-znh9.json","https://opendata.rdw.nl/resource/kmfi-hrps.json"
"KJ829D","Personenauto","MERCEDES-BENZ","CLA 220 D","20241102",,"4627","sedan","5","WIT","Niet geregistreerd","4","2143","1425","2005","1525","750","1500","20151102","20160916","Geen verstrekking in Open Data","59579","Nee",,,,,,,"4","4","0","0",,"0","0","M1",,,"by dwarsbalk r. voorzitting","2005","245 G",,"e1*2001/116*0470*15","23SAP2","MZAAA522","0","0.08","270","Ja","Nee",,"Nee","3545","0","0.00","2024","Geen oordeel","05","Nee","2024-11-02T00:00:00.000",,"2015-11-02T00:00:00.000","2016-09-16T00:00:00.000",,,,,,,,,,,,,,,,,,,,,"C",,,,,,,"https://opendata.rdw.nl/resource/3huj-srit.json","https://opendata.rdw.nl/resource/8ys7-d773.json","https://opendata.rdw.nl/resource/vezc-m2t6.json","https://opendata.rdw.nl/resource/jhie-znh9.json","https://opendata.rdw.nl/resource/kmfi-hrps.json"
"L636DT","Personenauto","MERCEDES-BENZ","A 220 D","20221001",,"2439","stationwagen","5","GROEN","Niet geregistreerd","4","2143","1385","2010","1485","740","1500","20160928","20210711","Geen verstrekking in Open Data","57502","Nee","224",,,,,,"5","4","0","0",,"0","178","M1",,,,"2010","245 G",,"e1*2001/116*0470*16","12S2P2","MZAZ1502","0","0.09","270","Ja","Ja",,"Nee","3510","0","0.00","2022","Geen oordeel","05","Nee","2022-10-01T00:00:00.000",,"2016-09-28T00:00:00.000","2021-07-11T00:00:00.000",,,,,,,,,,,,,,,,,,,,,,,,,,,,"https://opendata.rdw.nl/resource/3huj-srit.json","https://opendata.rdw.nl/resource/8ys7-d773.json","https://opendata.rdw.nl/resource/vezc-m2t6.json","https://opendata.rdw.nl/resource/jhie-znh9.json","https://opendata.rdw.nl/resource/kmfi-hrps.json"
"L643GH","Personenauto","MERCEDES-BENZ","GLA 220 D",,,"3703","stationwagen","5","ZWART","Niet geregistreerd","4","2143","1435","2020","1535","750","1500","20151123","20210515","Geen verstrekking in Open Data","54088","Nee","220",,,,,,"5","4","0","0",,"0","180","M1",,,,"2020","245 G",,"e1*2001/116*0470*15","27S2P2","MZAAA502","0","0.08","270","Ja","Nee",,"Nee","3570","0","0.00","2021","Geen oordeel","05","Nee",,,"2015-11-23T00:00:00.000","2021-05-15T00:00:00.000",,,,,,,,,,,,,,,,,,,,,,,,,,,,"https://opendata.rdw.nl/resource/3huj-srit.json","https://opendata.rdw.nl/resource/8ys7-d773.json","https://opendata.rdw.nl/resource/vezc-m2t6.json","https://opendata.rdw.nl/resource/jhie-znh9.json","https://opendata.rdw.nl/resource/kmfi-hrps.json"
"L933SH","Personenauto","MERCEDES-BENZ","A 220 D","20241130",,"2923","stationwagen","5","ZWART","Niet geregistreerd","4","1950","1420","2015","1520","750","1600","20191119","20210716","Geen verstrekking in Open Data","58509","Nee","235",,,,,,"5","4","0","0",,"0","0","M1",,,,"2015","F2A",,"e1*2007/46*1829*08","X21ET2","HZAZ150A","0","0.09","273","Ja","Nee",,"Nee","3680","0","0.00","2023","Geen oordeel","05","Nee","2024-11-30T00:00:00.000",,"2019-11-19T00:00:00.000","2021-07-16T00:00:00.000",,,,,,,,,,,,,,,,,,,,,,,,,,,,"https://opendata.rdw.nl/resource/3huj-srit.json","https://opendata.rdw.nl/resource/8ys7-d773.json","https://opendata.rdw.nl/resource/vezc-m2t6.json","https://opendata.rdw.nl/resource/jhie-znh9.json","https://opendata.rdw.nl/resource/kmfi-hrps.json"
"N260NG","Personenauto","MERCEDES-BENZ","A 220 D","20231122",,"266","stationwagen","5","ZWART","Niet geregistreerd","4","2143","1385","2010","1485","740","1500","20160831","20211130","Geen verstrekking in Open Data","56421","Nee","224",,,,,,"5","4","0","0",,"0","178","M1",,,,"2010","245 G",,"e1*2001/116*0470*16","12S2P2","MZAZ1522","0","0.09","270","Ja","Ja",,"Nee","3510","0","0.00","2023","Geen oordeel","05","Nee","2023-11-22T00:00:00.000",,"2016-08-31T00:00:00.000","2021-11-30T00:00:00.000",,,,,,,,,,,,,,,,,,,,,,"20211117","2021-11-17T00:00:00.000",,,,,"https://opendata.rdw.nl/resource/3huj-srit.json","https://opendata.rdw.nl/resource/8ys7-d773.json","https://opendata.rdw.nl/resource/vezc-m2t6.json","https://opendata.rdw.nl/resource/jhie-znh9.json","https://opendata.rdw.nl/resource/kmfi-hrps.json"
"N885FT","Personenauto","MERCEDES-BENZ","CLA 220 D 4MATIC","20230215",,"7761","stationwagen","5","BLAUW","Niet geregistreerd","4","2143","1515","2100","1615","750","1500","20180817","20210928","Geen verstrekking in Open Data","45593","Nee","225",,,,,,"5","4","0","0",,"0","178","M1",,,,"2100","245 G",,"e1*2001/116*0470*22","22S2P1","MZBA152A","0","0.08","270","Ja","Nee",,"Nee","3650","0","0.00","2022","Geen oordeel","05","Nee","2023-02-15T00:00:00.000",,"2018-08-17T00:00:00.000","2021-09-28T00:00:00.000",,,,,,,,,,,,,,,,,,,,,,,,,,,,"https://opendata.rdw.nl/resource/3huj-srit.json","https://opendata.rdw.nl/resource/8ys7-d773.json","https://opendata.rdw.nl/resource/vezc-m2t6.json","https://opendata.rdw.nl/resource/jhie-znh9.json","https://opendata.rdw.nl/resource/kmfi-hrps.json"
"ND729F","Personenauto","MERCEDES-BENZ","GLA 220 D","20230106",,"7776","stationwagen","5","GRIJS","Niet geregistreerd","4","2143","1435","2020","1535","750","1500","20170106","20170106","Geen verstrekking in Open Data","58262","Ja",,,,,,,"5","4","0","0",,"447","180","M1",,,"onder r. voorzitting","2020","245 G",,"e1*2001/116*0470*16","27S2P2","MZAA1502","0","0.08","270","Ja","Nee",,"Nee","3570","0","0.00","2022","Logisch","00","Nee","2023-01-06T00:00:00.000",,"2017-01-06T00:00:00.000","2017-01-06T00:00:00.000",,,,,,,,,,,"154",,,,,,,,,,"E",,,,,,,"https://opendata.rdw.nl/resource/3huj-srit.json","https://opendata.rdw.nl/resource/8ys7-d773.json","https://opendata.rdw.nl/resource/vezc-m2t6.json","https://opendata.rdw.nl/resource/jhie-znh9.json","https://opendata.rdw.nl/resource/kmfi-hrps.json"
"NG461H","Personenauto","MERCEDES-BENZ","A 220 D","20221215",,"5891","stationwagen","5","GRIJS","Niet geregistreerd","4","2143","1385","2010","1485","740","1500","20170328","20170328","Geen verstrekking in Open Data","47922","Ja",,,,,,,"5","4","0","0",,"0","0","M1",,,"onder r. voorzitting","2010","245 G",,"e1*2001/116*0470*17","12S2P2","MZAA1501","0","0.09","270","Ja","Nee",,"Nee","3510","0","0.00","2021","Logisch","00","Nee","2022-12-15T00:00:00.000",,"2017-03-28T00:00:00.000","2017-03-28T00:00:00.000",,,,,,,,,,,,,,,,,,,,,"E",,,,,,,"https://opendata.rdw.nl/resource/3huj-srit.json","https://opendata.rdw.nl/resource/8ys7-d773.json","https://opendata.rdw.nl/resource/vezc-m2t6.json","https://opendata.rdw.nl/resource/jhie-znh9.json","https://opendata.rdw.nl/resource/kmfi-hrps.json"
"NG741F","Personenauto","MERCEDES-BENZ","CLA 220 D","20230422",,"4563","stationwagen","5","ZWART","Niet geregistreerd","4","2143","1455","2050","1555","750","1500","20151119","20170111","Geen verstrekking in Open Data","53367","Nee",,,,,,,"5","4","0","0",,"0","0","M1",,,"by dwarsbalk r. voorzitting","2050","245 G",,"e1*2001/116*0470*15","22S2P2","MZAAA522","0","0.08","270","Ja","Nee",,"Nee","3590","0","0.00","2022","Geen oordeel","05","Nee","2023-04-22T00:00:00.000",,"2015-11-19T00:00:00.000","2017-01-11T00:00:00.000",,,,,,,,,,,,,,,,,,,,,"C",,,,,,,"https://opendata.rdw.nl/resource/3huj-srit.json","https://opendata.rdw.nl/resource/8ys7-d773.json","https://opendata.rdw.nl/resource/vezc-m2t6.json","https://opendata.rdw.nl/resource/jhie-znh9.json","https://opendata.rdw.nl/resource/kmfi-hrps.json"
"NH137S","Personenauto","MERCEDES-BENZ","A 220 D","20221215",,"5891","stationwagen","5","GRIJS","Niet geregistreerd","4","2143","1385","2010","1485","740","1500","20170327","20170327","Geen verstrekking in Open Data","47922","Ja",,,,,,,"5","4","0","0",,"0","0","M1",,,"onder r. voorzitting","2010","245 G",,"e1*2001/116*0470*17","12S2P2","MZAA1501","0","0.09","270","Ja","Nee",,"Nee","3510","0","0.00","2021","Logisch","00","Nee","2022-12-15T00:00:00.000",,"2017-03-27T00:00:00.000","2017-03-27T00:00:00.000",,,,,,,,,,,,,,,,,,,,,"E",,,,,,,"https://opendata.rdw.nl/resource/3huj-srit.json","https://opendata.rdw.nl/resource/8ys7-d773.json","https://opendata.rdw.nl/resource/vezc-m2t6.json","https://opendata.rdw.nl/resource/jhie-znh9.json","https://opendata.rdw.nl/resource/kmfi-hrps.json"
"NL638Z","Personenauto","MERCEDES-BENZ","CLA 220 D","20230313",,"6818","stationwagen","5","BLAUW","Niet geregistreerd","4","2143","1455","2050","1555","750","1500","20170313","20170313","Geen verstrekking in Open Data","51767","Nee",,,,,,,"5","4","0","0",,"469","178","M1",,,"onder r. voorzitting","2050","245 G",,"e1*2001/116*0470*16","22S2P2","MZBA1522","0","0.08","270","Ja","Nee",,"Nee","3590","0","0.00","2022","Logisch","00","Nee","2023-03-13T00:00:00.000",,"2017-03-13T00:00:00.000","2017-03-13T00:00:00.000",,,,,,,,,,,"146",,,,,,,,,,"D",,,,,,,"https://opendata.rdw.nl/resource/3huj-srit.json","https://opendata.rdw.nl/resource/8ys7-d773.json","https://opendata.rdw.nl/resource/vezc-m2t6.json","https://opendata.rdw.nl/resource/jhie-znh9.json","https://opendata.rdw.nl/resource/kmfi-hrps.json"
"NN103D","Personenauto","MERCEDES-BENZ","CLA 220 D","20230123",,"2422","sedan","5","GRIJS","Niet geregistreerd","4","2143","1425","2005","1525","750","1500","20160527","20180407","Geen verstrekking in Open Data","54287","Nee",,,,,,,"4","4","0","0",,"0","0","M1",,,"r. bodemplaat by voorzitting","2005","245 G",,"e1*2001/116*0470*15","23S2P2","MZAAA504","0","0.09","270","Ja","Nee",,"Nee","3545","0","0.00","2022","Geen oordeel","05","Nee","2023-01-23T00:00:00.000",,"2016-05-27T00:00:00.000","2018-04-07T00:00:00.000",,,,,,,,,,,,,,,,,,,,,"E",,,,,,,"https://opendata.rdw.nl/resource/3huj-srit.json","https://opendata.rdw.nl/resource/8ys7-d773.json","https://opendata.rdw.nl/resource/vezc-m2t6.json","https://opendata.rdw.nl/resource/jhie-znh9.json","https://opendata.rdw.nl/resource/kmfi-hrps.json"
"NP834J","Personenauto","MERCEDES-BENZ","GLA 220 D 4MATIC","20231025",,"8604","stationwagen","5","WIT","Niet geregistreerd","4","2143","1495","2075","1595","750","1800","20151116","20170322","Geen verstrekking in Open Data","59590","Nee",,,,,,,"5","4","0","0",,"0","0","M1",,,"by dwarsbalk r. voorzitting","2075","245 G",,"e1*2001/116*0470*15","27S2P1","MZAAA501","0","0.08","270","Ja","Nee",,"Nee","3930","0","0.00","2023","Geen oordeel","05","Nee","2023-10-25T00:00:00.000",,"2015-11-16T00:00:00.000","2017-03-22T00:00:00.000",,,,,,,,,,,,,,,,,,,,,"E",,,,,,,"https://opendata.rdw.nl/resource/3huj-srit.json","https://opendata.rdw.nl/resource/8ys7-d773.json","https://opendata.rdw.nl/resource/vezc-m2t6.json","https://opendata.rdw.nl/resource/jhie-znh9.json","https://opendata.rdw.nl/resource/kmfi-hrps.json"
"NS485L","Personenauto","MERCEDES-BENZ","GLA 220 D 4MATIC","20240407",,"11220","stationwagen","5","GROEN","Niet geregistreerd","4","2143","1495","2090","1595","750","1800","20170407","20170407","Geen verstrekking in Open Data","58978","Nee",,,,,,,"5","4","0","0",,"446","180","M1",,,"onder r. voorzitting","2090","245 G",,"e1*2001/116*0470*17","27S2P1","MZAA1501","0","0.08","270","Ja","Nee",,"Nee","3930","0","0.00","2023","Logisch","00","Nee","2024-04-07T00:00:00.000",,"2017-04-07T00:00:00.000","2017-04-07T00:00:00.000",,,,,,,,,,,"154",,,,,,,,,,"G",,,,,,,"https://opendata.rdw.nl/resource/3huj-srit.json","https://opendata.rdw.nl/resource/8ys7-d773.json","https://opendata.rdw.nl/resource/vezc-m2t6.json","https://opendata.rdw.nl/resource/jhie-znh9.json","https://opendata.rdw.nl/resource/kmfi-hrps.json"
"P125DF","Personenauto","MERCEDES-BENZ","CLA 220 D 4MATIC","20240210","20231218","2632","stationwagen","5","GRIJS","Niet geregistreerd","4","2143","1515","2100","1615","750","1500","20151123","20220204","Geen verstrekking in Open Data","56559","Ja","225",,,,,,"5","4","0","0",,"0","178","M1",,,,"2100","245 G",,"e1*2001/116*0470*15","22S2P1","MZAAA522","0","0.08","270","Ja","Nee",,"Nee","3645","0","0.00","2024","Geen oordeel","05","Nee","2024-02-10T00:00:00.000","2023-12-18T00:00:00.000","2015-11-23T00:00:00.000","2022-02-04T00:00:00.000",,,,,,,,,,,,,,,,,,,,,,"20220203","2022-02-03T00:00:00.000",,,,,"https://opendata.rdw.nl/resource/3huj-srit.json","https://opendata.rdw.nl/resource/8ys7-d773.json","https://opendata.rdw.nl/resource/vezc-m2t6.json","https://opendata.rdw.nl/resource/jhie-znh9.json","https://opendata.rdw.nl/resource/kmfi-hrps.json"