"kenteken","voertuigsoort","merk","handelsbenaming","vervaldatum_apk","datum_tenaamstelling","bruto_bpm","inrichting","aantal_zitplaatsen","eerste_kleur","tweede_kleur","aantal_cilinders","cilinderinhoud","massa_ledig_voertuig","toegestane_maximum_massa_voertuig","massa_rijklaar","maximum_massa_trekken_ongeremd","maximum_trekken_massa_geremd","datum_eerste_toelating","datum_eerste_tenaamstelling_in_nederland","wacht_op_keuren","catalogusprijs","wam_verzekerd","maximale_constructiesnelheid","laadvermogen","oplegger_geremd","aanhangwagen_autonoom_geremd","aanhangwagen_middenas_geremd","aantal_staanplaatsen","aantal_deuren","aantal_wielen","afstand_hart_koppeling_tot_achterzijde_voertuig","afstand_voorzijde_voertuig_tot_hart_koppeling","afwijkende_maximum_snelheid","lengte","breedte","europese_voertuigcategorie","europese_voertuigcategorie_toevoeging","europese_uitvoeringcategorie_toevoeging","plaats_chassisnummer","technische_max_massa_voertuig","type","type_gasinstallatie","typegoedkeuringsnummer","variant","uitvoering","volgnummer_wijziging_eu_typegoedkeuring","vermogen_massarijklaar","wielbasis","export_indicator","openstaande_terugroepactie_indicator","vervaldatum_tachograaf","taxi_indicator","maximum_massa_samenstelling","aantal_rolstoelplaatsen","maximum_ondersteunende_snelheid","jaar_laatste_registratie_tellerstand","tellerstandoordeel","code_toelichting_tellerstandoordeel","tenaamstellen_mogelijk","vervaldatum_apk_dt","datum_tenaamstelling_dt","datum_eerste_toelating_dt","datum_eerste_tenaamstelling_in_nederland_dt","vervaldatum_tachograaf_dt","maximum_last_onder_de_vooras_sen_tezamen_koppeling","type_remsysteem_voertuig_code","rupsonderstelconfiguratiecode","wielbasis_voertuig_minimum","wielbasis_voertuig_maximum","lengte_voertuig_minimum","lengte_voertuig_maximum","breedte_voertuig_minimum","breedte_voertuig_maximum","hoogte_voertuig","hoogte_voertuig_minimum","hoogte_voertuig_maximum","massa_bedrijfsklaar_minimaal","massa_bedrijfsklaar_maximaal","technisch_toelaatbaar_massa_koppelpunt","maximum_massa_technisch_maximaal","maximum_massa_technisch_minimaal","subcategorie_nederland","verticale_belasting_koppelpunt_getrokken_voertuig","zuinigheidsclassificatie","registratie_datum_goedkeuring_afschrijvingsmoment_bpm","registratie_datum_goedkeuring_afschrijvingsmoment_bpm_dt","gem_lading_wrde","aerodyn_voorz","massa_alt_aandr","verl_cab_ind","api_gekentekende_voertuigen_assen","api_gekentekende_voertuigen_brandstof","api_gekentekende_voertuigen_carrosserie","api_gekentekende_voertuigen_carrosserie_specifiek","api_gekentekende_voertuigen_voertuigklasse"
"1ZLT98","Personenauto","FORD-CNG-TECHNIK","C-MAX ENERGI","20240130",,"451","MPV","5","WIT","Niet geregistreerd","4","1999","1725","2250","1825",,,"20150130","20150130","Geen verstrekking in Open Data","36196","Nee",,,,,,,"4","4","0","0",,"440","0","M1",,,"r. deurstyl","2250","DXA-PHEV",,"e13*KS07/46*1465*00","UADA1P02","5HKFAERJ","0","0.02","265","Ja","Nee",,"Nee","0","0","0.00","2023","Logisch","00","Nee","2024-01-30T00:00:00.000",,"2015-01-30T00:00:00.000","2015-01-30T00:00:00.000",,,,,,,,,,,,,,,,,,,,,"A",,,,,,,"https://opendata.rdw.nl/resource/3huj-srit.json","https://opendata.rdw.nl/resource/8ys7-d773.json","https://opendata.rdw.nl/resource/vezc-m2t6.json","https://opendata.rdw.nl/resource/jhie-znh9.json","https://opendata.rdw.nl/resource/kmfi-hrps.json"
"2ZNL50","Personenauto","FORD-CNG-TECHNIK","C-MAX ENERGI","20240721",,"451","MPV","5","WIT","Niet geregistreerd","4","1999","1725","2250","1825",,,"20150205","20150205","Geen verstrekking in Open Data","36196","Nee",,,,,,,"4","4","0","0",,"440","0","M1",,,"r. deurstyl","2250","DXA-PHEV",,"e13*KS07/46*1465*00","UADA1P02","5HKFAERJ","0","0.02","265","Ja","Nee",,"Nee","0","0","0.00","2023","Logisch","00","Nee","2024-07-21T00:00:00.000",,"2015-02-05T00:00:00.000","2015-02-05T00:00:00.000",,,,,,,,,,,,,,,,,,,,,"A",,,,,,,"https://opendata.rdw.nl/resource/3huj-srit.json","https://opendata.rdw.nl/resource/8ys7-d773.json","https://opendata.rdw.nl/resource/vezc-m2t6.json","https://opendata.rdw.nl/resource/jhie-znh9.json","https://opendata.rdw.nl/resource/kmfi-hrps.json"
"3ZNT21","Personenauto","FORD-CNG-TECHNIK","C-MAX ENERGI","20231123",,"451","MPV","5","WIT","Niet geregistreerd","4","1999","1725","2250","1825",,,"20150219","20150219","Geen verstrekking in Open Data","36196","Nee",,,,,,,"4","4","0","0",,"440","0","M1",,,"r. deurstyl","2250","DXA-PHEV",,"e13*KS07/46*1465*00","UADA1P02","5HKFAERJ","0","0.02","265","Ja","Nee",,"Nee","0","0","0.00","2023","Logisch","00","Nee","2023-11-23T00:00:00.000",,"2015-02-19T00:00:00.000","2015-02-19T00:00:00.000",,,,,,,,,,,,,,,,,,,,,"A",,,,,,,"https://opendata.rdw.nl/resource/3huj-srit.json","https://opendata.rdw.nl/resource/8ys7-d773.json","https://opendata.rdw.nl/resource/vezc-m2t6.json","https://opendata.rdw.nl/resource/jhie-znh9.json","https://opendata.rdw.nl/resource/kmfi-hrps.json"
"4ZBX54","Personenauto","FORD-CNG-TECHNIK","C-MAX ENERGI","20231214",,,"MPV","5","ZWART","Niet geregistreerd","4","1999","1725","2250","1825",,,"20141210","20141210","Geen verstrekking in Open Data","35344","Nee",,,,,,,"4","4","0","0",,"440","0","M1",,,"r. deurstyl","2250","DXA-PHEV",,"e13*KS07/46*1465*00","UADA1P02","5HKFAERJ","0","0.02","265","Ja","Nee",,"Nee","0","0","0.00","2023","Logisch","00","Nee","2023-12-14T00:00:00.000",,"2014-12-10T00:00:00.000","2014-12-10T00:00:00.000",,,,,,,,,,,,,,,,,,,,,"A",,,,,,,"https://opendata.rdw.nl/resource/3huj-srit.json","https://opendata.rdw.nl/resource/8ys7-d773.json","https://opendata.rdw.nl/resource/vezc-m2t6.json","https://opendata.rdw.nl/resource/jhie-znh9.json","https://opendata.rdw.nl/resource/kmfi-hrps.json"
"GG550F","Personenauto","FORD-CNG-TECHNIK","C-MAX ENERGI","20240120",,"451","MPV","5","ZWART","Niet geregistreerd","4","1999","1725","2250","1825",,,"20150519","20150519","Geen verstrekking in Open Data","35795","Nee",,,,,,,"4","4","0","0",,"440","0","M1",,,"r. deurstyl","2250","DXA-PHEV",,"e13*KS07/46*1465*00","UADA1P02","5HKFAERJ","0","0.02","265","Ja","Nee",,"Nee","0","0","0.00","2023","Logisch","00","Nee","2024-01-20T00:00:00.000",,"2015-05-19T00:00:00.000","2015-05-19T00:00:00.000",,,,,,,,,,,,,,,,,,,,,"A",,,,,,,"https://opendata.rdw.nl/resource/3huj-srit.json","https://opendata.rdw.nl/resource/8ys7-d773.json","https://opendata.rdw.nl/resource/vezc-m2t6.json","https://opendata.rdw.nl/resource/jhie-znh9.json","https://opendata.rdw.nl/resource/kmfi-hrps.json"
"GJ137Z","Personenauto","FORD-CNG-TECHNIK","C-MAX ENERGI","20240610",,"451","MPV","5","GRIJS","Niet geregistreerd","4","1999","1725","2250","1825",,,"20150610","20150610","Geen verstrekking in Open Data","35795","Nee",,,,,,,"4","4","0","0",,"440","0","M1",,,"r. deurstyl","2250","DXA-PHEV",,"e13*KS07/46*1465*00","UADA1P02","5HKFAERJ","0","0.02","265","Ja","Nee",,"Nee","0","0","0.00","2023","Logisch","00","Nee","2024-06-10T00:00:00.000",,"2015-06-10T00:00:00.000","2015-06-10T00:00:00.000",,,,,,,,,,,,,,,,,,,,,"A",,,,,,,"https://opendata.rdw.nl/resource/3huj-srit.json","https://opendata.rdw.nl/resource/8ys7-d773.json","https://opendata.rdw.nl/resource/vezc-m2t6.json","https://opendata.rdw.nl/resource/jhie-znh9.json","https://opendata.rdw.nl/resource/kmfi-hrps.json"
"GJ565J","Personenauto","FORD-CNG-TECHNIK","C-MAX ENERGI","20240613",,"451","MPV","5","ZWART","Niet geregistreerd","4","1999","1725","2250","1825",,,"20150602","20150602","Geen verstrekking in Open Data","35795","Nee",,,,,,,"4","4","0","0",,"440","0","M1",,,"r. deurstyl","2250","DXA-PHEV",,"e13*KS07/46*1465*00","UADA1P02","5HKFAERJ","0","0.02","265","Ja","Nee",,"Nee","0","0","0.00","2023","Logisch","00","Nee","2024-06-13T00:00:00.000",,"2015-06-02T00:00:00.000","2015-06-02T00:00:00.000",,,,,,,,,,,,,,,,,,,,,"A",,,,,,,"https://opendata.rdw.nl/resource/3huj-srit.json","https://opendata.rdw.nl/resource/8ys7-d773.json","https://opendata.rdw.nl/resource/vezc-m2t6.json","https://opendata.rdw.nl/resource/jhie-znh9.json","https://opendata.rdw.nl/resource/kmfi-hrps.json"
"GL307D","Personenauto","FORD-CNG-TECHNIK","C-MAX ENERGI","20240630",,"451","MPV","5","GRIJS","Niet geregistreerd","4","1999","1725","2250","1825",,,"20150630","20150630","Geen verstrekking in Open Data","35795","Nee",,,,,,,"4","4","0","0",,"440","0","M1",,,"r. deurstyl","2250","DXA-PHEV",,"e13*KS07/46*1465*00","UADA1P02","5HKFAERJ","0","0.02","265","Ja","Nee",,"Nee","0","0","0.00","2023","Logisch","00","Nee","2024-06-30T00:00:00.000",,"2015-06-30T00:00:00.000","2015-06-30T00:00:00.000",,,,,,,,,,,,,,,,,,,,,"A",,,,,,,"https://opendata.rdw.nl/resource/3huj-srit.json","https://opendata.rdw.nl/resource/8ys7-d773.json","https://opendata.rdw.nl/resource/vezc-m2t6.json","https://opendata.rdw.nl/resource/jhie-znh9.json","https://opendata.rdw.nl/resource/kmfi-hrps.json"
"GL315P","Personenauto","FORD-CNG-TECHNIK","C-MAX ENERGI","20240629","20240312","451","MPV","5","GRIJS","Niet geregistreerd","4","1999","1725","2250","1825",,,"20150629","20150629","Geen verstrekking in Open Data","35795","Ja",,,,,,,"4","4","0","0",,"440","0","M1",,,"r. deurstyl","2250","DXA-PHEV",,"e13*KS07/46*1465*00","UADA1P02","5HKFAERJ","0","0.02","265","Ja","Nee",,"Nee","0","0","0.00","2024","Logisch","00","Nee","2024-06-29T00:00:00.000","2024-03-12T00:00:00.000","2015-06-29T00:00:00.000","2015-06-29T00:00:00.000",,,,,,,,,,,,,,,,,,,,,"A",,,,,,,"https://opendata.rdw.nl/resource/3huj-srit.json","https://opendata.rdw.nl/resource/8ys7-d773.json","https://opendata.rdw.nl/resource/vezc-m2t6.json","https://opendata.rdw.nl/resource/jhie-znh9.json","https://opendata.rdw.nl/resource/kmfi-hrps.json"
"GL588G","Personenauto","FORD-CNG-TECHNIK","C-MAX ENERGI","20240626",,"451","MPV","5","GRIJS","Niet geregistreerd","4","1999","1725","2250","1825",,,"20150626","20150626","Geen verstrekking in Open Data","35795","Nee",,,,,,,"4","4","0","0",,"440","0","M1",,,"r. deurstyl","2250","DXA-PHEV",,"e13*KS07/46*1465*00","UADA1P02","5HKFAERJ","0","0.02","265","Ja","Nee",,"Nee","0","0","0.00","2023","Logisch","00","Nee","2024-06-26T00:00:00.000",,"2015-06-26T00:00:00.000","2015-06-26T00:00:00.000",,,,,,,,,,,,,,,,,,,,,"A",,,,,,,"https://opendata.rdw.nl/resource/3huj-srit.json","https://opendata.rdw.nl/resource/8ys7-d773.json","https://opendata.rdw.nl/resource/vezc-m2t6.json","https://opendata.rdw.nl/resource/jhie-znh9.json","https://opendata.rdw.nl/resource/kmfi-hrps.json"
"GN739G","Personenauto","FORD-CNG-TECHNIK","C-MAX ENERGI","20230805",,"451","MPV","5","GRIJS","Niet geregistreerd","4","1999","1725","2250","1825",,,"20150703","20150703","Geen verstrekking in Open Data","35795","Nee",,,,,,,"4","4","0","0",,"440","0","M1",,,"r. deurstyl","2250","DXA-PHEV",,"e13*KS07/46*1465*00","UADA1P02","5HKFAERJ","0","0.02","265","Ja","Nee",,"Nee","0","0","0.00","2023","Logisch","00","Nee","2023-08-05T00:00:00.000",,"2015-07-03T00:00:00.000","2015-07-03T00:00:00.000",,,,,,,,,,,,,,,,,,,,,"A",,,,,,,"https://opendata.rdw.nl/resource/3huj-srit.json","https://opendata.rdw.nl/resource/8ys7-d773.json","https://opendata.rdw.nl/resource/vezc-m2t6.json","https://opendata.rdw.nl/resource/jhie-znh9.json","https://opendata.rdw.nl/resource/kmfi-hrps.json"
"GN806Z","Personenauto","FORD-CNG-TECHNIK","C-MAX ENERGI","20240714",,"451","MPV","5","WIT","Niet geregistreerd","4","1999","1725","2250","1825",,,"20150714","20150714","Geen verstrekking in Open Data","34995","Nee",,,,,,,"4","4","0","0",,"440","0","M1",,,"r. deurstyl","2250","DXA-PHEV",,"e13*KS07/46*1465*00","UADA1P02","5HKFAERJ","0","0.02","265","Ja","Nee",,"Nee","0","0","0.00","2023","Logisch","00","Nee","2024-07-14T00:00:00.000",,"2015-07-14T00:00:00.000","2015-07-14T00:00:00.000",,,,,,,,,,,,,,,,,,,,,"A",,,,,,,"https://opendata.rdw.nl/resource/3huj-srit.json","https://opendata.rdw.nl/resource/8ys7-d773.json","https://opendata.rdw.nl/resource/vezc-m2t6.json","https://opendata.rdw.nl/resource/jhie-znh9.json","https://opendata.rdw.nl/resource/kmfi-hrps.json"
"GP520G","Personenauto","FORD-CNG-TECHNIK","C-MAX ENERGI","20240715",,"451","MPV","5","ZWART","Niet geregistreerd","4","1999","1725","2250","1825",,,"20150715","20150715","Geen verstrekking in Open Data","35795","Nee",,,,,,,"4","4","0","0",,"440","0","M1",,,"r. deurstyl","2250","DXA-PHEV",,"e13*KS07/46*1465*00","UADA1P02","5HKFAERJ","0","0.02","265","Ja","Nee",,"Nee","0","0","0.00","2023","Logisch","00","Nee","2024-07-15T00:00:00.000",,"2015-07-15T00:00:00.000","2015-07-15T00:00:00.000",,,,,,,,,,,,,,,,,,,,,"A",,,,,,,"https://opendata.rdw.nl/resource/3huj-srit.json","https://opendata.rdw.nl/resource/8ys7-d773.json","https://opendata.rdw.nl/resource/vezc-m2t6.json","https://opendata.rdw.nl/resource/jhie-znh9.json","https://opendata.rdw.nl/resource/kmfi-hrps.json"
"GR683S","Personenauto","FORD-CNG-TECHNIK","C-MAX ENERGI","20231104",,"451","MPV","5","GRIJS","Niet geregistreerd","4","1999","1725","2250","1825",,,"20150804","20150804","Geen verstrekking in Open Data","35795","Nee",,,,,,,"4","4","0","0",,"440","0","M1",,,"r. deurstyl","2250","DXA-PHEV",,"e13*KS07/46*1465*00","UADA1P02","5HKFAERJ","0","0.02","265","Ja","Nee",,"Nee","0","0","0.00","2023","Logisch","00","Nee","2023-11-04T00:00:00.000",,"2015-08-04T00:00:00.000","2015-08-04T00:00:00.000",,,,,,,,,,,,,,,,,,,,,"A",,,,,,,"https://opendata.rdw.nl/resource/3huj-srit.json","https://opendata.rdw.nl/resource/8ys7-d773.json","https://opendata.rdw.nl/resource/vezc-m2t6.json","https://opendata.rdw.nl/resource/jhie-znh9.json","https://opendata.rdw.nl/resource/kmfi-hrps.json"
"GS037X","Personenauto","FORD-CNG-TECHNIK","C-MAX ENERGI","20230811",,"451","MPV","5","WIT","Niet geregistreerd","4","1999","1725","2250","1825",,,"20150811","20150811","Geen verstrekking in Open Data","34995","Nee",,,,,,,"4","4","0","0",,"440","0","M1",,,"r. deurstyl","2250","DXA-PHEV",,"e13*KS07/46*1465*00","UADA1P02","5HKFAERJ","0","0.02","265","Ja","Nee",,"Nee","0","0","0.00","2022","Logisch","00","Nee","2023-08-11T00:00:00.000",,"2015-08-11T00:00:00.000","2015-08-11T00:00:00.000",,,,,,,,,,,,,,,,,,,,,"A",,,,,,,"https://opendata.rdw.nl/resource/3huj-srit.json","https://opendata.rdw.nl/resource/8ys7-d773.json","https://opendata.rdw.nl/resource/vezc-m2t6.json","https://opendata.rdw.nl/resource/jhie-znh9.json","https://opendata.rdw.nl/resource/kmfi-hrps.json"
"GS647L","Personenauto","FORD-CNG-TECHNIK","C-MAX ENERGI","20240804",,"451","MPV","5","ZWART","Niet geregistreerd","4","1999","1725","2250","1825",,,"20150804","20150804","Geen verstrekking in Open Data","35795","Nee",,,,,,,"4","4","0","0",,"440","0","M1",,,"r. deurstyl","2250","DXA-PHEV",,"e13*KS07/46*1465*00","UADA1P02","5HKFAERJ","0","0.02","265","Ja","Nee",,"Nee","0","0","0.00","2023","Logisch","00","Nee","2024-08-04T00:00:00.000",,"2015-08-04T00:00:00.000","2015-08-04T00:00:00.000",,,,,,,,,,,,,,,,,,,,,"A",,,,,,,"https://opendata.rdw.nl/resource/3huj-srit.json","https://opendata.rdw.nl/resource/8ys7-d773.json","https://opendata.rdw.nl/resource/vezc-m2t6.json","https://opendata.rdw.nl/resource/jhie-znh9.json","https://opendata.rdw.nl/resource/kmfi-hrps.json"
"GS755B","Personenauto","FORD-CNG-TECHNIK","C-MAX ENERGI","20240929",,"451","MPV","5","GRIJS","Niet geregistreerd","4","1999","1725","2250","1825",,,"20150803","20150803","Geen verstrekking in Open Data","35795","Nee",,,,,,,"4","4","0","0",,"440","0","M1",,,"r. deurstyl","2250","DXA-PHEV",,"e13*KS07/46*1465*00","UADA1P02","5HKFAERJ","0","0.02","265","Ja","Nee",,"Nee","0","0","0.00","2023","Logisch","00","Nee","2024-09-29T00:00:00.000",,"2015-08-03T00:00:00.000","2015-08-03T00:00:00.000",,,,,,,,,,,,,,,,,,,,,"A",,,,,,,"https://opendata.rdw.nl/resource/3huj-srit.json","https://opendata.rdw.nl/resource/8ys7-d773.json","https://opendata.rdw.nl/resource/vezc-m2t6.json","https://opendata.rdw.nl/resource/jhie-znh9.json","https://opendata.rdw.nl/resource/kmfi-hrps.json"
"GT341R","Personenauto","FORD-CNG-TECHNIK","C-MAX ENERGI","20241205","20231223",,"MPV","5","BLAUW","Niet geregistreerd","4","1999","1725","2250","1825",,,"20141203","20150829","Geen verstrekking in Open Data","34544","Ja",,,,,,,"4","4","0","0",,"440","0","M1",,,"r. deurstyl","2250","DXA-PHEV",,"e13*KS07/46*1465*00","UADA1P02","5HKFAERJ","0","0.02","265","Ja","Nee",,"Nee","0","0","0.00","2024","Geen oordeel","05","Nee","2024-12-05T00:00:00.000","2023-12-23T00:00:00.000","2014-12-03T00:00:00.000","2015-08-29T00:00:00.000",,,,,,,,,,,,,,,,,,,,,"A",,,,,,,"https://opendata.rdw.nl/resource/3huj-srit.json","https://opendata.rdw.nl/resource/8ys7-d773.json","https://opendata.rdw.nl/resource/vezc-m2t6.json","https://opendata.rdw.nl/resource/jhie-znh9.json","https://opendata.rdw.nl/resource/kmfi-hrps.json"
"GV059G","Personenauto","FORD-CNG-TECHNIK","C-MAX ENERGI","20241030","20240305","451","MPV","5","ZWART","Niet geregistreerd","4","1999","1725","2250","1825",,,"20150902","20150902","Geen verstrekking in Open Data","35795","Nee",,,,,,,"4","4","0","0",,"440","0","M1",,,"r. deurstyl","2250","DXA-PHEV",,"e13*KS07/46*1465*00","UADA1P02","5HKFAERJ","0","0.02","265","Ja","Nee",,"Nee","0","0","0.00","2024","Logisch","00","Nee","2024-10-30T00:00:00.000","2024-03-05T00:00:00.000","2015-09-02T00:00:00.000","2015-09-02T00:00:00.000",,,,,,,,,,,,,,,,,,,,,"A",,,,,,,"https://opendata.rdw.nl/resource/3huj-srit.json","https://opendata.rdw.nl/resource/8ys7-d773.json","https://opendata.rdw.nl/resource/vezc-m2t6.json","https://opendata.rdw.nl/resource/jhie-znh9.json","https://opendata.rdw.nl/resource/kmfi-hrps.json"
"GV791P","Personenauto","FORD-CNG-TECHNIK","C-MAX ENERGI","20230902",,"451","MPV","5","BLAUW","Niet geregistreerd","4","1999","1725","2250","1825",,,"20150902","20150902","Geen verstrekking in Open Data","35945","Nee",,,,,,,"4","4","0","0",,"440","0","M1",,,"r. deurstyl","2250","DXA-PHEV",,"e13*KS07/46*1465*00","UADA1P02","5HKFAERJ","0","0.02","265","Ja","Nee",,"Nee","0","0","0.00","2022","Logisch","00","Nee","2023-09-02T00:00:00.000",,"2015-09-02T00:00:00.000","2015-09-02T00:00:00.000",,,,,,,,,,,,,,,,,,,,,"A",,,,,,,"https://opendata.rdw.nl/resource/3huj-srit.json","https://opendata.rdw.nl/resource/8ys7-d773.json","https://opendata.rdw.nl/resource/vezc-m2t6.json","https://opendata.rdw.nl/resource/jhie-znh9.json","https://opendata.rdw.nl/resource/kmfi-hrps.json"
"GV940P","Personenauto","FORD-CNG-TECHNIK","C-MAX ENERGI","20230831",,"451","MPV","5","BLAUW","Niet geregistreerd","4","1999","1725","2250","1825",,,"20150831","20150831","Geen verstrekking in Open Data","35945","Nee",,,,,,,"4","4","0","0",,"440","0","M1",,,"r. deurstyl","2250","DXA-PHEV",,"e13*KS07/46*1465*00","UADA1P02","5HKFAERJ","0","0.02","265","Ja","Nee",,"Nee","0","0","0.00","2022","Logisch","00","Nee","2023-08-31T00:00:00.000",,"2015-08-31T00:00:00.000","2015-08-31T00:00:00.000",,,,,,,,,,,,,,,,,,,,,"A",,,,,,,"https://opendata.rdw.nl/resource/3huj-srit.json","https://opendata.rdw.nl/resource/8ys7-d773.json","https://opendata.rdw.nl/resource/vezc-m2t6.json","https://opendata.rdw.nl/resource/jhie-znh9.json","https://opendata.rdw.nl/resource/kmfi-hrps.json"
"GV998F","Personenauto","FORD-CNG-TECHNIK","C-MAX ENERGI","20240405",,"451","MPV","5","ZWART","Niet geregistreerd","4","1999","1725","2250","1825",,,"20150831","20150831","Geen verstrekking in Open Data","35795","Nee",,,,,,,"4","4","0","0",,"440","0","M1",,,"r. deurstyl","2250","DXA-PHEV",,"e13*KS07/46*1465*00","UADA1P02","5HKFAERJ","0","0.02","265","Ja","Nee",,"Nee","0","0","0.00","2023","Logisch","00","Nee","2024-04-05T00:00:00.000",,"2015-08-31T00:00:00.000","2015-08-31T00:00:00.000",,,,,,,,,,,,,,,,,,,,,"A",,,,,,,"https://opendata.rdw.nl/resource/3huj-srit.json","https://opendata.rdw.nl/resource/8ys7-d773.json","https://opendata.rdw.nl/resource/vezc-m2t6.json","https://opendata.rdw.nl/resource/jhie-znh9.json","https://opendata.rdw.nl/resource/kmfi-hrps.json"
"HF993X","Personenauto","FORD-CNG-TECHNIK","C-MAX ENERGI","20241124","20231123","451","MPV","5","ZWART","Niet geregistreerd","4","1999","1725","2250","1825",,,"20151028","20151028","Geen verstrekking in Open Data","37795","Ja",,,,,,,"4","4","0","0",,"440","0","M1",,,"r. deurstyl","2250","DXA-PHEV",,"e13*KS07/46*1465*00","UADA1P02","5HKFAERJ","0","0.02","265","Ja","Nee",,"Nee","0","0","0.00","2024","Logisch","00","Nee","2024-11-24T00:00:00.000","2023-11-23T00:00:00.000","2015-10-28T00:00:00.000","2015-10-28T00:00:00.000",,,,,,,,,,,,,,,,,,,,,"A",,,,,,,"https://opendata.rdw.nl/resource/3huj-srit.json","https://opendata.rdw.nl/resource/8ys7-d773.json","https://opendata.rdw.nl/resource/vezc-m2t6.json","https://opendata.rdw.nl/resource/jhie-znh9.json","https://opendata.rdw.nl/resource/kmfi-hrps.json"
"HG860G","Personenauto","FORD-CNG-TECHNIK","C-MAX ENERGI","20231028",,"451","MPV","5","GRIJS","Niet geregistreerd","4","1999","1725","2250","1825",,,"20151028","20151028","Geen verstrekking in Open Data","37795","Nee",,,,,,,"4","4","0","0",,"440","0","M1",,,"r. deurstyl","2250","DXA-PHEV",,"e13*KS07/46*1465*00","UADA1P02","5HKFAERJ","0","0.02","265","Ja","Nee",,"Nee","0","0","0.00","2023","Onlogisch","04","Nee","2023-10-28T00:00:00.000",,"2015-10-28T00:00:00.000","2015-10-28T00:00:00.000",,,,,,,,,,,,,,,,,,,,,"A",,,,,,,"https://opendata.rdw.nl/resource/3huj-srit.json","https://opendata.rdw.nl/resource/8ys7-d773.json","https://opendata.rdw.nl/resource/vezc-m2t6.json","https://opendata.rdw.nl/resource/jhie-znh9.json","https://opendata.rdw.nl/resource/kmfi-hrps.json"
"HH048Z","Personenauto","FORD-CNG-TECHNIK","C-MAX ENERGI","20231211",,"451","MPV","5","GRIJS","Niet geregistreerd","4","1999","1725","2250","1825",,,"20151109","20151109","Geen verstrekking in Open Data","37795","Nee",,,,,,,"4","4","0","0",,"440","0","M1",,,"r. deurstyl","2250","DXA-PHEV",,"e13*KS07/46*1465*00","UADA1P02","5HKFAERJ","0","0.02","265","Ja","Nee",,"Nee","0","0","0.00","2023","Logisch","00","Nee","2023-12-11T00:00:00.000",,"2015-11-09T00:00:00.000","2015-11-09T00:00:00.000",,,,,,,,,,,,,,,,,,,,,"A",,,,,,,"https://opendata.rdw.nl/resource/3huj-srit.json","https://opendata.rdw.nl/resource/8ys7-d773.json","https://opendata.rdw.nl/resource/vezc-m2t6.json","https://opendata.rdw.nl/resource/jhie-znh9.json","https://opendata.rdw.nl/resource/kmfi-hrps.json"
"HH057Z","Personenauto","FORD-CNG-TECHNIK","C-MAX ENERGI","20240729",,"451","MPV","5","GRIJS","Niet geregistreerd","4","1999","1725","2250","1825",,,"20151110","20151110","Geen verstrekking in Open Data","37795","Nee",,,,,,,"4","4","0","0",,"440","0","M1",,,"r. deurstyl","2250","DXA-PHEV",,"e13*KS07/46*1465*00","UADA1P02","5HKFAERJ","0","0.02","265","Ja","Nee",,"Nee","0","0","0.00","2023","Logisch","00","Nee","2024-07-29T00:00:00.000",,"2015-11-10T00:00:00.000","2015-11-10T00:00:00.000",,,,,,,,,,,,,,,,,,,,,"A",,,,,,,"https://opendata.rdw.nl/resource/3huj-srit.json","https://opendata.rdw.nl/resource/8ys7-d773.json","https://opendata.rdw.nl/resource/vezc-m2t6.json","https://opendata.rdw.nl/resource/jhie-znh9.json","https://opendata.rdw.nl/resource/kmfi-hrps.json"
"HH270P","Personenauto","FORD-CNG-TECHNIK","C-MAX ENERGI","20231030",,"451","MPV","5","GRIJS","Niet geregistreerd","4","1999","1725","2250","1825",,,"20151030","20151030","Geen verstrekking in Open Data","37795","Nee",,,,,,,"4","4","0","0",,"440","0","M1",,,"r. deurstyl","2250","DXA-PHEV",,"e13*KS07/46*1465*00","UADA1P02","5HKFAERJ","0","0.02","265","Ja","Nee",,"Nee","0","0","0.00","2022","Logisch","00","Nee","2023-10-30T00:00:00.000",,"2015-10-30T00:00:00.000","2015-10-30T00:00:00.000",,,,,,,,,,,,,,,,,,,,,"A",,,,,,,"https://opendata.rdw.nl/resource/3huj-srit.json","https://opendata.rdw.nl/resource/8ys7-d773.json","https://opendata.rdw.nl/resource/vezc-m2t6.json","https://opendata.rdw.nl/resource/jhie-znh9.json","https://opendata.rdw.nl/resource/kmfi-hrps.json"