"kenteken","voertuigsoort","merk","handelsbenaming","vervaldatum_apk","datum_tenaamstelling","bruto_bpm","inrichting","aantal_zitplaatsen","eerste_kleur","tweede_kleur","aantal_cilinders","cilinderinhoud","massa_ledig_voertuig","toegestane_maximum_massa_voertuig","massa_rijklaar","maximum_massa_trekken_ongeremd","maximum_trekken_massa_geremd","datum_eerste_toelating","datum_eerste_tenaamstelling_in_nederland","wacht_op_keuren","catalogusprijs","wam_verzekerd","maximale_constructiesnelheid","laadvermogen","oplegger_geremd","aanhangwagen_autonoom_geremd","aanhangwagen_middenas_geremd","aantal_staanplaatsen","aantal_deuren","aantal_wielen","afstand_hart_koppeling_tot_achterzijde_voertuig","afstand_voorzijde_voertuig_tot_hart_koppeling","afwijkende_maximum_snelheid","lengte","breedte","europese_voertuigcategorie","europese_voertuigcategorie_toevoeging","europese_uitvoeringcategorie_toevoeging","plaats_chassisnummer","technische_max_massa_voertuig","type","type_gasinstallatie","typegoedkeuringsnummer","variant","uitvoering","volgnummer_wijziging_eu_typegoedkeuring","vermogen_massarijklaar","wielbasis","export_indicator","openstaande_terugroepactie_indicator","vervaldatum_tachograaf","taxi_indicator","maximum_massa_samenstelling","aantal_rolstoelplaatsen","maximum_ondersteunende_snelheid","jaar_laatste_registratie_tellerstand","tellerstandoordeel","code_toelichting_tellerstandoordeel","tenaamstellen_mogelijk","vervaldatum_apk_dt","datum_tenaamstelling_dt","datum_eerste_toelating_dt","datum_eerste_tenaamstelling_in_nederland_dt","vervaldatum_tachograaf_dt","maximum_last_onder_de_vooras_sen_tezamen_koppeling","type_remsysteem_voertuig_code","rupsonderstelconfiguratiecode","wielbasis_voertuig_minimum","wielbasis_voertuig_maximum","lengte_voertuig_minimum","lengte_voertuig_maximum","breedte_voertuig_minimum","breedte_voertuig_maximum","hoogte_voertuig","hoogte_voertuig_minimum","hoogte_voertuig_maximum","massa_bedrijfsklaar_minimaal","massa_bedrijfsklaar_maximaal","technisch_toelaatbaar_massa_koppelpunt","maximum_massa_technisch_maximaal","maximum_massa_technisch_minimaal","subcategorie_nederland","verticale_belasting_koppelpunt_getrokken_voertuig","zuinigheidsclassificatie","registratie_datum_goedkeuring_afschrijvingsmoment_bpm","registratie_datum_goedkeuring_afschrijvingsmoment_bpm_dt","gem_lading_wrde","aerodyn_voorz","massa_alt_aandr","verl_cab_ind","api_gekentekende_voertuigen_assen","api_gekentekende_voertuigen_brandstof","api_gekentekende_voertuigen_carrosserie","api_gekentekende_voertuigen_carrosserie_specifiek","api_gekentekende_voertuigen_voertuigklasse"
"1ZGF25","Personenauto","FORD","ECOSPORT","20240113",,"3906","hatchback","5","WIT","Niet geregistreerd","3","998","1250","1715","1350","675","750","20141229","20141229","Geen verstrekking in Open Data","21790","Nee",,,,,,,"4","4","0","0",,"427","0","M1",,,"r. bodemplaat onder voorzitting","1715","JK8",,"e9*2007/46*0092*06","M1JC1B","5AABMS","0","0.07","252","Ja","Nee",,"Nee","2465","0",,"2023","Logisch","00","Nee","2024-01-13T00:00:00.000",,"2014-12-29T00:00:00.000","2014-12-29T00:00:00.000",,,,,,,,,,,,,,,,,,,,,"B",,,,,,,"https://opendata.rdw.nl/resource/3huj-srit.json","https://opendata.rdw.nl/resource/8ys7-d773.json","https://opendata.rdw.nl/resource/vezc-m2t6.json","https://opendata.rdw.nl/resource/jhie-znh9.json","https://opendata.rdw.nl/resource/kmfi-hrps.json"
"6XHG68","Personenauto","FORD","ECOSPORT","20240726",,"3906","hatchback","5","ZWART","Niet geregistreerd","3","998","1250","1715","1350","675","750","20140731","20140731","Geen verstrekking in Open Data","25244","Nee",,,,,,,"4","4","0","0",,"427","0","M1",,,"r. bodemplaat onder voorzitting","1715","JK8",,"e9*2007/46*0092*05","M1JC1B","5AABMS","0","0.07","252","Ja","Nee",,"Nee","2465","0",,"2024","Logisch","00","Nee","2024-07-26T00:00:00.000",,"2014-07-31T00:00:00.000","2014-07-31T00:00:00.000",,,,,,,,,,,,,,,,,,,,,"B",,,,,,,"https://opendata.rdw.nl/resource/3huj-srit.json","https://opendata.rdw.nl/resource/8ys7-d773.json","https://opendata.rdw.nl/resource/vezc-m2t6.json","https://opendata.rdw.nl/resource/jhie-znh9.json","https://opendata.rdw.nl/resource/kmfi-hrps.json"
"6XXV25","Personenauto","FORD","ECOSPORT","20231121",,"3906","hatchback","5","BLAUW","Niet geregistreerd","3","998","1250","1715","1350","675","750","20141121","20141121","Geen verstrekking in Open Data","22990","Nee",,,,,,,"4","4","0","0",,"427","0","M1",,,"r. bodemplaat onder voorzitting","1715","JK8",,"e9*2007/46*0092*06","M1JC1B","5AABMS","0","0.07","252","Ja","Nee",,"Nee","2465","0",,"2023","Logisch","00","Nee","2023-11-21T00:00:00.000",,"2014-11-21T00:00:00.000","2014-11-21T00:00:00.000",,,,,,,,,,,,,,,,,,,,,"B",,,,,,,"https://opendata.rdw.nl/resource/3huj-srit.json","https://opendata.rdw.nl/resource/8ys7-d773.json","https://opendata.rdw.nl/resource/vezc-m2t6.json","https://opendata.rdw.nl/resource/jhie-znh9.json","https://opendata.rdw.nl/resource/kmfi-hrps.json"
"9XBK11","Personenauto","FORD","ECOSPORT","20250110","20240113","3906","hatchback","5","BLAUW","Niet geregistreerd","3","998","1250","1715","1350","675","750","20140630","20140630","Geen verstrekking in Open Data","25645","Nee",,,,,,,"4","4","0","0",,"427","0","M1",,,"r. bodemplaat onder voorzitting","1715","JK8",,"e9*2007/46*0092*05","M1JC1B","5AABMS","0","0.07","252","Ja","Nee",,"Nee","2465","0",,"2024","Logisch","00","Nee","2025-01-10T00:00:00.000","2024-01-13T00:00:00.000","2014-06-30T00:00:00.000","2014-06-30T00:00:00.000",,,,,,,,,,,,,,,,,,,,,"B",,,,,,,"https://opendata.rdw.nl/resource/3huj-srit.json","https://opendata.rdw.nl/resource/8ys7-d773.json","https://opendata.rdw.nl/resource/vezc-m2t6.json","https://opendata.rdw.nl/resource/jhie-znh9.json","https://opendata.rdw.nl/resource/kmfi-hrps.json"
"G013ZJ","Personenauto","FORD","ECOSPORT","20240703",,"2070","hatchback","5","ROOD","Niet geregistreerd","3","998","1249","1730","1349","670","900","20180703","20200213","Geen verstrekking in Open Data","26988","Nee","180",,,,,,"4","4","0","0",,"0","177","M1",,,,"1730","JK8",,"e9*2007/46*0092*21","M1JU11X","5AAPZNAB4SV","0","0.07","252","Ja","Nee",,"Nee","2630","0","0.00","2023","Geen oordeel","05","Nee","2024-07-03T00:00:00.000",,"2018-07-03T00:00:00.000","2020-02-13T00:00:00.000",,,,,,,,,,,,,,,,,,,,,,,,,,,,"https://opendata.rdw.nl/resource/3huj-srit.json","https://opendata.rdw.nl/resource/8ys7-d773.json","https://opendata.rdw.nl/resource/vezc-m2t6.json","https://opendata.rdw.nl/resource/jhie-znh9.json","https://opendata.rdw.nl/resource/kmfi-hrps.json"
"G079TB","Personenauto","FORD","ECOSPORT",,,"5086","hatchback","5","GRIJS","Niet geregistreerd","3","998","1249","1730","1349","670","900","20191130","20191130","Geen verstrekking in Open Data","23934","Ja","180",,,,,,"4","4","0","0",,"433","177","M1",,,,"1730","JK8",,"e9*2007/46*0092*28","M1JU11X","5AAPZNAB4DV","0","0.07","252","Ja","Nee",,"Nee","2630","0","0.00","2023","Logisch","00","Nee",,,"2019-11-30T00:00:00.000","2019-11-30T00:00:00.000",,,,,,,,,,,"166",,,,,,,,,,,,,,,,,"https://opendata.rdw.nl/resource/3huj-srit.json","https://opendata.rdw.nl/resource/8ys7-d773.json","https://opendata.rdw.nl/resource/vezc-m2t6.json","https://opendata.rdw.nl/resource/jhie-znh9.json","https://opendata.rdw.nl/resource/kmfi-hrps.json"
"G239TF","Personenauto","FORD","ECOSPORT","20251201",,"5086","hatchback","5","BLAUW","Niet geregistreerd","3","998","1249","1730","1349","670","900","20191129","20191129","Geen verstrekking in Open Data","28086","Nee","180",,,,,,"4","4","0","0",,"433","177","M1",,,,"1730","JK8",,"e9*2007/46*0092*25","M1JU11X","5AAPZNAB4DV","0","0.07","252","Ja","Nee",,"Nee","2630","0","0.00","2023","Logisch","00","Nee","2025-12-01T00:00:00.000",,"2019-11-29T00:00:00.000","2019-11-29T00:00:00.000",,,,,,,,,,,"166",,,,,,,,,,,,,,,,,"https://opendata.rdw.nl/resource/3huj-srit.json","https://opendata.rdw.nl/resource/8ys7-d773.json","https://opendata.rdw.nl/resource/vezc-m2t6.json","https://opendata.rdw.nl/resource/jhie-znh9.json","https://opendata.rdw.nl/resource/kmfi-hrps.json"
"G447PR","Personenauto","FORD","ECOSPORT","20251107","20240513","5086","hatchback","5","BLAUW","Niet geregistreerd","3","998","1249","1730","1349","670","900","20191107","20191107","Geen verstrekking in Open Data","23685","Ja","180",,,,,,"4","4","0","0",,"433","177","M1",,,,"1730","JK8",,"e9*2007/46*0092*28","M1JU11X","5AAPZNAB4DV","0","0.07","252","Ja","Nee",,"Nee","2630","0","0.00","2024","Onlogisch","04","Nee","2025-11-07T00:00:00.000","2024-05-13T00:00:00.000","2019-11-07T00:00:00.000","2019-11-07T00:00:00.000",,,,,,,,,,,"166",,,,,,,,,,,,,,,,,"https://opendata.rdw.nl/resource/3huj-srit.json","https://opendata.rdw.nl/resource/8ys7-d773.json","https://opendata.rdw.nl/resource/vezc-m2t6.json","https://opendata.rdw.nl/resource/jhie-znh9.json","https://opendata.rdw.nl/resource/kmfi-hrps.json"
"G971XN","Personenauto","FORD","ECOSPORT",,,"3329","hatchback","5","WIT","ZWART","3","998","1291","1770","1391","695","1100","20190509","20200424","Geen verstrekking in Open Data","32579","Nee","180",,,,,,"4","4","0","0",,"0","177","M1",,,,"1770","JK8",,"e9*2007/46*0092*26","M1JU11X","5CBPZNABZDE","0","0.07","252","Ja","Nee",,"Nee","2870","0","0.00","2023","Geen oordeel","05","Nee",,,"2019-05-09T00:00:00.000","2020-04-24T00:00:00.000",,,,,,,,,,,,,,,,,,,,,,,,,,,,"https://opendata.rdw.nl/resource/3huj-srit.json","https://opendata.rdw.nl/resource/8ys7-d773.json","https://opendata.rdw.nl/resource/vezc-m2t6.json","https://opendata.rdw.nl/resource/jhie-znh9.json","https://opendata.rdw.nl/resource/kmfi-hrps.json"
"GT662F","Personenauto","FORD","ECOSPORT","20240612","20210611","4279","hatchback","5","ZWART","Niet geregistreerd","3","998","1250","1715","1350","675","750","20150813","20150813","Geen verstrekking in Open Data","22790","Nee",,,,,,,"4","4","0","0",,"427","0","M1",,,"r. bodemplaat onder voorzitting","1715","JK8",,"e9*2007/46*0092*05","M1JC1B","5AABMS","0","0.07","252","Ja","Nee",,"Nee","2465","0",,"2024","Logisch","00","Nee","2024-06-12T00:00:00.000","2021-06-11T00:00:00.000","2015-08-13T00:00:00.000","2015-08-13T00:00:00.000",,,,,,,,,,,,,,,,,,,,,"B",,,,,,,"https://opendata.rdw.nl/resource/3huj-srit.json","https://opendata.rdw.nl/resource/8ys7-d773.json","https://opendata.rdw.nl/resource/vezc-m2t6.json","https://opendata.rdw.nl/resource/jhie-znh9.json","https://opendata.rdw.nl/resource/kmfi-hrps.json"
"GV891T","Personenauto","FORD","ECOSPORT","20231201",,"4279","hatchback","5","BLAUW","Niet geregistreerd","3","998","1250","1715","1350","675","750","20150831","20150831","Geen verstrekking in Open Data","23190","Nee",,,,,,,"4","4","0","0",,"427","0","M1",,,"r. bodemplaat onder voorzitting","1715","JK8",,"e9*2007/46*0092*08","M1JJ1B","5AABMS","0","0.07","252","Ja","Nee",,"Nee","2465","0",,"2023","Logisch","00","Nee","2023-12-01T00:00:00.000",,"2015-08-31T00:00:00.000","2015-08-31T00:00:00.000",,,,,,,,,,,,,,,,,,,,,"B",,,,,,,"https://opendata.rdw.nl/resource/3huj-srit.json","https://opendata.rdw.nl/resource/8ys7-d773.json","https://opendata.rdw.nl/resource/vezc-m2t6.json","https://opendata.rdw.nl/resource/jhie-znh9.json","https://opendata.rdw.nl/resource/kmfi-hrps.json"
"H706XP","Personenauto","FORD","ECOSPORT","20240907",,"2223","hatchback","5","GRIJS","Niet geregistreerd","3","998","1249","1730","1349","670","900","20180907","20200710","Geen verstrekking in Open Data","26851","Nee","180",,,,,,"4","4","0","0",,"0","177","M1",,,"r. bodemplaat by voorzitting","1730","JK8",,"e9*2007/46*0092*22","M1JU11X","5AAPZNAB4SV","0","0.07","252","Ja","Nee",,"Nee","2630","0","0.00","2023","Geen oordeel","05","Nee","2024-09-07T00:00:00.000",,"2018-09-07T00:00:00.000","2020-07-10T00:00:00.000",,,,,,,,,,,,,,,,,,,,,,,,,,,,"https://opendata.rdw.nl/resource/3huj-srit.json","https://opendata.rdw.nl/resource/8ys7-d773.json","https://opendata.rdw.nl/resource/vezc-m2t6.json","https://opendata.rdw.nl/resource/jhie-znh9.json","https://opendata.rdw.nl/resource/kmfi-hrps.json"
"HB911K","Personenauto","FORD","ECOSPORT","20240929",,"4279","hatchback","5","ZWART","Niet geregistreerd","3","998","1250","1715","1350","675","750","20150929","20150929","Geen verstrekking in Open Data","22790","Nee",,,,,,,"4","4","0","0",,"427","0","M1",,,"r. bodemplaat onder voorzitting","1715","JK8",,"e9*2007/46*0092*08","M1JJ1B","5AABMS","0","0.07","252","Ja","Nee",,"Nee","2465","0",,"2023","Logisch","00","Nee","2024-09-29T00:00:00.000",,"2015-09-29T00:00:00.000","2015-09-29T00:00:00.000",,,,,,,,,,,,,,,,,,,,,"B",,,,,,,"https://opendata.rdw.nl/resource/3huj-srit.json","https://opendata.rdw.nl/resource/8ys7-d773.json","https://opendata.rdw.nl/resource/vezc-m2t6.json","https://opendata.rdw.nl/resource/jhie-znh9.json","https://opendata.rdw.nl/resource/kmfi-hrps.json"
"HX044K","Personenauto","FORD","ECOSPORT","20240313",,"4279","hatchback","5","WIT","Niet geregistreerd","3","998","1237","1730","1337","665","750","20160129","20160129","Geen verstrekking in Open Data","22390","Nee",,,,,,,"4","4","0","0",,"0","0","M1",,,"in bodemplaat r. v.","1730","JK8",,"e9*2007/46*0092*09","M1JJ1B","5AABMV","0","0.07","252","Ja","Nee",,"Nee","2480","0",,"2022","Logisch","00","Nee","2024-03-13T00:00:00.000",,"2016-01-29T00:00:00.000","2016-01-29T00:00:00.000",,,,,,,,,,,,,,,,,,,,,"D",,,,,,,"https://opendata.rdw.nl/resource/3huj-srit.json","https://opendata.rdw.nl/resource/8ys7-d773.json","https://opendata.rdw.nl/resource/vezc-m2t6.json","https://opendata.rdw.nl/resource/jhie-znh9.json","https://opendata.rdw.nl/resource/kmfi-hrps.json"
"J838RZ","Personenauto","FORD","ECOSPORT","20241027","20240127","92","hatchback","5","BLAUW","Niet geregistreerd","3","998","1237","1730","1337","668","750","20151124","20201028","Geen verstrekking in Open Data","22494","Ja","180",,,,,,"4","4","0","0",,"0","177","M1",,,,"1730","JK8",,"e9*2007/46*0092*09","M1JJ1B","5AABMV","0","0.07","252","Ja","Nee",,"Nee","2480","0",,"2024","Geen oordeel","05","Nee","2024-10-27T00:00:00.000","2024-01-27T00:00:00.000","2015-11-24T00:00:00.000","2020-10-28T00:00:00.000",,,,,,,,,,,,,,,,,,,,,"C",,,,,,,"https://opendata.rdw.nl/resource/3huj-srit.json","https://opendata.rdw.nl/resource/8ys7-d773.json","https://opendata.rdw.nl/resource/vezc-m2t6.json","https://opendata.rdw.nl/resource/jhie-znh9.json","https://opendata.rdw.nl/resource/kmfi-hrps.json"
"K259VH","Personenauto","FORD","ECOSPORT",,,"5390","hatchback","5","WIT","Niet geregistreerd","3","998","1259","1730","1359","675","900","20210325","20210325","Geen verstrekking in Open Data","29520","Nee","180",,,,,,"4","4","0","0",,"433","179","M1",,,,"1730","JK8",,"e9*2007/46*0092*32","M1JU11X","5AAPBNAPMDV","0","0.07","252","Ja","Nee",,"Nee","2630","0","0.00","2023","Logisch","00","Nee",,,"2021-03-25T00:00:00.000","2021-03-25T00:00:00.000",,,,,,,,,,,"166",,,,,,,,,,"C",,,,,,,"https://opendata.rdw.nl/resource/3huj-srit.json","https://opendata.rdw.nl/resource/8ys7-d773.json","https://opendata.rdw.nl/resource/vezc-m2t6.json","https://opendata.rdw.nl/resource/jhie-znh9.json","https://opendata.rdw.nl/resource/kmfi-hrps.json"
"K328TJ","Personenauto","FORD","ECOSPORT","20230322",,"4278","hatchback","5","ZWART","Niet geregistreerd","3","998","1250","1715","1350","675","750","20150213","20210306","Geen verstrekking in Open Data","21694","Nee","180",,,,,,"4","4","0","0",,"427","177","M1",,,,"1715","JK8",,"e9*2007/46*0092*07","M1JC1B","5AABMS","0","0.07","252","Ja","Nee",,"Nee","2465","0",,"2023","Geen oordeel","05","Nee","2023-03-22T00:00:00.000",,"2015-02-13T00:00:00.000","2021-03-06T00:00:00.000",,,,,,,,,,,,,,,,,,,,,"B",,,,,,,"https://opendata.rdw.nl/resource/3huj-srit.json","https://opendata.rdw.nl/resource/8ys7-d773.json","https://opendata.rdw.nl/resource/vezc-m2t6.json","https://opendata.rdw.nl/resource/jhie-znh9.json","https://opendata.rdw.nl/resource/kmfi-hrps.json"
"K829SH","Personenauto","FORD","ECOSPORT",,,"4862","hatchback","5","GRIJS","Niet geregistreerd","3","998","1259","1730","1359","675","900","20210225","20210225","Geen verstrekking in Open Data","23607","Nee","170",,,,,,"4","4","0","0",,"433","177","M1",,,,"1730","JK8",,"e9*2007/46*0092*29","SFJL11X","5AAPANAPLDV","0","0.05","252","Ja","Nee",,"Nee","2630","0","0.00","2024","Logisch","00","Nee",,,"2021-02-25T00:00:00.000","2021-02-25T00:00:00.000",,,,,,,,,,,"166",,,,,,,,,,"B",,,,,,,"https://opendata.rdw.nl/resource/3huj-srit.json","https://opendata.rdw.nl/resource/8ys7-d773.json","https://opendata.rdw.nl/resource/vezc-m2t6.json","https://opendata.rdw.nl/resource/jhie-znh9.json","https://opendata.rdw.nl/resource/kmfi-hrps.json"
"KD170V","Personenauto","FORD","ECOSPORT","20240622",,"1865","hatchback","5","ORANJE","Niet geregistreerd","4","1498","1250","1740","1350","400","400","20151112","20161025","Geen verstrekking in Open Data","26446","Nee",,,,,,,"4","4","0","0",,"0","0","M1",,,"r. bodemplaat onder voorzitting","1740","JK8",,"e9*2007/46*0092*09","UEJE1B","5GNBMX","0","0.06","252","Ja","Nee",,"Nee","2140","0",,"2024","Geen oordeel","05","Nee","2024-06-22T00:00:00.000",,"2015-11-12T00:00:00.000","2016-10-25T00:00:00.000",,,,,,,,,,,,,,,,,,,,,"E",,,,,,,"https://opendata.rdw.nl/resource/3huj-srit.json","https://opendata.rdw.nl/resource/8ys7-d773.json","https://opendata.rdw.nl/resource/vezc-m2t6.json","https://opendata.rdw.nl/resource/jhie-znh9.json","https://opendata.rdw.nl/resource/kmfi-hrps.json"
"KF885L","Personenauto","FORD","ECOSPORT","20230825",,"7776","hatchback","5","ORANJE","Niet geregistreerd","4","1499","1272","1760","1372",,,"20160823","20160823","Geen verstrekking in Open Data","29559","Nee",,,,,,,"4","4",,,,,,"M1",,,"in bodemplaat r. v.","1760","JK8",,"e9*2007/46*0092*14","XVJD1B","5AHBMR","0","0.05","252","Ja","Nee",,"Nee",,,,"2022","Logisch","00","Nee","2023-08-25T00:00:00.000",,"2016-08-23T00:00:00.000","2016-08-23T00:00:00.000",,,,,,,,,,,,,,,,,,,,,"F",,,,,,,"https://opendata.rdw.nl/resource/3huj-srit.json","https://opendata.rdw.nl/resource/8ys7-d773.json","https://opendata.rdw.nl/resource/vezc-m2t6.json","https://opendata.rdw.nl/resource/jhie-znh9.json","https://opendata.rdw.nl/resource/kmfi-hrps.json"
"KG403D","Personenauto","FORD","ECOSPORT","20240826","20240116","4868","hatchback","5","GEEL","Niet geregistreerd","3","998","1238","1725","1338",,,"20160826","20160826","Geen verstrekking in Open Data","24480","Ja",,,,,,,"4","4",,,,"427","177","M1",,,"in bodemplaat r. v.","1725","JK8",,"e9*2007/46*0092*14","M1JJ1B","5AABMK","0","0.07","252","Ja","Nee",,"Nee",,,,"2024","Logisch","00","Nee","2024-08-26T00:00:00.000","2024-01-16T00:00:00.000","2016-08-26T00:00:00.000","2016-08-26T00:00:00.000",,,,,,,,,,,"164",,,,,,,,,,"D",,,,,,,"https://opendata.rdw.nl/resource/3huj-srit.json","https://opendata.rdw.nl/resource/8ys7-d773.json","https://opendata.rdw.nl/resource/vezc-m2t6.json","https://opendata.rdw.nl/resource/jhie-znh9.json","https://opendata.rdw.nl/resource/kmfi-hrps.json"
"KJ380B","Personenauto","FORD","ECOSPORT","20240921",,"7844","hatchback","5","BLAUW","Niet geregistreerd","4","1498","1250","1740","1350",,,"20160920","20160920","Geen verstrekking in Open Data","28046","Nee",,,,,,,"4","4",,,,"427","177","M1",,,"in bodemplaat r. v.","1740","JK8",,"e9*2007/46*0092*15","UEJE1B","5GNBMX","0","0.06","252","Ja","Nee",,"Nee",,,,"2023","Logisch","00","Nee","2024-09-21T00:00:00.000",,"2016-09-20T00:00:00.000","2016-09-20T00:00:00.000",,,,,,,,,,,"164",,,,,,,,,,"F",,,,,,,"https://opendata.rdw.nl/resource/3huj-srit.json","https://opendata.rdw.nl/resource/8ys7-d773.json","https://opendata.rdw.nl/resource/vezc-m2t6.json","https://opendata.rdw.nl/resource/jhie-znh9.json","https://opendata.rdw.nl/resource/kmfi-hrps.json"
"KK433Z","Personenauto","FORD","ECOSPORT","20240930",,"4868","hatchback","5","WIT","Niet geregistreerd","3","998","1238","1725","1338",,,"20160930","20160930","Geen verstrekking in Open Data","24480","Nee",,,,,,,"4","4",,,,"427","177","M1",,,"in bodemplaat r. v.","1725","JK8",,"e9*2007/46*0092*14","M1JJ1B","5AABMK","0","0.07","252","Ja","Nee",,"Nee",,,,"2023","Logisch","00","Nee","2024-09-30T00:00:00.000",,"2016-09-30T00:00:00.000","2016-09-30T00:00:00.000",,,,,,,,,,,"164",,,,,,,,,,"D",,,,,,,"https://opendata.rdw.nl/resource/3huj-srit.json","https://opendata.rdw.nl/resource/8ys7-d773.json","https://opendata.rdw.nl/resource/vezc-m2t6.json","https://opendata.rdw.nl/resource/jhie-znh9.json","https://opendata.rdw.nl/resource/kmfi-hrps.json"
"KN557L","Personenauto","FORD","ECOSPORT","20241021",,"4868","hatchback","5","GRIJS","Niet geregistreerd","3","998","1237","1730","1337",,,"20161021","20161021","Geen verstrekking in Open Data","22990","Nee",,,,,,,"4","4","0","0",,"427","177","M1",,,"in bodemplaat r. v.","1730","JK8",,"e9*2007/46*0092*16","M1JJ1B","5AABMV","0","0.07","252","Ja","Nee",,"Nee","0","0","0.00","2023","Niet geregistreerd","NG","Nee","2024-10-21T00:00:00.000",,"2016-10-21T00:00:00.000","2016-10-21T00:00:00.000",,,,,,,,,,,"164",,,,,,,,,,"D",,,,,,,"https://opendata.rdw.nl/resource/3huj-srit.json","https://opendata.rdw.nl/resource/8ys7-d773.json","https://opendata.rdw.nl/resource/vezc-m2t6.json","https://opendata.rdw.nl/resource/jhie-znh9.json","https://opendata.rdw.nl/resource/kmfi-hrps.json"
"KP979J","Personenauto","FORD","ECOSPORT","20241031",,"4868","hatchback","5","GRIJS","Niet geregistreerd","3","998","1237","1730","1337",,,"20161031","20161031","Geen verstrekking in Open Data","25136","Nee",,,,,,,"4","4","0","0",,"427","177","M1",,,"in bodemplaat r. v.","1730","JK8",,"e9*2007/46*0092*15","M1JJ1B","5AABMV","0","0.07","252","Ja","Nee",,"Nee","0","0","0.00","2023","Logisch","00","Nee","2024-10-31T00:00:00.000",,"2016-10-31T00:00:00.000","2016-10-31T00:00:00.000",,,,,,,,,,,"164",,,,,,,,,,"D",,,,,,,"https://opendata.rdw.nl/resource/3huj-srit.json","https://opendata.rdw.nl/resource/8ys7-d773.json","https://opendata.rdw.nl/resource/vezc-m2t6.json","https://opendata.rdw.nl/resource/jhie-znh9.json","https://opendata.rdw.nl/resource/kmfi-hrps.json"
"L457HS","Personenauto","FORD","ECOSPORT","20250618",,"4868","hatchback","5","ZWART","Niet geregistreerd","3","998","1237","1730","1337",,,"20160530","20210621","Geen verstrekking in Open Data","23695","Nee","181",,,,,,"4","4","0","0",,"0","177","M1",,,,"1730","JK8",,"e9*2007/46*0092*13","M1JJ1B","5AABMV","0","0.07","252","Ja","Nee",,"Nee","0","0","0.00","2023","Geen oordeel","05","Nee","2025-06-18T00:00:00.000",,"2016-05-30T00:00:00.000","2021-06-21T00:00:00.000",,,,,,,,,,,,,,,,,,,,,,,,,,,,"https://opendata.rdw.nl/resource/3huj-srit.json","https://opendata.rdw.nl/resource/8ys7-d773.json","https://opendata.rdw.nl/resource/vezc-m2t6.json","https://opendata.rdw.nl/resource/jhie-znh9.json","https://opendata.rdw.nl/resource/kmfi-hrps.json"
"L850BB","Personenauto","FORD","ECOSPORT",,,"5390","hatchback","5","GRIJS","Niet geregistreerd","3","998","1259","1730","1359","675","900","20210409","20210409","Geen verstrekking in Open Data","30120","Nee","180",,,,,,"4","4","0","0",,"433","179","M1",,,,"1730","JK8",,"e9*2007/46*0092*32","M1JU11X","5AAPBNAPMDV","0","0.07","252","Ja","Nee",,"Nee","2630","0","0.00","2022","Logisch","00","Nee",,,"2021-04-09T00:00:00.000","2021-04-09T00:00:00.000",,,,,,,,,,,"166",,,,,,,,,,"C",,,,,,,"https://opendata.rdw.nl/resource/3huj-srit.json","https://opendata.rdw.nl/resource/8ys7-d773.json","https://opendata.rdw.nl/resource/vezc-m2t6.json","https://opendata.rdw.nl/resource/jhie-znh9.json","https://opendata.rdw.nl/resource/kmfi-hrps.json"